{"text_format":"1","workbook":"xlsx","n_sheets":16,"sheets":["ProjectInformation","PrintSheets","DE108_23A","DE108_23B","DE108_25","DE108_26A","DE111_01","108_23A","108_23B","108_25","108_26A","111_01","PrintSheetTemplate","Note1","BridgeBlock","Index"],"not_rendered":{"charts":0,"images":10,"macros":1,"external_links":0,"defined_names":8,"comments":1,"pivot_tables":0},"unopened":[],"bounds":{"document_bytes":16777216,"sheet_cells":100000,"rows_first":2000,"rows_last":500,"rows_between":2000,"halvings":0,"cell_chars":16384,"cell_head_chars":4096},"cells_cut":0,"cells_raw":0,"read":"whole","date_system":"1900"}

{"sheet":"ProjectInformation","index":0,"n_rows":11,"n_cols":2,"rows_kept":11,"cut":false,"hidden":false,"merged":[[0,0,0,1],[1,0,1,1],[9,0,9,1],[3,0,4,0]]}
["CPN DATA"]
["INFORMATION ADDED BY DESIGNER"]
["Section Engineer","Flattery"]
["Design Team","Bell"]
[]
["County","BENTON"]
["Project Number","NHSX-030-6(231)--3H-06"]
["English or Metric","ENGLISH"]
["Revised"]
["Bridge Block"]
["File No."]

{"sheet":"PrintSheets","index":1,"n_rows":190,"n_cols":179,"rows_kept":190,"cut":false,"hidden":false,"merged":[[93,171,93,178],[94,1,94,178],[93,101,93,106],[93,107,93,118],[93,119,93,148],[93,149,93,158],[93,159,93,164],[93,165,93,170],[93,1,93,7],[93,8,93,14],[93,15,93,21],[93,22,93,30],[93,31,93,64],[93,65,93,100],[188,159,188,164],[188,165,188,170],[188,171,188,178],[189,1,189,178],[188,65,188,100],[188,101,188,106],[188,107,188,118],[188,119,188,148],[188,149,188,158],[188,1,188,7],[188,8,188,14],[188,15,188,21],[188,22,188,30],[188,31,188,64]]}
[" "]
[]
[]
[]
[]
[]
[]
[]
[]
[]
[]
[]
[]
[]
[]
[]
[]
[]
[]
[]
[]
[]
[]
[]
[]
[]
[]
[]
[]
[]
[]
[]
[]
[]
[]
[]
[]
[]
[]
[]
[]
[]
[]
[]
[]
[]
[]
[]
[]
[]
[]
[]
[]
[]
[]
[]
[]
[]
[]
[]
[]
[]
[]
[]
[]
[]
[]
[]
[]
[]
[]
[]
[]
[]
[]
[]
[]
[]
[]
[]
[]
[]
[]
[]
[]
[]
[]
[]
[]
[]
[]
[]
[null,"","","","","","","","","","","","","","","","","","","","","","","","","","","","","","","","","","","","","","","","","","","","","","","","","","","","","","","","","","","","","","","","","","","","","","","","","","","","","","","","","","","","","","","","","","","","","","","","","","","","","","","","","","","","","","","","","","","","","","","","","","","","","","","","","","","","","","","","","","","","","","","","","","","","","","","",null,"","","","","","","","","","","","","","","","","","","","","","","","","",""]
[null,"FILE NO.",null,null,null,null,null,null,{"$f":"IF(ProjectInformation!$B$11<>\"\",ProjectInformation!$B$11,\"\")","v":""},null,null,null,null,null,null,{"$f":"UPPER(ProjectInformation!B8)","v":"ENGLISH"},null,null,null,null,null,null,"DESIGN TEAM",null,null,null,null,null,null,null,null,{"$f":"IF(AND(ProjectInformation!$B$3<>\"\",ProjectInformation!$B$4<>\"\",ProjectInformation!$B$5<>\"\"),ProjectInformation!$B$3&\"\\\"&ProjectInformation!$B$4&\"\\\"&ProjectInformation!$B$5,IF(AND(ProjectInformation!$B$3<>\"\",ProjectInformation!$B$4<>\"\"),ProjectInformation!$B$3&\"\\\"&ProjectInformation!$B$4,IF(ProjectInformation!$B$3<>\"\",ProjectInformation!$B$3,\"\")))","v":"Flattery\\Bell"},null,null,null,null,null,null,null,null,null,null,null,null,null,null,null,null,null,null,null,null,null,null,null,null,null,null,null,null,null,null,null,null,null,{"$f":"IF(ProjectInformation!$B$6<>\"\",ProjectInformation!$B$6,\"\")","v":"BENTON"},null,null,null,null,null,null,null,null,null,null,null,null,null,null,null,null,null,null,null,null,null,null,null,null,null,null,null,null,null,null,null,null,null,null,null,"COUNTY",null,null,null,null,null,"PROJECT NUMBER",null,null,null,null,null,null,null,null,null,null,null,{"$f":"IF(ProjectInformation!$B$7<>\"\",ProjectInformation!$B$7,\"\")","v":"NHSX-030-6(231)--3H-06"},null,null,null,null,null,null,null,null,null,null,null,null,null,null,null,null,null,null,null,null,null,null,null,null,null,null,null,null,null,"SHEET NUMBER",null,null,null,null,null,null,null,null,null,"J.1",null,null,null,null,null,{"$f":"IF(FP94<>\"\",\"REVISED\",\"\")","v":""},null,null,null,null,null,{"$f":"IF(ProjectInformation!$B$9<>\"\",ProjectInformation!$B$9,\"\")","v":""}]
["","11/27/2017     9:25:40 AM     kbell     c:\\pw_work\\pwmain\\kbell\\d0797678\\06030231J01.xlsm"]
[" "]
[]
[]
[]
[]
[]
[]
[]
[]
[]
[]
[]
[]
[]
[]
[]
[]
[]
[]
[]
[]
[]
[]
[]
[]
[]
[]
[]
[]
[]
[]
[]
[]
[]
[]
[]
[]
[]
[]
[]
[]
[]
[]
[]
[]
[]
[]
[]
[]
[]
[]
[]
[]
[]
[]
[]
[]
[]
[]
[]
[]
[]
[]
[]
[]
[]
[]
[]
[]
[]
[]
[]
[]
[]
[]
[]
[]
[]
[]
[]
[]
[]
[]
[]
[]
[]
[]
[]
[]
[]
[]
[]
[null,"","","","","","","","","","","","","","","","","","","","","","","","","","","","","","","","","","","","","","","","","","","","","","","","","","","","","","","","","","","","","","","","","","","","","","","","","","","","","","","","","","","","","","","","","","","","","","","","","","","","","","","","","","","","","","","","","","","","","","","","","","","","","","","","","","","","","","","","","","","","","","","","","","","","","","","",null,"","","","","","","","","","","","","","","","","","","","","","","","","",""]
[null,"FILE NO.",null,null,null,null,null,null,{"$f":"IF(ProjectInformation!$B$11<>\"\",ProjectInformation!$B$11,\"\")","v":""},null,null,null,null,null,null,{"$f":"UPPER(ProjectInformation!B8)","v":"ENGLISH"},null,null,null,null,null,null,"DESIGN TEAM",null,null,null,null,null,null,null,null,{"$f":"IF(AND(ProjectInformation!$B$3<>\"\",ProjectInformation!$B$4<>\"\",ProjectInformation!$B$5<>\"\"),ProjectInformation!$B$3&\"\\\"&ProjectInformation!$B$4&\"\\\"&ProjectInformation!$B$5,IF(AND(ProjectInformation!$B$3<>\"\",ProjectInformation!$B$4<>\"\"),ProjectInformation!$B$3&\"\\\"&ProjectInformation!$B$4,IF(ProjectInformation!$B$3<>\"\",ProjectInformation!$B$3,\"\")))","v":"Flattery\\Bell"},null,null,null,null,null,null,null,null,null,null,null,null,null,null,null,null,null,null,null,null,null,null,null,null,null,null,null,null,null,null,null,null,null,{"$f":"IF(ProjectInformation!$B$6<>\"\",ProjectInformation!$B$6,\"\")","v":"BENTON"},null,null,null,null,null,null,null,null,null,null,null,null,null,null,null,null,null,null,null,null,null,null,null,null,null,null,null,null,null,null,null,null,null,null,null,"COUNTY",null,null,null,null,null,"PROJECT NUMBER",null,null,null,null,null,null,null,null,null,null,null,{"$f":"IF(ProjectInformation!$B$7<>\"\",ProjectInformation!$B$7,\"\")","v":"NHSX-030-6(231)--3H-06"},null,null,null,null,null,null,null,null,null,null,null,null,null,null,null,null,null,null,null,null,null,null,null,null,null,null,null,null,null,"SHEET NUMBER",null,null,null,null,null,null,null,null,null,{"$f":"IF($FD$94<>\"\",\"J.\"& MID(OFFSET($FD$189,-95,0),3,LEN(OFFSET($FD$189,-95,0))-2)+1,\"\")","v":"J.2"},null,null,null,null,null,{"$f":"IF(FP189<>\"\",\"REVISED\",\"\")","v":""},null,null,null,null,null,{"$f":"IF(ProjectInformation!$B$9<>\"\",ProjectInformation!$B$9,\"\")","v":""}]
["","11/27/2017     9:25:40 AM     kbell     c:\\pw_work\\pwmain\\kbell\\d0797678\\06030231J01.xlsm"]

{"sheet":"DE108_23A","index":2,"n_rows":24,"n_cols":5,"rows_kept":24,"cut":false,"hidden":false,"merged":[[14,2,15,2],[16,4,17,4]]}
["TabTitle",{"$f":"C15","v":"TRAFFIC CONTROL PLAN"}]
["Number of Tab Columns",1]
["DE Starter Row Number",18]
["TabSheet Starter Row Number",5]
["TabSheet Header Row Count",4]
["Top Header Cell","E15"]
["Bottom Header Cell","E18"]
["DESheet Row Count",7]
["Fixed Empty Rows",40]
["Usable Empty Rows",0]
["Total Rows Placed",47,"xlLeft(1)",null,{"$f":"IF(C11<>\"\",C11,\"\")","v":"xlLeft(1)"}]
["Total Rows Needed",{"$f":"SUM(B8:B10)","v":47},"General",null,{"$f":"IF(C12<>\"\",C12,\"\")","v":"General"}]
["Last Tab DE Starter Row",18,{"$f":"CELL(\"width\",C13)","v":159},null,{"$f":"CELL(\"width\",E13)","v":0}]
["Last Tab Tabsheet Starter Row",5,"A",null,"a"]
["Last Copy Starter Row",1,"TRAFFIC CONTROL PLAN",null,"108-23A"]
["Tab Loop Number",2,null,null,{"$f":"B17","v":"2008-08-01"}]
["Revision Date","2008-08-01",{"$f":"\"This Data Entry Sheet fills Tab \"&E15&\" effective \"&TEXT(B17,\"mm-dd-yy\")","v":"This Data Entry Sheet fills Tab 108-23A effective 08-01-08"},null,{"$f":"C15","v":"TRAFFIC CONTROL PLAN"}]
["Tabulation Width",2,"1. Traffic on U.S. Highway 30 shall be maintained at all times except as noted in Note 3"]
["Horizontal Grid Lines","No"]
[null,null,"2. Traffic on U.S. Highway 218 shall be maintained at all times via off-site detour"]
[]
[null,null,"3. Temporary nighttime road closures (TC-251/TC-451) will only be allowed for setting beams and overhead signs/trusses"]
[]
[null,null,"4. Detour and detour signing shall be furnished, maintained, and removed by the Contractor"]

{"sheet":"DE108_23B","index":3,"n_rows":28,"n_cols":101,"rows_kept":28,"cut":false,"hidden":false,"merged":[[14,52,14,100],[15,52,15,100],[16,2,16,9],[16,10,16,50],[16,52,16,70],[16,71,17,100],[17,2,17,50],[17,52,17,59],[17,60,17,70],[18,2,18,50],[19,3,19,26],[19,28,19,50],[28,2,28,50],[14,2,15,20],[14,21,15,50]]}
["TabTitle",{"$f":"V15","v":"TRAFFIC CONTROL CLOSURE TABLE(S)"}]
["Number of Tab Columns",49]
["DE Starter Row Number",19]
["TabSheet Starter Row Number",5]
["TabSheet Header Row Count",4]
["Top Header Cell","BA15"]
["Bottom Header Cell","CW18"]
["DESheet Row Count",10]
["Fixed Empty Rows",1]
["Usable Empty Rows",0]
["Total Rows Placed",11,"xlLeft","xlLeft","xlLeft","xlLeft","xlLeft","xlLeft","xlLeft","xlLeft","xlLeft","xlLeft","xlLeft","xlLeft","xlLeft","xlLeft","xlLeft","xlLeft","xlLeft","xlLeft","xlLeft","xlLeft","xlLeft","xlLeft","xlLeft","xlLeft","xlLeft","xlLeft","xlLeft","xlLeft","xlLeft","xlLeft","xlLeft","xlLeft","xlLeft","xlLeft","xlLeft","xlLeft","xlLeft","xlLeft","xlLeft","xlLeft","xlLeft","xlLeft","xlLeft","xlLeft","xlLeft","xlLeft","xlLeft","xlLeft","xlLeft",null,{"$f":"IF(C11<>\"\",C11,\"\")","v":"xlLeft"},{"$f":"IF(D11<>\"\",D11,\"\")","v":"xlLeft"},"xlLeft","xlLeft","xlLeft","xlLeft","xlLeft","xlLeft","xlLeft","xlLeft","xlLeft","xlLeft","xlLeft","xlLeft","xlLeft","xlLeft","xlLeft",{"$f":"IF(T11<>\"\",T11,\"\")","v":"xlLeft"},"xlLeft","xlLeft","xlLeft","xlLeft","xlLeft","xlLeft","xlLeft","xlLeft","xlLeft","xlLeft","xlLeft","xlLeft","xlLeft","xlLeft","xlLeft",{"$f":"IF(AJ11<>\"\",AJ11,\"\")","v":"xlLeft"},"xlLeft","xlLeft","xlLeft","xlLeft","xlLeft","xlLeft","xlLeft","xlLeft","xlLeft","xlLeft","xlLeft","xlLeft","xlLeft","xlLeft","xlLeft"]
["Total Rows Needed",{"$f":"SUM(B8:B10)","v":11},"General","h:mm","h:mm","h:mm","h:mm","h:mm","h:mm","h:mm","h:mm","h:mm","h:mm","h:mm","h:mm","h:mm","h:mm","h:mm","h:mm","h:mm","h:mm","h:mm","h:mm","h:mm","h:mm","h:mm","h:mm","h:mm","h:mm","h:mm","h:mm","h:mm","h:mm","h:mm","h:mm","h:mm","h:mm","h:mm","h:mm","h:mm","h:mm","h:mm","h:mm","h:mm","h:mm","h:mm","h:mm","h:mm","h:mm","h:mm","h:mm",null,{"$f":"IF(C12<>\"\",C12,\"\")","v":"General"},"h:mm","h:mm","h:mm","h:mm","h:mm","h:mm","h:mm","h:mm","h:mm","h:mm","h:mm","h:mm","h:mm","h:mm","h:mm","h:mm","h:mm","h:mm","h:mm","h:mm","h:mm","h:mm","h:mm","h:mm","h:mm","h:mm","h:mm","h:mm","h:mm","h:mm","h:mm","h:mm","h:mm","h:mm","h:mm","h:mm","h:mm","h:mm","h:mm","h:mm","h:mm","h:mm","h:mm","h:mm","h:mm","h:mm","h:mm","h:mm"]
["Last Tab DE Starter Row",19,{"$f":"CELL(\"width\",C13)","v":6},{"$f":"CELL(\"width\",D13)","v":6},6,5,5,5,5,5,5,5,5,5,5,5,5,5,5,5,5,5,5,6,6,6,6,6,6,5,5,5,5,5,5,5,5,5,5,5,5,5,5,5,5,5,5,6,6,6,6,null,{"$f":"CELL(\"width\",BA13)","v":0},{"$f":"CELL(\"width\",BB13)","v":0},0,0,0,0,0,0,0,0,0,0,0,0,0,0,0,0,0,0,0,0,0,0,0,0,0,0,0,0,0,0,0,0,0,0,0,0,0,0,0,0,0,0,0,0,0,0,0]
["Last Tab Tabsheet Starter Row",5,"A","B","C","D","E","F","G","H","I","J","K","L","M","N","O","P","Q","R","S","T","U","V","W","X","Y","Z","AA","AB","AC","AD","AE","AF","AG","AH","AI","AJ","AK","AL","AM","AN","AO","AP","AQ","AR","AS","AT","AU","AV","AW",null,{"$f":"LOWER(C14)","v":"a"},{"$f":"LOWER(D14)","v":"b"},"c","d","e","f","g","h","i","j","k","l","m","n","o","p","q","r","s","t","u","v","w","x","y","z","aa","ab","ac","ad","ae","af","ag","ah","ai","aj","ak","al","am","an","ao","ap","aq","ar","as","at","au","av","aw"]
["Last Copy Starter Row",1,"* This is to only be used in conjunction with Tabulation 108-23A",null,null,null,null,null,null,null,null,null,null,null,null,null,null,null,null,null,null,"TRAFFIC CONTROL CLOSURE TABLE(S)",null,null,null,null,null,null,null,null,null,null,null,null,null,null,null,null,null,null,null,null,null,null,null,null,null,null,null,null,null,null,"108-23B"]
["Tab Loop Number",2,null,null,null,null,null,null,null,null,null,null,null,null,null,null,null,null,null,null,null,null,null,null,null,null,null,null,null,null,null,null,null,null,null,null,null,null,null,null,null,null,null,null,null,null,null,null,null,null,null,null,{"$f":"B17","v":"2015-04-21"}]
["Revision Date","2015-04-21","Shaded area indicates non-working times",null,null,null,null,null,null,null,null,null,null,null,null,null,null,null,null,null,null,null,null,null,null,null,null,null,null,null,null,null,null,null,null,null,null,null,null,null,null,null,null,null,null,null,null,null,null,null,null,null,{"$f":"C15","v":"* This is to only be used in conjunction with Tabulation 108-23A"},null,null,null,null,null,null,null,null,null,null,null,null,null,null,null,null,null,null,{"$f":"V15","v":"TRAFFIC CONTROL CLOSURE TABLE(S)"}]
["Tabulation Width",2,{"$f":"\"This Data Entry Sheet fills Tab \"&F15&\" effective \"&TEXT(B17,\"mm-dd-yy\")","v":"This Data Entry Sheet fills Tab  effective 04-21-15"},null,null,null,null,null,null,null,null,null,null,null,null,null,null,null,null,null,null,null,null,null,null,null,null,null,null,null,null,null,null,null,null,null,null,null,null,null,null,null,null,null,null,null,null,null,null,null,null,12,{"$f":"C17","v":"Shaded area indicates non-working times"}]
["Horizontal Grid Lines","Yes",null,null,null,null,null,null,null,null,null,null,null,null,null,null,null,null,null,null,null,null,null,null,null,null,null,null,null,null,null,null,null,null,null,null,null,null,null,null,null,null,null,null,null,null,null,null,null,null,null,12]
[null,null,null,"AM",null,null,null,null,null,null,null,null,null,null,null,null,null,null,null,null,null,null,null,null,null,null,null,"Noon","PM"]
[null,null,null,{"$f":"TIME(12,0,)","v":"12:00:00"},{"$f":"TIME(12,30,)","v":"12:30:00"},{"$f":"TIME(1,0,)","v":"01:00:00"},{"$f":"TIME(1,30,)","v":"01:30:00"},{"$f":"TIME(2,0,)","v":"02:00:00"},{"$f":"TIME(2,30,)","v":"02:30:00"},{"$f":"TIME(3,0,)","v":"03:00:00"},{"$f":"TIME(3,30,)","v":"03:30:00"},{"$f":"TIME(4,0,)","v":"04:00:00"},{"$f":"TIME(4,30,)","v":"04:30:00"},{"$f":"TIME(5,0,)","v":"05:00:00"},{"$f":"TIME(5,30,)","v":"05:30:00"},{"$f":"TIME(6,0,)","v":"06:00:00"},{"$f":"TIME(6,30,)","v":"06:30:00"},{"$f":"TIME(7,0,)","v":"07:00:00"},{"$f":"TIME(7,30,)","v":"07:30:00"},{"$f":"TIME(8,0,)","v":"08:00:00"},{"$f":"TIME(8,30,)","v":"08:30:00"},{"$f":"TIME(9,0,)","v":"09:00:00"},{"$f":"TIME(9,30,)","v":"09:30:00"},{"$f":"TIME(10,0,)","v":"10:00:00"},{"$f":"TIME(10,30,)","v":"10:30:00"},{"$f":"TIME(11,0,)","v":"11:00:00"},{"$f":"TIME(11,30,)","v":"11:30:00"},{"$f":"TIME(12,0,)","v":"12:00:00"},{"$f":"TIME(12,30,)","v":"12:30:00"},{"$f":"TIME(1,0,)","v":"01:00:00"},{"$f":"TIME(1,30,)","v":"01:30:00"},{"$f":"TIME(2,0,)","v":"02:00:00"},{"$f":"TIME(2,30,)","v":"02:30:00"},{"$f":"TIME(3,0,)","v":"03:00:00"},{"$f":"TIME(3,30,)","v":"03:30:00"},{"$f":"TIME(4,0,)","v":"04:00:00"},{"$f":"TIME(4,30,)","v":"04:30:00"},{"$f":"TIME(5,0,)","v":"05:00:00"},{"$f":"TIME(5,30,)","v":"05:30:00"},{"$f":"TIME(6,0,)","v":"06:00:00"},{"$f":"TIME(6,30,)","v":"06:30:00"},{"$f":"TIME(7,0,)","v":"07:00:00"},{"$f":"TIME(7,30,)","v":"07:30:00"},{"$f":"TIME(8,0,)","v":"08:00:00"},{"$f":"TIME(8,30,)","v":"08:30:00"},{"$f":"TIME(9,0,)","v":"09:00:00"},{"$f":"TIME(9,30,)","v":"09:30:00"},{"$f":"TIME(10,0,)","v":"10:00:00"},{"$f":"TIME(10,30,)","v":"10:30:00"},{"$f":"TIME(11,0,)","v":"11:00:00"},{"$f":"TIME(11,30,)","v":"11:30:00"}]
[null,null,"SUN"]
[null,null,"MON"]
[null,null,"TUE"]
[null,null,"WED"]
[null,null,"THU"]
[null,null,"FRI"]
[null,null,"SAT"]

{"sheet":"DE108_25","index":4,"n_rows":6000,"n_cols":31,"rows_kept":6000,"cut":false,"hidden":false,"merged":[[14,2,16,14],[14,16,14,28],[15,16,15,28],[16,16,18,28],[17,2,17,14],[18,2,21,2],[18,3,21,3],[18,4,21,4],[18,5,21,5],[18,6,21,6],[19,19,22,19],[18,7,21,7],[18,8,21,8],[18,9,21,9],[18,10,21,10],[18,11,21,11],[18,12,21,12],[18,13,21,13],[18,14,21,14],[19,16,22,16],[19,17,22,17],[19,18,22,18],[19,26,22,26],[19,27,22,27],[19,28,22,28],[19,20,22,20],[19,21,22,21],[19,22,22,22],[19,23,22,23],[19,24,22,24],[19,25,22,25]]}
["TabTitle",{"$f":"C15","v":"511 TRAVEL RESTRICTIONS"}]
["Number of Tab Columns",13]
["DE Starter Row Number",23]
["TabSheet Starter Row Number",10]
["TabSheet Header Row Count",9]
["Top Header Cell","Q15"]
["Bottom Header Cell","AC23"]
["DESheet Row Count",2]
["Fixed Empty Rows",0]
["Usable Empty Rows",20]
["Total Rows Placed",21,"xlCenter","xlCenter","xlLeft(1)","xlLeft(1)","xlLeft(1)","xlLeft(1)","xlLeft(1)","xlLeft(1)","xlCenter","xlCenter","xlCenter","xlCenter","xlLeft(1)",null,{"$f":"C11","v":"xlCenter"},"xlCenter","xlLeft(1)","xlLeft(1)","xlLeft(1)","xlLeft(1)","xlLeft(1)","xlLeft(1)","xlCenter","xlCenter","xlCenter","xlCenter","xlLeft(1)"]
["Total Rows Needed",{"$f":"SUM(B8:B10)","v":22},"General","General","General","General","General","General","General","General","General","General","General","General","General",null,"General","General","General","General","General","General","General","General","General","General","General","General","General"]
["Last Tab DE Starter Row",23,{"$f":"CELL(\"width\",C13)","v":14},12,20,75,55,28,22,16,16,16,16,16,9,null,{"$f":"CELL(\"width\",Q13)","v":0},0,0,0,0,0,0,0,0,0,0,0,0]
["Last Tab Tabsheet Starter Row",10,"A","B","C","D","E","F","G","H","I","J","K","L","M",null,{"$f":"LOWER(C14)","v":"a"},"b","c","d","e","f","g","h","i","j","k","l","m"]
["Last Copy Starter Row",1,"511 TRAVEL RESTRICTIONS",null,null,null,null,null,null,null,null,null,null,null,null,null,"108-25",null,null,null,null,null,null,null,null,null,null,null,null,null,"Object Type"]
["Tab Loop Number",2,null,null,null,null,null,null,null,null,null,null,null,null,null,null,{"$f":"B17","v":"2014-10-21"},null,null,null,null,null,null,null,null,null,null,null,null,null,"Bridge"]
["Revision Date","2014-10-21",null,null,null,null,null,null,null,null,null,null,null,null,null,null,{"$f":"C15","v":"511 TRAVEL RESTRICTIONS"},null,null,null,null,null,null,null,null,null,null,null,null,null,"Mast Arm"]
["Tabulation Width",4,{"$f":"\"This Data Entry Sheet fills Tab \"&Q15&\" effective \"&TEXT(B17,\"mm-dd-yy\")","v":"This Data Entry Sheet fills Tab 108-25 effective 10-21-14"},null,null,null,null,null,null,null,null,null,null,null,null,null,null,null,null,null,null,null,null,null,null,null,null,null,null,null,"Sign Truss"]
["Horizontal Grid Lines","Yes","Route","Direction","County","Location Description","Feature Crossed","Object Type","Maint. Bridge No.,\nStructure ID,\nor FHWA No.","Type of Restriction","Existing Measurement","Construction Measurement","Construction\nMeasurement\nas Signed","Projected\nAs Built\nMeasurement","Remarks",null,null,null,null,null,null,null,null,null,null,null,null,null,null,null,"Temporary Signal"]
[null,null,null,null,null,null,null,null,null,null,null,null,null,null,null,null,{"$f":"C19","v":"Route"},"Direction","County","Location Description","Feature Crossed","Object Type","Maint. Bridge No.,\nStructure ID,\nor FHWA No.","Type of Restriction","Existing Measurement","Construction Measurement","Construction\nMeasurement\nas Signed","Projected\nAs Built\nMeasurement","Remarks",null,"Barrier"]
[null,null,null,null,null,null,null,null,null,null,null,null,null,null,null,null,null,null,null,null,null,null,null,null,null,null,null,null,null,null,"Traffic Control Device"]
[]
[null,null,null,null,null,null,null,null,null,{"$f":"IF(H23<>\"\",IF(OR(H23=\"Bridge\",H23=\"Mast Arm\",H23=\"Sign Truss\",H23=\"Temporary Signal\"),\"Vertical\",\"Horizontal\"),\"\")","v":""}]
[null,null,null,null,null,"No Restrictions Expected",null,null,null,""]
[null,null,null,null,null,null,null,null,null,""]
[null,null,null,null,null,null,null,null,null,""]
[null,null,null,null,null,null,null,null,null,""]
[null,null,null,null,null,null,null,null,null,""]
[null,null,null,null,null,null,null,null,null,""]
[null,null,null,null,null,null,null,null,null,""]
[null,null,null,null,null,null,null,null,null,""]
[null,null,null,null,null,null,null,null,null,""]
[null,null,null,null,null,null,null,null,null,""]
[null,null,null,null,null,null,null,null,null,""]
[null,null,null,null,null,null,null,null,null,""]
[null,null,null,null,null,null,null,null,null,""]
[null,null,null,null,null,null,null,null,null,""]
[null,null,null,null,null,null,null,null,null,""]
[null,null,null,null,null,null,null,null,null,""]
[null,null,null,null,null,null,null,null,null,""]
[null,null,null,null,null,null,null,null,null,""]
[null,null,null,null,null,null,null,null,null,""]
[null,null,null,null,null,null,null,null,null,""]
[null,null,null,null,null,null,null,null,null,""]
[null,null,null,null,null,null,null,null,null,""]
[null,null,null,null,null,null,null,null,null,""]
[null,null,null,null,null,null,null,null,null,""]
[null,null,null,null,null,null,null,null,null,""]
[null,null,null,null,null,null,null,null,null,""]
[null,null,null,null,null,null,null,null,null,""]
[null,null,null,null,null,null,null,null,null,""]
[null,null,null,null,null,null,null,null,null,""]
[null,null,null,null,null,null,null,null,null,""]
[null,null,null,null,null,null,null,null,null,""]
[null,null,null,null,null,null,null,null,null,""]
[null,null,null,null,null,null,null,null,null,""]
[null,null,null,null,null,null,null,null,null,""]
[null,null,null,null,null,null,null,null,null,""]
[null,null,null,null,null,null,null,null,null,""]
[null,null,null,null,null,null,null,null,null,""]
[null,null,null,null,null,null,null,null,null,""]
[null,null,null,null,null,null,null,null,null,""]
[null,null,null,null,null,null,null,null,null,""]
[null,null,null,null,null,null,null,null,null,""]
[null,null,null,null,null,null,null,null,null,""]
[null,null,null,null,null,null,null,null,null,""]
[null,null,null,null,null,null,null,null,null,""]
[null,null,null,null,null,null,null,null,null,""]
[null,null,null,null,null,null,null,null,null,""]
[null,null,null,null,null,null,null,null,null,""]
[null,null,null,null,null,null,null,null,null,""]
[null,null,null,null,null,null,null,null,null,""]
[null,null,null,null,null,null,null,null,null,""]
[null,null,null,null,null,null,null,null,null,""]
[null,null,null,null,null,null,null,null,null,""]
[null,null,null,null,null,null,null,null,null,""]
[null,null,null,null,null,null,null,null,null,""]
[null,null,null,null,null,null,null,null,null,""]
[null,null,null,null,null,null,null,null,null,""]
[null,null,null,null,null,null,null,null,null,""]
[null,null,null,null,null,null,null,null,null,""]
[null,null,null,null,null,null,null,null,null,""]
[null,null,null,null,null,null,null,null,null,""]
[null,null,null,null,null,null,null,null,null,""]
[null,null,null,null,null,null,null,null,null,""]
[null,null,null,null,null,null,null,null,null,""]
[null,null,null,null,null,null,null,null,null,{"$f":"IF(H87<>\"\",IF(OR(H87=\"Bridge\",H87=\"Mast Arm\",H87=\"Sign Truss\",H87=\"Temporary Signal\"),\"Vertical\",\"Horizontal\"),\"\")","v":""}]
[null,null,null,null,null,null,null,null,null,""]
[null,null,null,null,null,null,null,null,null,""]
[null,null,null,null,null,null,null,null,null,""]
[null,null,null,null,null,null,null,null,null,""]
[null,null,null,null,null,null,null,null,null,""]
[null,null,null,null,null,null,null,null,null,""]
[null,null,null,null,null,null,null,null,null,""]
[null,null,null,null,null,null,null,null,null,""]
[null,null,null,null,null,null,null,null,null,""]
[null,null,null,null,null,null,null,null,null,""]
[null,null,null,null,null,null,null,null,null,""]
[null,null,null,null,null,null,null,null,null,""]
[null,null,null,null,null,null,null,null,null,""]
[null,null,null,null,null,null,null,null,null,""]
[null,null,null,null,null,null,null,null,null,""]
[null,null,null,null,null,null,null,null,null,""]
[null,null,null,null,null,null,null,null,null,""]
[null,null,null,null,null,null,null,null,null,""]
[null,null,null,null,null,null,null,null,null,""]
[null,null,null,null,null,null,null,null,null,""]
[null,null,null,null,null,null,null,null,null,""]
[null,null,null,null,null,null,null,null,null,""]
[null,null,null,null,null,null,null,null,null,""]
[null,null,null,null,null,null,null,null,null,""]
[null,null,null,null,null,null,null,null,null,""]
[null,null,null,null,null,null,null,null,null,""]
[null,null,null,null,null,null,null,null,null,""]
[null,null,null,null,null,null,null,null,null,""]
[null,null,null,null,null,null,null,null,null,""]
[null,null,null,null,null,null,null,null,null,""]
[null,null,null,null,null,null,null,null,null,""]
[null,null,null,null,null,null,null,null,null,""]
[null,null,null,null,null,null,null,null,null,""]
[null,null,null,null,null,null,null,null,null,""]
[null,null,null,null,null,null,null,null,null,""]
[null,null,null,null,null,null,null,null,null,""]
[null,null,null,null,null,null,null,null,null,""]
[null,null,null,null,null,null,null,null,null,""]
[null,null,null,null,null,null,null,null,null,""]
[null,null,null,null,null,null,null,null,null,""]
[null,null,null,null,null,null,null,null,null,""]
[null,null,null,null,null,null,null,null,null,""]
[null,null,null,null,null,null,null,null,null,""]
[null,null,null,null,null,null,null,null,null,""]
[null,null,null,null,null,null,null,null,null,""]
[null,null,null,null,null,null,null,null,null,""]
[null,null,null,null,null,null,null,null,null,""]
[null,null,null,null,null,null,null,null,null,""]
[null,null,null,null,null,null,null,null,null,""]
[null,null,null,null,null,null,null,null,null,""]
[null,null,null,null,null,null,null,null,null,""]
[null,null,null,null,null,null,null,null,null,""]
[null,null,null,null,null,null,null,null,null,""]
[null,null,null,null,null,null,null,null,null,""]
[null,null,null,null,null,null,null,null,null,""]
[null,null,null,null,null,null,null,null,null,""]
[null,null,null,null,null,null,null,null,null,""]
[null,null,null,null,null,null,null,null,null,""]
[null,null,null,null,null,null,null,null,null,""]
[null,null,null,null,null,null,null,null,null,""]
[null,null,null,null,null,null,null,null,null,""]
[null,null,null,null,null,null,null,null,null,""]
[null,null,null,null,null,null,null,null,null,""]
[null,null,null,null,null,null,null,null,null,{"$f":"IF(H151<>\"\",IF(OR(H151=\"Bridge\",H151=\"Mast Arm\",H151=\"Sign Truss\",H151=\"Temporary Signal\"),\"Vertical\",\"Horizontal\"),\"\")","v":""}]
[null,null,null,null,null,null,null,null,null,""]
[null,null,null,null,null,null,null,null,null,""]
[null,null,null,null,null,null,null,null,null,""]
[null,null,null,null,null,null,null,null,null,""]
[null,null,null,null,null,null,null,null,null,""]
[null,null,null,null,null,null,null,null,null,""]
[null,null,null,null,null,null,null,null,null,""]
[null,null,null,null,null,null,null,null,null,""]
[null,null,null,null,null,null,null,null,null,""]
[null,null,null,null,null,null,null,null,null,""]
[null,null,null,null,null,null,null,null,null,""]
[null,null,null,null,null,null,null,null,null,""]
[null,null,null,null,null,null,null,null,null,""]
[null,null,null,null,null,null,null,null,null,""]
[null,null,null,null,null,null,null,null,null,""]
[null,null,null,null,null,null,null,null,null,""]
[null,null,null,null,null,null,null,null,null,""]
[null,null,null,null,null,null,null,null,null,""]
[null,null,null,null,null,null,null,null,null,""]
[null,null,null,null,null,null,null,null,null,""]
[null,null,null,null,null,null,null,null,null,""]
[null,null,null,null,null,null,null,null,null,""]
[null,null,null,null,null,null,null,null,null,""]
[null,null,null,null,null,null,null,null,null,""]
[null,null,null,null,null,null,null,null,null,""]
[null,null,null,null,null,null,null,null,null,""]
[null,null,null,null,null,null,null,null,null,""]
[null,null,null,null,null,null,null,null,null,""]
[null,null,null,null,null,null,null,null,null,""]
[null,null,null,null,null,null,null,null,null,""]
[null,null,null,null,null,null,null,null,null,""]
[null,null,null,null,null,null,null,null,null,""]
[null,null,null,null,null,null,null,null,null,""]
[null,null,null,null,null,null,null,null,null,""]
[null,null,null,null,null,null,null,null,null,""]
[null,null,null,null,null,null,null,null,null,""]
[null,null,null,null,null,null,null,null,null,""]
[null,null,null,null,null,null,null,null,null,""]
[null,null,null,null,null,null,null,null,null,""]
[null,null,null,null,null,null,null,null,null,""]
[null,null,null,null,null,null,null,null,null,""]
[null,null,null,null,null,null,null,null,null,""]
[null,null,null,null,null,null,null,null,null,""]
[null,null,null,null,null,null,null,null,null,""]
[null,null,null,null,null,null,null,null,null,""]
[null,null,null,null,null,null,null,null,null,""]
[null,null,null,null,null,null,null,null,null,""]
[null,null,null,null,null,null,null,null,null,""]
[null,null,null,null,null,null,null,null,null,""]
[null,null,null,null,null,null,null,null,null,""]
[null,null,null,null,null,null,null,null,null,""]
[null,null,null,null,null,null,null,null,null,""]
[null,null,null,null,null,null,null,null,null,""]
[null,null,null,null,null,null,null,null,null,""]
[null,null,null,null,null,null,null,null,null,""]
[null,null,null,null,null,null,null,null,null,""]
[null,null,null,null,null,null,null,null,null,""]
[null,null,null,null,null,null,null,null,null,""]
[null,null,null,null,null,null,null,null,null,""]
[null,null,null,null,null,null,null,null,null,""]
[null,null,null,null,null,null,null,null,null,""]
[null,null,null,null,null,null,null,null,null,""]
[null,null,null,null,null,null,null,null,null,""]
[null,null,null,null,null,null,null,null,null,{"$f":"IF(H215<>\"\",IF(OR(H215=\"Bridge\",H215=\"Mast Arm\",H215=\"Sign Truss\",H215=\"Temporary Signal\"),\"Vertical\",\"Horizontal\"),\"\")","v":""}]
[null,null,null,null,null,null,null,null,null,""]
[null,null,null,null,null,null,null,null,null,""]
[null,null,null,null,null,null,null,null,null,""]
[null,null,null,null,null,null,null,null,null,""]
[null,null,null,null,null,null,null,null,null,""]
[null,null,null,null,null,null,null,null,null,""]
[null,null,null,null,null,null,null,null,null,""]
[null,null,null,null,null,null,null,null,null,""]
[null,null,null,null,null,null,null,null,null,""]
[null,null,null,null,null,null,null,null,null,""]
[null,null,null,null,null,null,null,null,null,""]
[null,null,null,null,null,null,null,null,null,""]
[null,null,null,null,null,null,null,null,null,""]
[null,null,null,null,null,null,null,null,null,""]
[null,null,null,null,null,null,null,null,null,""]
[null,null,null,null,null,null,null,null,null,""]
[null,null,null,null,null,null,null,null,null,""]
[null,null,null,null,null,null,null,null,null,""]
[null,null,null,null,null,null,null,null,null,""]
[null,null,null,null,null,null,null,null,null,""]
[null,null,null,null,null,null,null,null,null,""]
[null,null,null,null,null,null,null,null,null,""]
[null,null,null,null,null,null,null,null,null,""]
[null,null,null,null,null,null,null,null,null,""]
[null,null,null,null,null,null,null,null,null,""]
[null,null,null,null,null,null,null,null,null,""]
[null,null,null,null,null,null,null,null,null,""]
[null,null,null,null,null,null,null,null,null,""]
[null,null,null,null,null,null,null,null,null,""]
[null,null,null,null,null,null,null,null,null,""]
[null,null,null,null,null,null,null,null,null,""]
[null,null,null,null,null,null,null,null,null,""]
[null,null,null,null,null,null,null,null,null,""]
[null,null,null,null,null,null,null,null,null,""]
[null,null,null,null,null,null,null,null,null,""]
[null,null,null,null,null,null,null,null,null,""]
[null,null,null,null,null,null,null,null,null,""]
[null,null,null,null,null,null,null,null,null,""]
[null,null,null,null,null,null,null,null,null,""]
[null,null,null,null,null,null,null,null,null,""]
[null,null,null,null,null,null,null,null,null,""]
[null,null,null,null,null,null,null,null,null,""]
[null,null,null,null,null,null,null,null,null,""]
[null,null,null,null,null,null,null,null,null,""]
[null,null,null,null,null,null,null,null,null,""]
[null,null,null,null,null,null,null,null,null,""]
[null,null,null,null,null,null,null,null,null,""]
[null,null,null,null,null,null,null,null,null,""]
[null,null,null,null,null,null,null,null,null,""]
[null,null,null,null,null,null,null,null,null,""]
[null,null,null,null,null,null,null,null,null,""]
[null,null,null,null,null,null,null,null,null,""]
[null,null,null,null,null,null,null,null,null,""]
[null,null,null,null,null,null,null,null,null,""]
[null,null,null,null,null,null,null,null,null,""]
[null,null,null,null,null,null,null,null,null,""]
[null,null,null,null,null,null,null,null,null,""]
[null,null,null,null,null,null,null,null,null,""]
[null,null,null,null,null,null,null,null,null,""]
[null,null,null,null,null,null,null,null,null,""]
[null,null,null,null,null,null,null,null,null,""]
[null,null,null,null,null,null,null,null,null,""]
[null,null,null,null,null,null,null,null,null,""]
[null,null,null,null,null,null,null,null,null,{"$f":"IF(H279<>\"\",IF(OR(H279=\"Bridge\",H279=\"Mast Arm\",H279=\"Sign Truss\",H279=\"Temporary Signal\"),\"Vertical\",\"Horizontal\"),\"\")","v":""}]
[null,null,null,null,null,null,null,null,null,""]
[null,null,null,null,null,null,null,null,null,""]
[null,null,null,null,null,null,null,null,null,""]
[null,null,null,null,null,null,null,null,null,""]
[null,null,null,null,null,null,null,null,null,""]
[null,null,null,null,null,null,null,null,null,""]
[null,null,null,null,null,null,null,null,null,""]
[null,null,null,null,null,null,null,null,null,""]
[null,null,null,null,null,null,null,null,null,""]
[null,null,null,null,null,null,null,null,null,""]
[null,null,null,null,null,null,null,null,null,""]
[null,null,null,null,null,null,null,null,null,""]
[null,null,null,null,null,null,null,null,null,""]
[null,null,null,null,null,null,null,null,null,""]
[null,null,null,null,null,null,null,null,null,""]
[null,null,null,null,null,null,null,null,null,""]
[null,null,null,null,null,null,null,null,null,""]
[null,null,null,null,null,null,null,null,null,""]
[null,null,null,null,null,null,null,null,null,""]
[null,null,null,null,null,null,null,null,null,""]
[null,null,null,null,null,null,null,null,null,""]
[null,null,null,null,null,null,null,null,null,""]
[null,null,null,null,null,null,null,null,null,""]
[null,null,null,null,null,null,null,null,null,""]
[null,null,null,null,null,null,null,null,null,""]
[null,null,null,null,null,null,null,null,null,""]
[null,null,null,null,null,null,null,null,null,""]
[null,null,null,null,null,null,null,null,null,""]
[null,null,null,null,null,null,null,null,null,""]
[null,null,null,null,null,null,null,null,null,""]
[null,null,null,null,null,null,null,null,null,""]
[null,null,null,null,null,null,null,null,null,""]
[null,null,null,null,null,null,null,null,null,""]
[null,null,null,null,null,null,null,null,null,""]
[null,null,null,null,null,null,null,null,null,""]
[null,null,null,null,null,null,null,null,null,""]
[null,null,null,null,null,null,null,null,null,""]
[null,null,null,null,null,null,null,null,null,""]
[null,null,null,null,null,null,null,null,null,""]
[null,null,null,null,null,null,null,null,null,""]
[null,null,null,null,null,null,null,null,null,""]
[null,null,null,null,null,null,null,null,null,""]
[null,null,null,null,null,null,null,null,null,""]
[null,null,null,null,null,null,null,null,null,""]
[null,null,null,null,null,null,null,null,null,""]
[null,null,null,null,null,null,null,null,null,""]
[null,null,null,null,null,null,null,null,null,""]
[null,null,null,null,null,null,null,null,null,""]
[null,null,null,null,null,null,null,null,null,""]
[null,null,null,null,null,null,null,null,null,""]
[null,null,null,null,null,null,null,null,null,""]
[null,null,null,null,null,null,null,null,null,""]
[null,null,null,null,null,null,null,null,null,""]
[null,null,null,null,null,null,null,null,null,""]
[null,null,null,null,null,null,null,null,null,""]
[null,null,null,null,null,null,null,null,null,""]
[null,null,null,null,null,null,null,null,null,""]
[null,null,null,null,null,null,null,null,null,""]
[null,null,null,null,null,null,null,null,null,""]
[null,null,null,null,null,null,null,null,null,""]
[null,null,null,null,null,null,null,null,null,""]
[null,null,null,null,null,null,null,null,null,""]
[null,null,null,null,null,null,null,null,null,""]
[null,null,null,null,null,null,null,null,null,{"$f":"IF(H343<>\"\",IF(OR(H343=\"Bridge\",H343=\"Mast Arm\",H343=\"Sign Truss\",H343=\"Temporary Signal\"),\"Vertical\",\"Horizontal\"),\"\")","v":""}]
[null,null,null,null,null,null,null,null,null,""]
[null,null,null,null,null,null,null,null,null,""]
[null,null,null,null,null,null,null,null,null,""]
[null,null,null,null,null,null,null,null,null,""]
[null,null,null,null,null,null,null,null,null,""]
[null,null,null,null,null,null,null,null,null,""]
[null,null,null,null,null,null,null,null,null,""]
[null,null,null,null,null,null,null,null,null,""]
[null,null,null,null,null,null,null,null,null,""]
[null,null,null,null,null,null,null,null,null,""]
[null,null,null,null,null,null,null,null,null,""]
[null,null,null,null,null,null,null,null,null,""]
[null,null,null,null,null,null,null,null,null,""]
[null,null,null,null,null,null,null,null,null,""]
[null,null,null,null,null,null,null,null,null,""]
[null,null,null,null,null,null,null,null,null,""]
[null,null,null,null,null,null,null,null,null,""]
[null,null,null,null,null,null,null,null,null,""]
[null,null,null,null,null,null,null,null,null,""]
[null,null,null,null,null,null,null,null,null,""]
[null,null,null,null,null,null,null,null,null,""]
[null,null,null,null,null,null,null,null,null,""]
[null,null,null,null,null,null,null,null,null,""]
[null,null,null,null,null,null,null,null,null,""]
[null,null,null,null,null,null,null,null,null,""]
[null,null,null,null,null,null,null,null,null,""]
[null,null,null,null,null,null,null,null,null,""]
[null,null,null,null,null,null,null,null,null,""]
[null,null,null,null,null,null,null,null,null,""]
[null,null,null,null,null,null,null,null,null,""]
[null,null,null,null,null,null,null,null,null,""]
[null,null,null,null,null,null,null,null,null,""]
[null,null,null,null,null,null,null,null,null,""]
[null,null,null,null,null,null,null,null,null,""]
[null,null,null,null,null,null,null,null,null,""]
[null,null,null,null,null,null,null,null,null,""]
[null,null,null,null,null,null,null,null,null,""]
[null,null,null,null,null,null,null,null,null,""]
[null,null,null,null,null,null,null,null,null,""]
[null,null,null,null,null,null,null,null,null,""]
[null,null,null,null,null,null,null,null,null,""]
[null,null,null,null,null,null,null,null,null,""]
[null,null,null,null,null,null,null,null,null,""]
[null,null,null,null,null,null,null,null,null,""]
[null,null,null,null,null,null,null,null,null,""]
[null,null,null,null,null,null,null,null,null,""]
[null,null,null,null,null,null,null,null,null,""]
[null,null,null,null,null,null,null,null,null,""]
[null,null,null,null,null,null,null,null,null,""]
[null,null,null,null,null,null,null,null,null,""]
[null,null,null,null,null,null,null,null,null,""]
[null,null,null,null,null,null,null,null,null,""]
[null,null,null,null,null,null,null,null,null,""]
[null,null,null,null,null,null,null,null,null,""]
[null,null,null,null,null,null,null,null,null,""]
[null,null,null,null,null,null,null,null,null,""]
[null,null,null,null,null,null,null,null,null,""]
[null,null,null,null,null,null,null,null,null,""]
[null,null,null,null,null,null,null,null,null,""]
[null,null,null,null,null,null,null,null,null,""]
[null,null,null,null,null,null,null,null,null,""]
[null,null,null,null,null,null,null,null,null,""]
[null,null,null,null,null,null,null,null,null,""]
[null,null,null,null,null,null,null,null,null,{"$f":"IF(H407<>\"\",IF(OR(H407=\"Bridge\",H407=\"Mast Arm\",H407=\"Sign Truss\",H407=\"Temporary Signal\"),\"Vertical\",\"Horizontal\"),\"\")","v":""}]
[null,null,null,null,null,null,null,null,null,""]
[null,null,null,null,null,null,null,null,null,""]
[null,null,null,null,null,null,null,null,null,""]
[null,null,null,null,null,null,null,null,null,""]
[null,null,null,null,null,null,null,null,null,""]
[null,null,null,null,null,null,null,null,null,""]
[null,null,null,null,null,null,null,null,null,""]
[null,null,null,null,null,null,null,null,null,""]
[null,null,null,null,null,null,null,null,null,""]
[null,null,null,null,null,null,null,null,null,""]
[null,null,null,null,null,null,null,null,null,""]
[null,null,null,null,null,null,null,null,null,""]
[null,null,null,null,null,null,null,null,null,""]
[null,null,null,null,null,null,null,null,null,""]
[null,null,null,null,null,null,null,null,null,""]
[null,null,null,null,null,null,null,null,null,""]
[null,null,null,null,null,null,null,null,null,""]
[null,null,null,null,null,null,null,null,null,""]
[null,null,null,null,null,null,null,null,null,""]
[null,null,null,null,null,null,null,null,null,""]
[null,null,null,null,null,null,null,null,null,""]
[null,null,null,null,null,null,null,null,null,""]
[null,null,null,null,null,null,null,null,null,""]
[null,null,null,null,null,null,null,null,null,""]
[null,null,null,null,null,null,null,null,null,""]
[null,null,null,null,null,null,null,null,null,""]
[null,null,null,null,null,null,null,null,null,""]
[null,null,null,null,null,null,null,null,null,""]
[null,null,null,null,null,null,null,null,null,""]
[null,null,null,null,null,null,null,null,null,""]
[null,null,null,null,null,null,null,null,null,""]
[null,null,null,null,null,null,null,null,null,""]
[null,null,null,null,null,null,null,null,null,""]
[null,null,null,null,null,null,null,null,null,""]
[null,null,null,null,null,null,null,null,null,""]
[null,null,null,null,null,null,null,null,null,""]
[null,null,null,null,null,null,null,null,null,""]
[null,null,null,null,null,null,null,null,null,""]
[null,null,null,null,null,null,null,null,null,""]
[null,null,null,null,null,null,null,null,null,""]
[null,null,null,null,null,null,null,null,null,""]
[null,null,null,null,null,null,null,null,null,""]
[null,null,null,null,null,null,null,null,null,""]
[null,null,null,null,null,null,null,null,null,""]
[null,null,null,null,null,null,null,null,null,""]
[null,null,null,null,null,null,null,null,null,""]
[null,null,null,null,null,null,null,null,null,""]
[null,null,null,null,null,null,null,null,null,""]
[null,null,null,null,null,null,null,null,null,""]
[null,null,null,null,null,null,null,null,null,""]
[null,null,null,null,null,null,null,null,null,""]
[null,null,null,null,null,null,null,null,null,""]
[null,null,null,null,null,null,null,null,null,""]
[null,null,null,null,null,null,null,null,null,""]
[null,null,null,null,null,null,null,null,null,""]
[null,null,null,null,null,null,null,null,null,""]
[null,null,null,null,null,null,null,null,null,""]
[null,null,null,null,null,null,null,null,null,""]
[null,null,null,null,null,null,null,null,null,""]
[null,null,null,null,null,null,null,null,null,""]
[null,null,null,null,null,null,null,null,null,""]
[null,null,null,null,null,null,null,null,null,""]
[null,null,null,null,null,null,null,null,null,""]
[null,null,null,null,null,null,null,null,null,{"$f":"IF(H471<>\"\",IF(OR(H471=\"Bridge\",H471=\"Mast Arm\",H471=\"Sign Truss\",H471=\"Temporary Signal\"),\"Vertical\",\"Horizontal\"),\"\")","v":""}]
[null,null,null,null,null,null,null,null,null,""]
[null,null,null,null,null,null,null,null,null,""]
[null,null,null,null,null,null,null,null,null,""]
[null,null,null,null,null,null,null,null,null,""]
[null,null,null,null,null,null,null,null,null,""]
[null,null,null,null,null,null,null,null,null,""]
[null,null,null,null,null,null,null,null,null,""]
[null,null,null,null,null,null,null,null,null,""]
[null,null,null,null,null,null,null,null,null,""]
[null,null,null,null,null,null,null,null,null,""]
[null,null,null,null,null,null,null,null,null,""]
[null,null,null,null,null,null,null,null,null,""]
[null,null,null,null,null,null,null,null,null,""]
[null,null,null,null,null,null,null,null,null,""]
[null,null,null,null,null,null,null,null,null,""]
[null,null,null,null,null,null,null,null,null,""]
[null,null,null,null,null,null,null,null,null,""]
[null,null,null,null,null,null,null,null,null,""]
[null,null,null,null,null,null,null,null,null,""]
[null,null,null,null,null,null,null,null,null,""]
[null,null,null,null,null,null,null,null,null,""]
[null,null,null,null,null,null,null,null,null,""]
[null,null,null,null,null,null,null,null,null,""]
[null,null,null,null,null,null,null,null,null,""]
[null,null,null,null,null,null,null,null,null,""]
[null,null,null,null,null,null,null,null,null,""]
[null,null,null,null,null,null,null,null,null,""]
[null,null,null,null,null,null,null,null,null,""]
[null,null,null,null,null,null,null,null,null,""]
[null,null,null,null,null,null,null,null,null,""]
[null,null,null,null,null,null,null,null,null,""]
[null,null,null,null,null,null,null,null,null,""]
[null,null,null,null,null,null,null,null,null,""]
[null,null,null,null,null,null,null,null,null,""]
[null,null,null,null,null,null,null,null,null,""]
[null,null,null,null,null,null,null,null,null,""]
[null,null,null,null,null,null,null,null,null,""]
[null,null,null,null,null,null,null,null,null,""]
[null,null,null,null,null,null,null,null,null,""]
[null,null,null,null,null,null,null,null,null,""]
[null,null,null,null,null,null,null,null,null,""]
[null,null,null,null,null,null,null,null,null,""]
[null,null,null,null,null,null,null,null,null,""]
[null,null,null,null,null,null,null,null,null,""]
[null,null,null,null,null,null,null,null,null,""]
[null,null,null,null,null,null,null,null,null,""]
[null,null,null,null,null,null,null,null,null,""]
[null,null,null,null,null,null,null,null,null,""]
[null,null,null,null,null,null,null,null,null,""]
[null,null,null,null,null,null,null,null,null,""]
[null,null,null,null,null,null,null,null,null,""]
[null,null,null,null,null,null,null,null,null,""]
[null,null,null,null,null,null,null,null,null,""]
[null,null,null,null,null,null,null,null,null,""]
[null,null,null,null,null,null,null,null,null,""]
[null,null,null,null,null,null,null,null,null,""]
[null,null,null,null,null,null,null,null,null,""]
[null,null,null,null,null,null,null,null,null,""]
[null,null,null,null,null,null,null,null,null,""]
[null,null,null,null,null,null,null,null,null,""]
[null,null,null,null,null,null,null,null,null,""]
[null,null,null,null,null,null,null,null,null,""]
[null,null,null,null,null,null,null,null,null,""]
[null,null,null,null,null,null,null,null,null,{"$f":"IF(H535<>\"\",IF(OR(H535=\"Bridge\",H535=\"Mast Arm\",H535=\"Sign Truss\",H535=\"Temporary Signal\"),\"Vertical\",\"Horizontal\"),\"\")","v":""}]
[null,null,null,null,null,null,null,null,null,""]
[null,null,null,null,null,null,null,null,null,""]
[null,null,null,null,null,null,null,null,null,""]
[null,null,null,null,null,null,null,null,null,""]
[null,null,null,null,null,null,null,null,null,""]
[null,null,null,null,null,null,null,null,null,""]
[null,null,null,null,null,null,null,null,null,""]
[null,null,null,null,null,null,null,null,null,""]
[null,null,null,null,null,null,null,null,null,""]
[null,null,null,null,null,null,null,null,null,""]
[null,null,null,null,null,null,null,null,null,""]
[null,null,null,null,null,null,null,null,null,""]
[null,null,null,null,null,null,null,null,null,""]
[null,null,null,null,null,null,null,null,null,""]
[null,null,null,null,null,null,null,null,null,""]
[null,null,null,null,null,null,null,null,null,""]
[null,null,null,null,null,null,null,null,null,""]
[null,null,null,null,null,null,null,null,null,""]
[null,null,null,null,null,null,null,null,null,""]
[null,null,null,null,null,null,null,null,null,""]
[null,null,null,null,null,null,null,null,null,""]
[null,null,null,null,null,null,null,null,null,""]
[null,null,null,null,null,null,null,null,null,""]
[null,null,null,null,null,null,null,null,null,""]
[null,null,null,null,null,null,null,null,null,""]
[null,null,null,null,null,null,null,null,null,""]
[null,null,null,null,null,null,null,null,null,""]
[null,null,null,null,null,null,null,null,null,""]
[null,null,null,null,null,null,null,null,null,""]
[null,null,null,null,null,null,null,null,null,""]
[null,null,null,null,null,null,null,null,null,""]
[null,null,null,null,null,null,null,null,null,""]
[null,null,null,null,null,null,null,null,null,""]
[null,null,null,null,null,null,null,null,null,""]
[null,null,null,null,null,null,null,null,null,""]
[null,null,null,null,null,null,null,null,null,""]
[null,null,null,null,null,null,null,null,null,""]
[null,null,null,null,null,null,null,null,null,""]
[null,null,null,null,null,null,null,null,null,""]
[null,null,null,null,null,null,null,null,null,""]
[null,null,null,null,null,null,null,null,null,""]
[null,null,null,null,null,null,null,null,null,""]
[null,null,null,null,null,null,null,null,null,""]
[null,null,null,null,null,null,null,null,null,""]
[null,null,null,null,null,null,null,null,null,""]
[null,null,null,null,null,null,null,null,null,""]
[null,null,null,null,null,null,null,null,null,""]
[null,null,null,null,null,null,null,null,null,""]
[null,null,null,null,null,null,null,null,null,""]
[null,null,null,null,null,null,null,null,null,""]
[null,null,null,null,null,null,null,null,null,""]
[null,null,null,null,null,null,null,null,null,""]
[null,null,null,null,null,null,null,null,null,""]
[null,null,null,null,null,null,null,null,null,""]
[null,null,null,null,null,null,null,null,null,""]
[null,null,null,null,null,null,null,null,null,""]
[null,null,null,null,null,null,null,null,null,""]
[null,null,null,null,null,null,null,null,null,""]
[null,null,null,null,null,null,null,null,null,""]
[null,null,null,null,null,null,null,null,null,""]
[null,null,null,null,null,null,null,null,null,""]
[null,null,null,null,null,null,null,null,null,""]
[null,null,null,null,null,null,null,null,null,""]
[null,null,null,null,null,null,null,null,null,{"$f":"IF(H599<>\"\",IF(OR(H599=\"Bridge\",H599=\"Mast Arm\",H599=\"Sign Truss\",H599=\"Temporary Signal\"),\"Vertical\",\"Horizontal\"),\"\")","v":""}]
[null,null,null,null,null,null,null,null,null,""]
[null,null,null,null,null,null,null,null,null,""]
[null,null,null,null,null,null,null,null,null,""]
[null,null,null,null,null,null,null,null,null,""]
[null,null,null,null,null,null,null,null,null,""]
[null,null,null,null,null,null,null,null,null,""]
[null,null,null,null,null,null,null,null,null,""]
[null,null,null,null,null,null,null,null,null,""]
[null,null,null,null,null,null,null,null,null,""]
[null,null,null,null,null,null,null,null,null,""]
[null,null,null,null,null,null,null,null,null,""]
[null,null,null,null,null,null,null,null,null,""]
[null,null,null,null,null,null,null,null,null,""]
[null,null,null,null,null,null,null,null,null,""]
[null,null,null,null,null,null,null,null,null,""]
[null,null,null,null,null,null,null,null,null,""]
[null,null,null,null,null,null,null,null,null,""]
[null,null,null,null,null,null,null,null,null,""]
[null,null,null,null,null,null,null,null,null,""]
[null,null,null,null,null,null,null,null,null,""]
[null,null,null,null,null,null,null,null,null,""]
[null,null,null,null,null,null,null,null,null,""]
[null,null,null,null,null,null,null,null,null,""]
[null,null,null,null,null,null,null,null,null,""]
[null,null,null,null,null,null,null,null,null,""]
[null,null,null,null,null,null,null,null,null,""]
[null,null,null,null,null,null,null,null,null,""]
[null,null,null,null,null,null,null,null,null,""]
[null,null,null,null,null,null,null,null,null,""]
[null,null,null,null,null,null,null,null,null,""]
[null,null,null,null,null,null,null,null,null,""]
[null,null,null,null,null,null,null,null,null,""]
[null,null,null,null,null,null,null,null,null,""]
[null,null,null,null,null,null,null,null,null,""]
[null,null,null,null,null,null,null,null,null,""]
[null,null,null,null,null,null,null,null,null,""]
[null,null,null,null,null,null,null,null,null,""]
[null,null,null,null,null,null,null,null,null,""]
[null,null,null,null,null,null,null,null,null,""]
[null,null,null,null,null,null,null,null,null,""]
[null,null,null,null,null,null,null,null,null,""]
[null,null,null,null,null,null,null,null,null,""]
[null,null,null,null,null,null,null,null,null,""]
[null,null,null,null,null,null,null,null,null,""]
[null,null,null,null,null,null,null,null,null,""]
[null,null,null,null,null,null,null,null,null,""]
[null,null,null,null,null,null,null,null,null,""]
[null,null,null,null,null,null,null,null,null,""]
[null,null,null,null,null,null,null,null,null,""]
[null,null,null,null,null,null,null,null,null,""]
[null,null,null,null,null,null,null,null,null,""]
[null,null,null,null,null,null,null,null,null,""]
[null,null,null,null,null,null,null,null,null,""]
[null,null,null,null,null,null,null,null,null,""]
[null,null,null,null,null,null,null,null,null,""]
[null,null,null,null,null,null,null,null,null,""]
[null,null,null,null,null,null,null,null,null,""]
[null,null,null,null,null,null,null,null,null,""]
[null,null,null,null,null,null,null,null,null,""]
[null,null,null,null,null,null,null,null,null,""]
[null,null,null,null,null,null,null,null,null,""]
[null,null,null,null,null,null,null,null,null,""]
[null,null,null,null,null,null,null,null,null,""]
[null,null,null,null,null,null,null,null,null,{"$f":"IF(H663<>\"\",IF(OR(H663=\"Bridge\",H663=\"Mast Arm\",H663=\"Sign Truss\",H663=\"Temporary Signal\"),\"Vertical\",\"Horizontal\"),\"\")","v":""}]
[null,null,null,null,null,null,null,null,null,""]
[null,null,null,null,null,null,null,null,null,""]
[null,null,null,null,null,null,null,null,null,""]
[null,null,null,null,null,null,null,null,null,""]
[null,null,null,null,null,null,null,null,null,""]
[null,null,null,null,null,null,null,null,null,""]
[null,null,null,null,null,null,null,null,null,""]
[null,null,null,null,null,null,null,null,null,""]
[null,null,null,null,null,null,null,null,null,""]
[null,null,null,null,null,null,null,null,null,""]
[null,null,null,null,null,null,null,null,null,""]
[null,null,null,null,null,null,null,null,null,""]
[null,null,null,null,null,null,null,null,null,""]
[null,null,null,null,null,null,null,null,null,""]
[null,null,null,null,null,null,null,null,null,""]
[null,null,null,null,null,null,null,null,null,""]
[null,null,null,null,null,null,null,null,null,""]
[null,null,null,null,null,null,null,null,null,""]
[null,null,null,null,null,null,null,null,null,""]
[null,null,null,null,null,null,null,null,null,""]
[null,null,null,null,null,null,null,null,null,""]
[null,null,null,null,null,null,null,null,null,""]
[null,null,null,null,null,null,null,null,null,""]
[null,null,null,null,null,null,null,null,null,""]
[null,null,null,null,null,null,null,null,null,""]
[null,null,null,null,null,null,null,null,null,""]
[null,null,null,null,null,null,null,null,null,""]
[null,null,null,null,null,null,null,null,null,""]
[null,null,null,null,null,null,null,null,null,""]
[null,null,null,null,null,null,null,null,null,""]
[null,null,null,null,null,null,null,null,null,""]
[null,null,null,null,null,null,null,null,null,""]
[null,null,null,null,null,null,null,null,null,""]
[null,null,null,null,null,null,null,null,null,""]
[null,null,null,null,null,null,null,null,null,""]
[null,null,null,null,null,null,null,null,null,""]
[null,null,null,null,null,null,null,null,null,""]
[null,null,null,null,null,null,null,null,null,""]
[null,null,null,null,null,null,null,null,null,""]
[null,null,null,null,null,null,null,null,null,""]
[null,null,null,null,null,null,null,null,null,""]
[null,null,null,null,null,null,null,null,null,""]
[null,null,null,null,null,null,null,null,null,""]
[null,null,null,null,null,null,null,null,null,""]
[null,null,null,null,null,null,null,null,null,""]
[null,null,null,null,null,null,null,null,null,""]
[null,null,null,null,null,null,null,null,null,""]
[null,null,null,null,null,null,null,null,null,""]
[null,null,null,null,null,null,null,null,null,""]
[null,null,null,null,null,null,null,null,null,""]
[null,null,null,null,null,null,null,null,null,""]
[null,null,null,null,null,null,null,null,null,""]
[null,null,null,null,null,null,null,null,null,""]
[null,null,null,null,null,null,null,null,null,""]
[null,null,null,null,null,null,null,null,null,""]
[null,null,null,null,null,null,null,null,null,""]
[null,null,null,null,null,null,null,null,null,""]
[null,null,null,null,null,null,null,null,null,""]
[null,null,null,null,null,null,null,null,null,""]
[null,null,null,null,null,null,null,null,null,""]
[null,null,null,null,null,null,null,null,null,""]
[null,null,null,null,null,null,null,null,null,""]
[null,null,null,null,null,null,null,null,null,""]
[null,null,null,null,null,null,null,null,null,{"$f":"IF(H727<>\"\",IF(OR(H727=\"Bridge\",H727=\"Mast Arm\",H727=\"Sign Truss\",H727=\"Temporary Signal\"),\"Vertical\",\"Horizontal\"),\"\")","v":""}]
[null,null,null,null,null,null,null,null,null,""]
[null,null,null,null,null,null,null,null,null,""]
[null,null,null,null,null,null,null,null,null,""]
[null,null,null,null,null,null,null,null,null,""]
[null,null,null,null,null,null,null,null,null,""]
[null,null,null,null,null,null,null,null,null,""]
[null,null,null,null,null,null,null,null,null,""]
[null,null,null,null,null,null,null,null,null,""]
[null,null,null,null,null,null,null,null,null,""]
[null,null,null,null,null,null,null,null,null,""]
[null,null,null,null,null,null,null,null,null,""]
[null,null,null,null,null,null,null,null,null,""]
[null,null,null,null,null,null,null,null,null,""]
[null,null,null,null,null,null,null,null,null,""]
[null,null,null,null,null,null,null,null,null,""]
[null,null,null,null,null,null,null,null,null,""]
[null,null,null,null,null,null,null,null,null,""]
[null,null,null,null,null,null,null,null,null,""]
[null,null,null,null,null,null,null,null,null,""]
[null,null,null,null,null,null,null,null,null,""]
[null,null,null,null,null,null,null,null,null,""]
[null,null,null,null,null,null,null,null,null,""]
[null,null,null,null,null,null,null,null,null,""]
[null,null,null,null,null,null,null,null,null,""]
[null,null,null,null,null,null,null,null,null,""]
[null,null,null,null,null,null,null,null,null,""]
[null,null,null,null,null,null,null,null,null,""]
[null,null,null,null,null,null,null,null,null,""]
[null,null,null,null,null,null,null,null,null,""]
[null,null,null,null,null,null,null,null,null,""]
[null,null,null,null,null,null,null,null,null,""]
[null,null,null,null,null,null,null,null,null,""]
[null,null,null,null,null,null,null,null,null,""]
[null,null,null,null,null,null,null,null,null,""]
[null,null,null,null,null,null,null,null,null,""]
[null,null,null,null,null,null,null,null,null,""]
[null,null,null,null,null,null,null,null,null,""]
[null,null,null,null,null,null,null,null,null,""]
[null,null,null,null,null,null,null,null,null,""]
[null,null,null,null,null,null,null,null,null,""]
[null,null,null,null,null,null,null,null,null,""]
[null,null,null,null,null,null,null,null,null,""]
[null,null,null,null,null,null,null,null,null,""]
[null,null,null,null,null,null,null,null,null,""]
[null,null,null,null,null,null,null,null,null,""]
[null,null,null,null,null,null,null,null,null,""]
[null,null,null,null,null,null,null,null,null,""]
[null,null,null,null,null,null,null,null,null,""]
[null,null,null,null,null,null,null,null,null,""]
[null,null,null,null,null,null,null,null,null,""]
[null,null,null,null,null,null,null,null,null,""]
[null,null,null,null,null,null,null,null,null,""]
[null,null,null,null,null,null,null,null,null,""]
[null,null,null,null,null,null,null,null,null,""]
[null,null,null,null,null,null,null,null,null,""]
[null,null,null,null,null,null,null,null,null,""]
[null,null,null,null,null,null,null,null,null,""]
[null,null,null,null,null,null,null,null,null,""]
[null,null,null,null,null,null,null,null,null,""]
[null,null,null,null,null,null,null,null,null,""]
[null,null,null,null,null,null,null,null,null,""]
[null,null,null,null,null,null,null,null,null,""]
[null,null,null,null,null,null,null,null,null,""]
[null,null,null,null,null,null,null,null,null,{"$f":"IF(H791<>\"\",IF(OR(H791=\"Bridge\",H791=\"Mast Arm\",H791=\"Sign Truss\",H791=\"Temporary Signal\"),\"Vertical\",\"Horizontal\"),\"\")","v":""}]
[null,null,null,null,null,null,null,null,null,""]
[null,null,null,null,null,null,null,null,null,""]
[null,null,null,null,null,null,null,null,null,""]
[null,null,null,null,null,null,null,null,null,""]
[null,null,null,null,null,null,null,null,null,""]
[null,null,null,null,null,null,null,null,null,""]
[null,null,null,null,null,null,null,null,null,""]
[null,null,null,null,null,null,null,null,null,""]
[null,null,null,null,null,null,null,null,null,""]
[null,null,null,null,null,null,null,null,null,""]
[null,null,null,null,null,null,null,null,null,""]
[null,null,null,null,null,null,null,null,null,""]
[null,null,null,null,null,null,null,null,null,""]
[null,null,null,null,null,null,null,null,null,""]
[null,null,null,null,null,null,null,null,null,""]
[null,null,null,null,null,null,null,null,null,""]
[null,null,null,null,null,null,null,null,null,""]
[null,null,null,null,null,null,null,null,null,""]
[null,null,null,null,null,null,null,null,null,""]
[null,null,null,null,null,null,null,null,null,""]
[null,null,null,null,null,null,null,null,null,""]
[null,null,null,null,null,null,null,null,null,""]
[null,null,null,null,null,null,null,null,null,""]
[null,null,null,null,null,null,null,null,null,""]
[null,null,null,null,null,null,null,null,null,""]
[null,null,null,null,null,null,null,null,null,""]
[null,null,null,null,null,null,null,null,null,""]
[null,null,null,null,null,null,null,null,null,""]
[null,null,null,null,null,null,null,null,null,""]
[null,null,null,null,null,null,null,null,null,""]
[null,null,null,null,null,null,null,null,null,""]
[null,null,null,null,null,null,null,null,null,""]
[null,null,null,null,null,null,null,null,null,""]
[null,null,null,null,null,null,null,null,null,""]
[null,null,null,null,null,null,null,null,null,""]
[null,null,null,null,null,null,null,null,null,""]
[null,null,null,null,null,null,null,null,null,""]
[null,null,null,null,null,null,null,null,null,""]
[null,null,null,null,null,null,null,null,null,""]
[null,null,null,null,null,null,null,null,null,""]
[null,null,null,null,null,null,null,null,null,""]
[null,null,null,null,null,null,null,null,null,""]
[null,null,null,null,null,null,null,null,null,""]
[null,null,null,null,null,null,null,null,null,""]
[null,null,null,null,null,null,null,null,null,""]
[null,null,null,null,null,null,null,null,null,""]
[null,null,null,null,null,null,null,null,null,""]
[null,null,null,null,null,null,null,null,null,""]
[null,null,null,null,null,null,null,null,null,""]
[null,null,null,null,null,null,null,null,null,""]
[null,null,null,null,null,null,null,null,null,""]
[null,null,null,null,null,null,null,null,null,""]
[null,null,null,null,null,null,null,null,null,""]
[null,null,null,null,null,null,null,null,null,""]
[null,null,null,null,null,null,null,null,null,""]
[null,null,null,null,null,null,null,null,null,""]
[null,null,null,null,null,null,null,null,null,""]
[null,null,null,null,null,null,null,null,null,""]
[null,null,null,null,null,null,null,null,null,""]
[null,null,null,null,null,null,null,null,null,""]
[null,null,null,null,null,null,null,null,null,""]
[null,null,null,null,null,null,null,null,null,""]
[null,null,null,null,null,null,null,null,null,""]
[null,null,null,null,null,null,null,null,null,{"$f":"IF(H855<>\"\",IF(OR(H855=\"Bridge\",H855=\"Mast Arm\",H855=\"Sign Truss\",H855=\"Temporary Signal\"),\"Vertical\",\"Horizontal\"),\"\")","v":""}]
[null,null,null,null,null,null,null,null,null,""]
[null,null,null,null,null,null,null,null,null,""]
[null,null,null,null,null,null,null,null,null,""]
[null,null,null,null,null,null,null,null,null,""]
[null,null,null,null,null,null,null,null,null,""]
[null,null,null,null,null,null,null,null,null,""]
[null,null,null,null,null,null,null,null,null,""]
[null,null,null,null,null,null,null,null,null,""]
[null,null,null,null,null,null,null,null,null,""]
[null,null,null,null,null,null,null,null,null,""]
[null,null,null,null,null,null,null,null,null,""]
[null,null,null,null,null,null,null,null,null,""]
[null,null,null,null,null,null,null,null,null,""]
[null,null,null,null,null,null,null,null,null,""]
[null,null,null,null,null,null,null,null,null,""]
[null,null,null,null,null,null,null,null,null,""]
[null,null,null,null,null,null,null,null,null,""]
[null,null,null,null,null,null,null,null,null,""]
[null,null,null,null,null,null,null,null,null,""]
[null,null,null,null,null,null,null,null,null,""]
[null,null,null,null,null,null,null,null,null,""]
[null,null,null,null,null,null,null,null,null,""]
[null,null,null,null,null,null,null,null,null,""]
[null,null,null,null,null,null,null,null,null,""]
[null,null,null,null,null,null,null,null,null,""]
[null,null,null,null,null,null,null,null,null,""]
[null,null,null,null,null,null,null,null,null,""]
[null,null,null,null,null,null,null,null,null,""]
[null,null,null,null,null,null,null,null,null,""]
[null,null,null,null,null,null,null,null,null,""]
[null,null,null,null,null,null,null,null,null,""]
[null,null,null,null,null,null,null,null,null,""]
[null,null,null,null,null,null,null,null,null,""]
[null,null,null,null,null,null,null,null,null,""]
[null,null,null,null,null,null,null,null,null,""]
[null,null,null,null,null,null,null,null,null,""]
[null,null,null,null,null,null,null,null,null,""]
[null,null,null,null,null,null,null,null,null,""]
[null,null,null,null,null,null,null,null,null,""]
[null,null,null,null,null,null,null,null,null,""]
[null,null,null,null,null,null,null,null,null,""]
[null,null,null,null,null,null,null,null,null,""]
[null,null,null,null,null,null,null,null,null,""]
[null,null,null,null,null,null,null,null,null,""]
[null,null,null,null,null,null,null,null,null,""]
[null,null,null,null,null,null,null,null,null,""]
[null,null,null,null,null,null,null,null,null,""]
[null,null,null,null,null,null,null,null,null,""]
[null,null,null,null,null,null,null,null,null,""]
[null,null,null,null,null,null,null,null,null,""]
[null,null,null,null,null,null,null,null,null,""]
[null,null,null,null,null,null,null,null,null,""]
[null,null,null,null,null,null,null,null,null,""]
[null,null,null,null,null,null,null,null,null,""]
[null,null,null,null,null,null,null,null,null,""]
[null,null,null,null,null,null,null,null,null,""]
[null,null,null,null,null,null,null,null,null,""]
[null,null,null,null,null,null,null,null,null,""]
[null,null,null,null,null,null,null,null,null,""]
[null,null,null,null,null,null,null,null,null,""]
[null,null,null,null,null,null,null,null,null,""]
[null,null,null,null,null,null,null,null,null,""]
[null,null,null,null,null,null,null,null,null,""]
[null,null,null,null,null,null,null,null,null,{"$f":"IF(H919<>\"\",IF(OR(H919=\"Bridge\",H919=\"Mast Arm\",H919=\"Sign Truss\",H919=\"Temporary Signal\"),\"Vertical\",\"Horizontal\"),\"\")","v":""}]
[null,null,null,null,null,null,null,null,null,""]
[null,null,null,null,null,null,null,null,null,""]
[null,null,null,null,null,null,null,null,null,""]
[null,null,null,null,null,null,null,null,null,""]
[null,null,null,null,null,null,null,null,null,""]
[null,null,null,null,null,null,null,null,null,""]
[null,null,null,null,null,null,null,null,null,""]
[null,null,null,null,null,null,null,null,null,""]
[null,null,null,null,null,null,null,null,null,""]
[null,null,null,null,null,null,null,null,null,""]
[null,null,null,null,null,null,null,null,null,""]
[null,null,null,null,null,null,null,null,null,""]
[null,null,null,null,null,null,null,null,null,""]
[null,null,null,null,null,null,null,null,null,""]
[null,null,null,null,null,null,null,null,null,""]
[null,null,null,null,null,null,null,null,null,""]
[null,null,null,null,null,null,null,null,null,""]
[null,null,null,null,null,null,null,null,null,""]
[null,null,null,null,null,null,null,null,null,""]
[null,null,null,null,null,null,null,null,null,""]
[null,null,null,null,null,null,null,null,null,""]
[null,null,null,null,null,null,null,null,null,""]
[null,null,null,null,null,null,null,null,null,""]
[null,null,null,null,null,null,null,null,null,""]
[null,null,null,null,null,null,null,null,null,""]
[null,null,null,null,null,null,null,null,null,""]
[null,null,null,null,null,null,null,null,null,""]
[null,null,null,null,null,null,null,null,null,""]
[null,null,null,null,null,null,null,null,null,""]
[null,null,null,null,null,null,null,null,null,""]
[null,null,null,null,null,null,null,null,null,""]
[null,null,null,null,null,null,null,null,null,""]
[null,null,null,null,null,null,null,null,null,""]
[null,null,null,null,null,null,null,null,null,""]
[null,null,null,null,null,null,null,null,null,""]
[null,null,null,null,null,null,null,null,null,""]
[null,null,null,null,null,null,null,null,null,""]
[null,null,null,null,null,null,null,null,null,""]
[null,null,null,null,null,null,null,null,null,""]
[null,null,null,null,null,null,null,null,null,""]
[null,null,null,null,null,null,null,null,null,""]
[null,null,null,null,null,null,null,null,null,""]
[null,null,null,null,null,null,null,null,null,""]
[null,null,null,null,null,null,null,null,null,""]
[null,null,null,null,null,null,null,null,null,""]
[null,null,null,null,null,null,null,null,null,""]
[null,null,null,null,null,null,null,null,null,""]
[null,null,null,null,null,null,null,null,null,""]
[null,null,null,null,null,null,null,null,null,""]
[null,null,null,null,null,null,null,null,null,""]
[null,null,null,null,null,null,null,null,null,""]
[null,null,null,null,null,null,null,null,null,""]
[null,null,null,null,null,null,null,null,null,""]
[null,null,null,null,null,null,null,null,null,""]
[null,null,null,null,null,null,null,null,null,""]
[null,null,null,null,null,null,null,null,null,""]
[null,null,null,null,null,null,null,null,null,""]
[null,null,null,null,null,null,null,null,null,""]
[null,null,null,null,null,null,null,null,null,""]
[null,null,null,null,null,null,null,null,null,""]
[null,null,null,null,null,null,null,null,null,""]
[null,null,null,null,null,null,null,null,null,""]
[null,null,null,null,null,null,null,null,null,""]
[null,null,null,null,null,null,null,null,null,{"$f":"IF(H983<>\"\",IF(OR(H983=\"Bridge\",H983=\"Mast Arm\",H983=\"Sign Truss\",H983=\"Temporary Signal\"),\"Vertical\",\"Horizontal\"),\"\")","v":""}]
[null,null,null,null,null,null,null,null,null,""]
[null,null,null,null,null,null,null,null,null,""]
[null,null,null,null,null,null,null,null,null,""]
[null,null,null,null,null,null,null,null,null,""]
[null,null,null,null,null,null,null,null,null,""]
[null,null,null,null,null,null,null,null,null,""]
[null,null,null,null,null,null,null,null,null,""]
[null,null,null,null,null,null,null,null,null,""]
[null,null,null,null,null,null,null,null,null,""]
[null,null,null,null,null,null,null,null,null,""]
[null,null,null,null,null,null,null,null,null,""]
[null,null,null,null,null,null,null,null,null,""]
[null,null,null,null,null,null,null,null,null,""]
[null,null,null,null,null,null,null,null,null,""]
[null,null,null,null,null,null,null,null,null,""]
[null,null,null,null,null,null,null,null,null,""]
[null,null,null,null,null,null,null,null,null,""]
[null,null,null,null,null,null,null,null,null,""]
[null,null,null,null,null,null,null,null,null,""]
[null,null,null,null,null,null,null,null,null,""]
[null,null,null,null,null,null,null,null,null,""]
[null,null,null,null,null,null,null,null,null,""]
[null,null,null,null,null,null,null,null,null,""]
[null,null,null,null,null,null,null,null,null,""]
[null,null,null,null,null,null,null,null,null,""]
[null,null,null,null,null,null,null,null,null,""]
[null,null,null,null,null,null,null,null,null,""]
[null,null,null,null,null,null,null,null,null,""]
[null,null,null,null,null,null,null,null,null,""]
[null,null,null,null,null,null,null,null,null,""]
[null,null,null,null,null,null,null,null,null,""]
[null,null,null,null,null,null,null,null,null,""]
[null,null,null,null,null,null,null,null,null,""]
[null,null,null,null,null,null,null,null,null,""]
[null,null,null,null,null,null,null,null,null,""]
[null,null,null,null,null,null,null,null,null,""]
[null,null,null,null,null,null,null,null,null,""]
[null,null,null,null,null,null,null,null,null,""]
[null,null,null,null,null,null,null,null,null,""]
[null,null,null,null,null,null,null,null,null,""]
[null,null,null,null,null,null,null,null,null,""]
[null,null,null,null,null,null,null,null,null,""]
[null,null,null,null,null,null,null,null,null,""]
[null,null,null,null,null,null,null,null,null,""]
[null,null,null,null,null,null,null,null,null,""]
[null,null,null,null,null,null,null,null,null,""]
[null,null,null,null,null,null,null,null,null,""]
[null,null,null,null,null,null,null,null,null,""]
[null,null,null,null,null,null,null,null,null,""]
[null,null,null,null,null,null,null,null,null,""]
[null,null,null,null,null,null,null,null,null,""]
[null,null,null,null,null,null,null,null,null,""]
[null,null,null,null,null,null,null,null,null,""]
[null,null,null,null,null,null,null,null,null,""]
[null,null,null,null,null,null,null,null,null,""]
[null,null,null,null,null,null,null,null,null,""]
[null,null,null,null,null,null,null,null,null,""]
[null,null,null,null,null,null,null,null,null,""]
[null,null,null,null,null,null,null,null,null,""]
[null,null,null,null,null,null,null,null,null,""]
[null,null,null,null,null,null,null,null,null,""]
[null,null,null,null,null,null,null,null,null,""]
[null,null,null,null,null,null,null,null,null,""]
[null,null,null,null,null,null,null,null,null,{"$f":"IF(H1047<>\"\",IF(OR(H1047=\"Bridge\",H1047=\"Mast Arm\",H1047=\"Sign Truss\",H1047=\"Temporary Signal\"),\"Vertical\",\"Horizontal\"),\"\")","v":""}]
[null,null,null,null,null,null,null,null,null,""]
[null,null,null,null,null,null,null,null,null,""]
[null,null,null,null,null,null,null,null,null,""]
[null,null,null,null,null,null,null,null,null,""]
[null,null,null,null,null,null,null,null,null,""]
[null,null,null,null,null,null,null,null,null,""]
[null,null,null,null,null,null,null,null,null,""]
[null,null,null,null,null,null,null,null,null,""]
[null,null,null,null,null,null,null,null,null,""]
[null,null,null,null,null,null,null,null,null,""]
[null,null,null,null,null,null,null,null,null,""]
[null,null,null,null,null,null,null,null,null,""]
[null,null,null,null,null,null,null,null,null,""]
[null,null,null,null,null,null,null,null,null,""]
[null,null,null,null,null,null,null,null,null,""]
[null,null,null,null,null,null,null,null,null,""]
[null,null,null,null,null,null,null,null,null,""]
[null,null,null,null,null,null,null,null,null,""]
[null,null,null,null,null,null,null,null,null,""]
[null,null,null,null,null,null,null,null,null,""]
[null,null,null,null,null,null,null,null,null,""]
[null,null,null,null,null,null,null,null,null,""]
[null,null,null,null,null,null,null,null,null,""]
[null,null,null,null,null,null,null,null,null,""]
[null,null,null,null,null,null,null,null,null,""]
[null,null,null,null,null,null,null,null,null,""]
[null,null,null,null,null,null,null,null,null,""]
[null,null,null,null,null,null,null,null,null,""]
[null,null,null,null,null,null,null,null,null,""]
[null,null,null,null,null,null,null,null,null,""]
[null,null,null,null,null,null,null,null,null,""]
[null,null,null,null,null,null,null,null,null,""]
[null,null,null,null,null,null,null,null,null,""]
[null,null,null,null,null,null,null,null,null,""]
[null,null,null,null,null,null,null,null,null,""]
[null,null,null,null,null,null,null,null,null,""]
[null,null,null,null,null,null,null,null,null,""]
[null,null,null,null,null,null,null,null,null,""]
[null,null,null,null,null,null,null,null,null,""]
[null,null,null,null,null,null,null,null,null,""]
[null,null,null,null,null,null,null,null,null,""]
[null,null,null,null,null,null,null,null,null,""]
[null,null,null,null,null,null,null,null,null,""]
[null,null,null,null,null,null,null,null,null,""]
[null,null,null,null,null,null,null,null,null,""]
[null,null,null,null,null,null,null,null,null,""]
[null,null,null,null,null,null,null,null,null,""]
[null,null,null,null,null,null,null,null,null,""]
[null,null,null,null,null,null,null,null,null,""]
[null,null,null,null,null,null,null,null,null,""]
[null,null,null,null,null,null,null,null,null,""]
[null,null,null,null,null,null,null,null,null,""]
[null,null,null,null,null,null,null,null,null,""]
[null,null,null,null,null,null,null,null,null,""]
[null,null,null,null,null,null,null,null,null,""]
[null,null,null,null,null,null,null,null,null,""]
[null,null,null,null,null,null,null,null,null,""]
[null,null,null,null,null,null,null,null,null,""]
[null,null,null,null,null,null,null,null,null,""]
[null,null,null,null,null,null,null,null,null,""]
[null,null,null,null,null,null,null,null,null,""]
[null,null,null,null,null,null,null,null,null,""]
[null,null,null,null,null,null,null,null,null,""]
[null,null,null,null,null,null,null,null,null,{"$f":"IF(H1111<>\"\",IF(OR(H1111=\"Bridge\",H1111=\"Mast Arm\",H1111=\"Sign Truss\",H1111=\"Temporary Signal\"),\"Vertical\",\"Horizontal\"),\"\")","v":""}]
[null,null,null,null,null,null,null,null,null,""]
[null,null,null,null,null,null,null,null,null,""]
[null,null,null,null,null,null,null,null,null,""]
[null,null,null,null,null,null,null,null,null,""]
[null,null,null,null,null,null,null,null,null,""]
[null,null,null,null,null,null,null,null,null,""]
[null,null,null,null,null,null,null,null,null,""]
[null,null,null,null,null,null,null,null,null,""]
[null,null,null,null,null,null,null,null,null,""]
[null,null,null,null,null,null,null,null,null,""]
[null,null,null,null,null,null,null,null,null,""]
[null,null,null,null,null,null,null,null,null,""]
[null,null,null,null,null,null,null,null,null,""]
[null,null,null,null,null,null,null,null,null,""]
[null,null,null,null,null,null,null,null,null,""]
[null,null,null,null,null,null,null,null,null,""]
[null,null,null,null,null,null,null,null,null,""]
[null,null,null,null,null,null,null,null,null,""]
[null,null,null,null,null,null,null,null,null,""]
[null,null,null,null,null,null,null,null,null,""]
[null,null,null,null,null,null,null,null,null,""]
[null,null,null,null,null,null,null,null,null,""]
[null,null,null,null,null,null,null,null,null,""]
[null,null,null,null,null,null,null,null,null,""]
[null,null,null,null,null,null,null,null,null,""]
[null,null,null,null,null,null,null,null,null,""]
[null,null,null,null,null,null,null,null,null,""]
[null,null,null,null,null,null,null,null,null,""]
[null,null,null,null,null,null,null,null,null,""]
[null,null,null,null,null,null,null,null,null,""]
[null,null,null,null,null,null,null,null,null,""]
[null,null,null,null,null,null,null,null,null,""]
[null,null,null,null,null,null,null,null,null,""]
[null,null,null,null,null,null,null,null,null,""]
[null,null,null,null,null,null,null,null,null,""]
[null,null,null,null,null,null,null,null,null,""]
[null,null,null,null,null,null,null,null,null,""]
[null,null,null,null,null,null,null,null,null,""]
[null,null,null,null,null,null,null,null,null,""]
[null,null,null,null,null,null,null,null,null,""]
[null,null,null,null,null,null,null,null,null,""]
[null,null,null,null,null,null,null,null,null,""]
[null,null,null,null,null,null,null,null,null,""]
[null,null,null,null,null,null,null,null,null,""]
[null,null,null,null,null,null,null,null,null,""]
[null,null,null,null,null,null,null,null,null,""]
[null,null,null,null,null,null,null,null,null,""]
[null,null,null,null,null,null,null,null,null,""]
[null,null,null,null,null,null,null,null,null,""]
[null,null,null,null,null,null,null,null,null,""]
[null,null,null,null,null,null,null,null,null,""]
[null,null,null,null,null,null,null,null,null,""]
[null,null,null,null,null,null,null,null,null,""]
[null,null,null,null,null,null,null,null,null,""]
[null,null,null,null,null,null,null,null,null,""]
[null,null,null,null,null,null,null,null,null,""]
[null,null,null,null,null,null,null,null,null,""]
[null,null,null,null,null,null,null,null,null,""]
[null,null,null,null,null,null,null,null,null,""]
[null,null,null,null,null,null,null,null,null,""]
[null,null,null,null,null,null,null,null,null,""]
[null,null,null,null,null,null,null,null,null,""]
[null,null,null,null,null,null,null,null,null,""]
[null,null,null,null,null,null,null,null,null,{"$f":"IF(H1175<>\"\",IF(OR(H1175=\"Bridge\",H1175=\"Mast Arm\",H1175=\"Sign Truss\",H1175=\"Temporary Signal\"),\"Vertical\",\"Horizontal\"),\"\")","v":""}]
[null,null,null,null,null,null,null,null,null,""]
[null,null,null,null,null,null,null,null,null,""]
[null,null,null,null,null,null,null,null,null,""]
[null,null,null,null,null,null,null,null,null,""]
[null,null,null,null,null,null,null,null,null,""]
[null,null,null,null,null,null,null,null,null,""]
[null,null,null,null,null,null,null,null,null,""]
[null,null,null,null,null,null,null,null,null,""]
[null,null,null,null,null,null,null,null,null,""]
[null,null,null,null,null,null,null,null,null,""]
[null,null,null,null,null,null,null,null,null,""]
[null,null,null,null,null,null,null,null,null,""]
[null,null,null,null,null,null,null,null,null,""]
[null,null,null,null,null,null,null,null,null,""]
[null,null,null,null,null,null,null,null,null,""]
[null,null,null,null,null,null,null,null,null,""]
[null,null,null,null,null,null,null,null,null,""]
[null,null,null,null,null,null,null,null,null,""]
[null,null,null,null,null,null,null,null,null,""]
[null,null,null,null,null,null,null,null,null,""]
[null,null,null,null,null,null,null,null,null,""]
[null,null,null,null,null,null,null,null,null,""]
[null,null,null,null,null,null,null,null,null,""]
[null,null,null,null,null,null,null,null,null,""]
[null,null,null,null,null,null,null,null,null,""]
[null,null,null,null,null,null,null,null,null,""]
[null,null,null,null,null,null,null,null,null,""]
[null,null,null,null,null,null,null,null,null,""]
[null,null,null,null,null,null,null,null,null,""]
[null,null,null,null,null,null,null,null,null,""]
[null,null,null,null,null,null,null,null,null,""]
[null,null,null,null,null,null,null,null,null,""]
[null,null,null,null,null,null,null,null,null,""]
[null,null,null,null,null,null,null,null,null,""]
[null,null,null,null,null,null,null,null,null,""]
[null,null,null,null,null,null,null,null,null,""]
[null,null,null,null,null,null,null,null,null,""]
[null,null,null,null,null,null,null,null,null,""]
[null,null,null,null,null,null,null,null,null,""]
[null,null,null,null,null,null,null,null,null,""]
[null,null,null,null,null,null,null,null,null,""]
[null,null,null,null,null,null,null,null,null,""]
[null,null,null,null,null,null,null,null,null,""]
[null,null,null,null,null,null,null,null,null,""]
[null,null,null,null,null,null,null,null,null,""]
[null,null,null,null,null,null,null,null,null,""]
[null,null,null,null,null,null,null,null,null,""]
[null,null,null,null,null,null,null,null,null,""]
[null,null,null,null,null,null,null,null,null,""]
[null,null,null,null,null,null,null,null,null,""]
[null,null,null,null,null,null,null,null,null,""]
[null,null,null,null,null,null,null,null,null,""]
[null,null,null,null,null,null,null,null,null,""]
[null,null,null,null,null,null,null,null,null,""]
[null,null,null,null,null,null,null,null,null,""]
[null,null,null,null,null,null,null,null,null,""]
[null,null,null,null,null,null,null,null,null,""]
[null,null,null,null,null,null,null,null,null,""]
[null,null,null,null,null,null,null,null,null,""]
[null,null,null,null,null,null,null,null,null,""]
[null,null,null,null,null,null,null,null,null,""]
[null,null,null,null,null,null,null,null,null,""]
[null,null,null,null,null,null,null,null,null,""]
[null,null,null,null,null,null,null,null,null,{"$f":"IF(H1239<>\"\",IF(OR(H1239=\"Bridge\",H1239=\"Mast Arm\",H1239=\"Sign Truss\",H1239=\"Temporary Signal\"),\"Vertical\",\"Horizontal\"),\"\")","v":""}]
[null,null,null,null,null,null,null,null,null,""]
[null,null,null,null,null,null,null,null,null,""]
[null,null,null,null,null,null,null,null,null,""]
[null,null,null,null,null,null,null,null,null,""]
[null,null,null,null,null,null,null,null,null,""]
[null,null,null,null,null,null,null,null,null,""]
[null,null,null,null,null,null,null,null,null,""]
[null,null,null,null,null,null,null,null,null,""]
[null,null,null,null,null,null,null,null,null,""]
[null,null,null,null,null,null,null,null,null,""]
[null,null,null,null,null,null,null,null,null,""]
[null,null,null,null,null,null,null,null,null,""]
[null,null,null,null,null,null,null,null,null,""]
[null,null,null,null,null,null,null,null,null,""]
[null,null,null,null,null,null,null,null,null,""]
[null,null,null,null,null,null,null,null,null,""]
[null,null,null,null,null,null,null,null,null,""]
[null,null,null,null,null,null,null,null,null,""]
[null,null,null,null,null,null,null,null,null,""]
[null,null,null,null,null,null,null,null,null,""]
[null,null,null,null,null,null,null,null,null,""]
[null,null,null,null,null,null,null,null,null,""]
[null,null,null,null,null,null,null,null,null,""]
[null,null,null,null,null,null,null,null,null,""]
[null,null,null,null,null,null,null,null,null,""]
[null,null,null,null,null,null,null,null,null,""]
[null,null,null,null,null,null,null,null,null,""]
[null,null,null,null,null,null,null,null,null,""]
[null,null,null,null,null,null,null,null,null,""]
[null,null,null,null,null,null,null,null,null,""]
[null,null,null,null,null,null,null,null,null,""]
[null,null,null,null,null,null,null,null,null,""]
[null,null,null,null,null,null,null,null,null,""]
[null,null,null,null,null,null,null,null,null,""]
[null,null,null,null,null,null,null,null,null,""]
[null,null,null,null,null,null,null,null,null,""]
[null,null,null,null,null,null,null,null,null,""]
[null,null,null,null,null,null,null,null,null,""]
[null,null,null,null,null,null,null,null,null,""]
[null,null,null,null,null,null,null,null,null,""]
[null,null,null,null,null,null,null,null,null,""]
[null,null,null,null,null,null,null,null,null,""]
[null,null,null,null,null,null,null,null,null,""]
[null,null,null,null,null,null,null,null,null,""]
[null,null,null,null,null,null,null,null,null,""]
[null,null,null,null,null,null,null,null,null,""]
[null,null,null,null,null,null,null,null,null,""]
[null,null,null,null,null,null,null,null,null,""]
[null,null,null,null,null,null,null,null,null,""]
[null,null,null,null,null,null,null,null,null,""]
[null,null,null,null,null,null,null,null,null,""]
[null,null,null,null,null,null,null,null,null,""]
[null,null,null,null,null,null,null,null,null,""]
[null,null,null,null,null,null,null,null,null,""]
[null,null,null,null,null,null,null,null,null,""]
[null,null,null,null,null,null,null,null,null,""]
[null,null,null,null,null,null,null,null,null,""]
[null,null,null,null,null,null,null,null,null,""]
[null,null,null,null,null,null,null,null,null,""]
[null,null,null,null,null,null,null,null,null,""]
[null,null,null,null,null,null,null,null,null,""]
[null,null,null,null,null,null,null,null,null,""]
[null,null,null,null,null,null,null,null,null,""]
[null,null,null,null,null,null,null,null,null,{"$f":"IF(H1303<>\"\",IF(OR(H1303=\"Bridge\",H1303=\"Mast Arm\",H1303=\"Sign Truss\",H1303=\"Temporary Signal\"),\"Vertical\",\"Horizontal\"),\"\")","v":""}]
[null,null,null,null,null,null,null,null,null,""]
[null,null,null,null,null,null,null,null,null,""]
[null,null,null,null,null,null,null,null,null,""]
[null,null,null,null,null,null,null,null,null,""]
[null,null,null,null,null,null,null,null,null,""]
[null,null,null,null,null,null,null,null,null,""]
[null,null,null,null,null,null,null,null,null,""]
[null,null,null,null,null,null,null,null,null,""]
[null,null,null,null,null,null,null,null,null,""]
[null,null,null,null,null,null,null,null,null,""]
[null,null,null,null,null,null,null,null,null,""]
[null,null,null,null,null,null,null,null,null,""]
[null,null,null,null,null,null,null,null,null,""]
[null,null,null,null,null,null,null,null,null,""]
[null,null,null,null,null,null,null,null,null,""]
[null,null,null,null,null,null,null,null,null,""]
[null,null,null,null,null,null,null,null,null,""]
[null,null,null,null,null,null,null,null,null,""]
[null,null,null,null,null,null,null,null,null,""]
[null,null,null,null,null,null,null,null,null,""]
[null,null,null,null,null,null,null,null,null,""]
[null,null,null,null,null,null,null,null,null,""]
[null,null,null,null,null,null,null,null,null,""]
[null,null,null,null,null,null,null,null,null,""]
[null,null,null,null,null,null,null,null,null,""]
[null,null,null,null,null,null,null,null,null,""]
[null,null,null,null,null,null,null,null,null,""]
[null,null,null,null,null,null,null,null,null,""]
[null,null,null,null,null,null,null,null,null,""]
[null,null,null,null,null,null,null,null,null,""]
[null,null,null,null,null,null,null,null,null,""]
[null,null,null,null,null,null,null,null,null,""]
[null,null,null,null,null,null,null,null,null,""]
[null,null,null,null,null,null,null,null,null,""]
[null,null,null,null,null,null,null,null,null,""]
[null,null,null,null,null,null,null,null,null,""]
[null,null,null,null,null,null,null,null,null,""]
[null,null,null,null,null,null,null,null,null,""]
[null,null,null,null,null,null,null,null,null,""]
[null,null,null,null,null,null,null,null,null,""]
[null,null,null,null,null,null,null,null,null,""]
[null,null,null,null,null,null,null,null,null,""]
[null,null,null,null,null,null,null,null,null,""]
[null,null,null,null,null,null,null,null,null,""]
[null,null,null,null,null,null,null,null,null,""]
[null,null,null,null,null,null,null,null,null,""]
[null,null,null,null,null,null,null,null,null,""]
[null,null,null,null,null,null,null,null,null,""]
[null,null,null,null,null,null,null,null,null,""]
[null,null,null,null,null,null,null,null,null,""]
[null,null,null,null,null,null,null,null,null,""]
[null,null,null,null,null,null,null,null,null,""]
[null,null,null,null,null,null,null,null,null,""]
[null,null,null,null,null,null,null,null,null,""]
[null,null,null,null,null,null,null,null,null,""]
[null,null,null,null,null,null,null,null,null,""]
[null,null,null,null,null,null,null,null,null,""]
[null,null,null,null,null,null,null,null,null,""]
[null,null,null,null,null,null,null,null,null,""]
[null,null,null,null,null,null,null,null,null,""]
[null,null,null,null,null,null,null,null,null,""]
[null,null,null,null,null,null,null,null,null,""]
[null,null,null,null,null,null,null,null,null,""]
[null,null,null,null,null,null,null,null,null,{"$f":"IF(H1367<>\"\",IF(OR(H1367=\"Bridge\",H1367=\"Mast Arm\",H1367=\"Sign Truss\",H1367=\"Temporary Signal\"),\"Vertical\",\"Horizontal\"),\"\")","v":""}]
[null,null,null,null,null,null,null,null,null,""]
[null,null,null,null,null,null,null,null,null,""]
[null,null,null,null,null,null,null,null,null,""]
[null,null,null,null,null,null,null,null,null,""]
[null,null,null,null,null,null,null,null,null,""]
[null,null,null,null,null,null,null,null,null,""]
[null,null,null,null,null,null,null,null,null,""]
[null,null,null,null,null,null,null,null,null,""]
[null,null,null,null,null,null,null,null,null,""]
[null,null,null,null,null,null,null,null,null,""]
[null,null,null,null,null,null,null,null,null,""]
[null,null,null,null,null,null,null,null,null,""]
[null,null,null,null,null,null,null,null,null,""]
[null,null,null,null,null,null,null,null,null,""]
[null,null,null,null,null,null,null,null,null,""]
[null,null,null,null,null,null,null,null,null,""]
[null,null,null,null,null,null,null,null,null,""]
[null,null,null,null,null,null,null,null,null,""]
[null,null,null,null,null,null,null,null,null,""]
[null,null,null,null,null,null,null,null,null,""]
[null,null,null,null,null,null,null,null,null,""]
[null,null,null,null,null,null,null,null,null,""]
[null,null,null,null,null,null,null,null,null,""]
[null,null,null,null,null,null,null,null,null,""]
[null,null,null,null,null,null,null,null,null,""]
[null,null,null,null,null,null,null,null,null,""]
[null,null,null,null,null,null,null,null,null,""]
[null,null,null,null,null,null,null,null,null,""]
[null,null,null,null,null,null,null,null,null,""]
[null,null,null,null,null,null,null,null,null,""]
[null,null,null,null,null,null,null,null,null,""]
[null,null,null,null,null,null,null,null,null,""]
[null,null,null,null,null,null,null,null,null,""]
[null,null,null,null,null,null,null,null,null,""]
[null,null,null,null,null,null,null,null,null,""]
[null,null,null,null,null,null,null,null,null,""]
[null,null,null,null,null,null,null,null,null,""]
[null,null,null,null,null,null,null,null,null,""]
[null,null,null,null,null,null,null,null,null,""]
[null,null,null,null,null,null,null,null,null,""]
[null,null,null,null,null,null,null,null,null,""]
[null,null,null,null,null,null,null,null,null,""]
[null,null,null,null,null,null,null,null,null,""]
[null,null,null,null,null,null,null,null,null,""]
[null,null,null,null,null,null,null,null,null,""]
[null,null,null,null,null,null,null,null,null,""]
[null,null,null,null,null,null,null,null,null,""]
[null,null,null,null,null,null,null,null,null,""]
[null,null,null,null,null,null,null,null,null,""]
[null,null,null,null,null,null,null,null,null,""]
[null,null,null,null,null,null,null,null,null,""]
[null,null,null,null,null,null,null,null,null,""]
[null,null,null,null,null,null,null,null,null,""]
[null,null,null,null,null,null,null,null,null,""]
[null,null,null,null,null,null,null,null,null,""]
[null,null,null,null,null,null,null,null,null,""]
[null,null,null,null,null,null,null,null,null,""]
[null,null,null,null,null,null,null,null,null,""]
[null,null,null,null,null,null,null,null,null,""]
[null,null,null,null,null,null,null,null,null,""]
[null,null,null,null,null,null,null,null,null,""]
[null,null,null,null,null,null,null,null,null,""]
[null,null,null,null,null,null,null,null,null,""]
[null,null,null,null,null,null,null,null,null,{"$f":"IF(H1431<>\"\",IF(OR(H1431=\"Bridge\",H1431=\"Mast Arm\",H1431=\"Sign Truss\",H1431=\"Temporary Signal\"),\"Vertical\",\"Horizontal\"),\"\")","v":""}]
[null,null,null,null,null,null,null,null,null,""]
[null,null,null,null,null,null,null,null,null,""]
[null,null,null,null,null,null,null,null,null,""]
[null,null,null,null,null,null,null,null,null,""]
[null,null,null,null,null,null,null,null,null,""]
[null,null,null,null,null,null,null,null,null,""]
[null,null,null,null,null,null,null,null,null,""]
[null,null,null,null,null,null,null,null,null,""]
[null,null,null,null,null,null,null,null,null,""]
[null,null,null,null,null,null,null,null,null,""]
[null,null,null,null,null,null,null,null,null,""]
[null,null,null,null,null,null,null,null,null,""]
[null,null,null,null,null,null,null,null,null,""]
[null,null,null,null,null,null,null,null,null,""]
[null,null,null,null,null,null,null,null,null,""]
[null,null,null,null,null,null,null,null,null,""]
[null,null,null,null,null,null,null,null,null,""]
[null,null,null,null,null,null,null,null,null,""]
[null,null,null,null,null,null,null,null,null,""]
[null,null,null,null,null,null,null,null,null,""]
[null,null,null,null,null,null,null,null,null,""]
[null,null,null,null,null,null,null,null,null,""]
[null,null,null,null,null,null,null,null,null,""]
[null,null,null,null,null,null,null,null,null,""]
[null,null,null,null,null,null,null,null,null,""]
[null,null,null,null,null,null,null,null,null,""]
[null,null,null,null,null,null,null,null,null,""]
[null,null,null,null,null,null,null,null,null,""]
[null,null,null,null,null,null,null,null,null,""]
[null,null,null,null,null,null,null,null,null,""]
[null,null,null,null,null,null,null,null,null,""]
[null,null,null,null,null,null,null,null,null,""]
[null,null,null,null,null,null,null,null,null,""]
[null,null,null,null,null,null,null,null,null,""]
[null,null,null,null,null,null,null,null,null,""]
[null,null,null,null,null,null,null,null,null,""]
[null,null,null,null,null,null,null,null,null,""]
[null,null,null,null,null,null,null,null,null,""]
[null,null,null,null,null,null,null,null,null,""]
[null,null,null,null,null,null,null,null,null,""]
[null,null,null,null,null,null,null,null,null,""]
[null,null,null,null,null,null,null,null,null,""]
[null,null,null,null,null,null,null,null,null,""]
[null,null,null,null,null,null,null,null,null,""]
[null,null,null,null,null,null,null,null,null,""]
[null,null,null,null,null,null,null,null,null,""]
[null,null,null,null,null,null,null,null,null,""]
[null,null,null,null,null,null,null,null,null,""]
[null,null,null,null,null,null,null,null,null,""]
[null,null,null,null,null,null,null,null,null,""]
[null,null,null,null,null,null,null,null,null,""]
[null,null,null,null,null,null,null,null,null,""]
[null,null,null,null,null,null,null,null,null,""]
[null,null,null,null,null,null,null,null,null,""]
[null,null,null,null,null,null,null,null,null,""]
[null,null,null,null,null,null,null,null,null,""]
[null,null,null,null,null,null,null,null,null,""]
[null,null,null,null,null,null,null,null,null,""]
[null,null,null,null,null,null,null,null,null,""]
[null,null,null,null,null,null,null,null,null,""]
[null,null,null,null,null,null,null,null,null,""]
[null,null,null,null,null,null,null,null,null,""]
[null,null,null,null,null,null,null,null,null,""]
[null,null,null,null,null,null,null,null,null,{"$f":"IF(H1495<>\"\",IF(OR(H1495=\"Bridge\",H1495=\"Mast Arm\",H1495=\"Sign Truss\",H1495=\"Temporary Signal\"),\"Vertical\",\"Horizontal\"),\"\")","v":""}]
[null,null,null,null,null,null,null,null,null,""]
[null,null,null,null,null,null,null,null,null,""]
[null,null,null,null,null,null,null,null,null,""]
[null,null,null,null,null,null,null,null,null,""]
[null,null,null,null,null,null,null,null,null,""]
[null,null,null,null,null,null,null,null,null,""]
[null,null,null,null,null,null,null,null,null,""]
[null,null,null,null,null,null,null,null,null,""]
[null,null,null,null,null,null,null,null,null,""]
[null,null,null,null,null,null,null,null,null,""]
[null,null,null,null,null,null,null,null,null,""]
[null,null,null,null,null,null,null,null,null,""]
[null,null,null,null,null,null,null,null,null,""]
[null,null,null,null,null,null,null,null,null,""]
[null,null,null,null,null,null,null,null,null,""]
[null,null,null,null,null,null,null,null,null,""]
[null,null,null,null,null,null,null,null,null,""]
[null,null,null,null,null,null,null,null,null,""]
[null,null,null,null,null,null,null,null,null,""]
[null,null,null,null,null,null,null,null,null,""]
[null,null,null,null,null,null,null,null,null,""]
[null,null,null,null,null,null,null,null,null,""]
[null,null,null,null,null,null,null,null,null,""]
[null,null,null,null,null,null,null,null,null,""]
[null,null,null,null,null,null,null,null,null,""]
[null,null,null,null,null,null,null,null,null,""]
[null,null,null,null,null,null,null,null,null,""]
[null,null,null,null,null,null,null,null,null,""]
[null,null,null,null,null,null,null,null,null,""]
[null,null,null,null,null,null,null,null,null,""]
[null,null,null,null,null,null,null,null,null,""]
[null,null,null,null,null,null,null,null,null,""]
[null,null,null,null,null,null,null,null,null,""]
[null,null,null,null,null,null,null,null,null,""]
[null,null,null,null,null,null,null,null,null,""]
[null,null,null,null,null,null,null,null,null,""]
[null,null,null,null,null,null,null,null,null,""]
[null,null,null,null,null,null,null,null,null,""]
[null,null,null,null,null,null,null,null,null,""]
[null,null,null,null,null,null,null,null,null,""]
[null,null,null,null,null,null,null,null,null,""]
[null,null,null,null,null,null,null,null,null,""]
[null,null,null,null,null,null,null,null,null,""]
[null,null,null,null,null,null,null,null,null,""]
[null,null,null,null,null,null,null,null,null,""]
[null,null,null,null,null,null,null,null,null,""]
[null,null,null,null,null,null,null,null,null,""]
[null,null,null,null,null,null,null,null,null,""]
[null,null,null,null,null,null,null,null,null,""]
[null,null,null,null,null,null,null,null,null,""]
[null,null,null,null,null,null,null,null,null,""]
[null,null,null,null,null,null,null,null,null,""]
[null,null,null,null,null,null,null,null,null,""]
[null,null,null,null,null,null,null,null,null,""]
[null,null,null,null,null,null,null,null,null,""]
[null,null,null,null,null,null,null,null,null,""]
[null,null,null,null,null,null,null,null,null,""]
[null,null,null,null,null,null,null,null,null,""]
[null,null,null,null,null,null,null,null,null,""]
[null,null,null,null,null,null,null,null,null,""]
[null,null,null,null,null,null,null,null,null,""]
[null,null,null,null,null,null,null,null,null,""]
[null,null,null,null,null,null,null,null,null,""]
[null,null,null,null,null,null,null,null,null,{"$f":"IF(H1559<>\"\",IF(OR(H1559=\"Bridge\",H1559=\"Mast Arm\",H1559=\"Sign Truss\",H1559=\"Temporary Signal\"),\"Vertical\",\"Horizontal\"),\"\")","v":""}]
[null,null,null,null,null,null,null,null,null,""]
[null,null,null,null,null,null,null,null,null,""]
[null,null,null,null,null,null,null,null,null,""]
[null,null,null,null,null,null,null,null,null,""]
[null,null,null,null,null,null,null,null,null,""]
[null,null,null,null,null,null,null,null,null,""]
[null,null,null,null,null,null,null,null,null,""]
[null,null,null,null,null,null,null,null,null,""]
[null,null,null,null,null,null,null,null,null,""]
[null,null,null,null,null,null,null,null,null,""]
[null,null,null,null,null,null,null,null,null,""]
[null,null,null,null,null,null,null,null,null,""]
[null,null,null,null,null,null,null,null,null,""]
[null,null,null,null,null,null,null,null,null,""]
[null,null,null,null,null,null,null,null,null,""]
[null,null,null,null,null,null,null,null,null,""]
[null,null,null,null,null,null,null,null,null,""]
[null,null,null,null,null,null,null,null,null,""]
[null,null,null,null,null,null,null,null,null,""]
[null,null,null,null,null,null,null,null,null,""]
[null,null,null,null,null,null,null,null,null,""]
[null,null,null,null,null,null,null,null,null,""]
[null,null,null,null,null,null,null,null,null,""]
[null,null,null,null,null,null,null,null,null,""]
[null,null,null,null,null,null,null,null,null,""]
[null,null,null,null,null,null,null,null,null,""]
[null,null,null,null,null,null,null,null,null,""]
[null,null,null,null,null,null,null,null,null,""]
[null,null,null,null,null,null,null,null,null,""]
[null,null,null,null,null,null,null,null,null,""]
[null,null,null,null,null,null,null,null,null,""]
[null,null,null,null,null,null,null,null,null,""]
[null,null,null,null,null,null,null,null,null,""]
[null,null,null,null,null,null,null,null,null,""]
[null,null,null,null,null,null,null,null,null,""]
[null,null,null,null,null,null,null,null,null,""]
[null,null,null,null,null,null,null,null,null,""]
[null,null,null,null,null,null,null,null,null,""]
[null,null,null,null,null,null,null,null,null,""]
[null,null,null,null,null,null,null,null,null,""]
[null,null,null,null,null,null,null,null,null,""]
[null,null,null,null,null,null,null,null,null,""]
[null,null,null,null,null,null,null,null,null,""]
[null,null,null,null,null,null,null,null,null,""]
[null,null,null,null,null,null,null,null,null,""]
[null,null,null,null,null,null,null,null,null,""]
[null,null,null,null,null,null,null,null,null,""]
[null,null,null,null,null,null,null,null,null,""]
[null,null,null,null,null,null,null,null,null,""]
[null,null,null,null,null,null,null,null,null,""]
[null,null,null,null,null,null,null,null,null,""]
[null,null,null,null,null,null,null,null,null,""]
[null,null,null,null,null,null,null,null,null,""]
[null,null,null,null,null,null,null,null,null,""]
[null,null,null,null,null,null,null,null,null,""]
[null,null,null,null,null,null,null,null,null,""]
[null,null,null,null,null,null,null,null,null,""]
[null,null,null,null,null,null,null,null,null,""]
[null,null,null,null,null,null,null,null,null,""]
[null,null,null,null,null,null,null,null,null,""]
[null,null,null,null,null,null,null,null,null,""]
[null,null,null,null,null,null,null,null,null,""]
[null,null,null,null,null,null,null,null,null,""]
[null,null,null,null,null,null,null,null,null,{"$f":"IF(H1623<>\"\",IF(OR(H1623=\"Bridge\",H1623=\"Mast Arm\",H1623=\"Sign Truss\",H1623=\"Temporary Signal\"),\"Vertical\",\"Horizontal\"),\"\")","v":""}]
[null,null,null,null,null,null,null,null,null,""]
[null,null,null,null,null,null,null,null,null,""]
[null,null,null,null,null,null,null,null,null,""]
[null,null,null,null,null,null,null,null,null,""]
[null,null,null,null,null,null,null,null,null,""]
[null,null,null,null,null,null,null,null,null,""]
[null,null,null,null,null,null,null,null,null,""]
[null,null,null,null,null,null,null,null,null,""]
[null,null,null,null,null,null,null,null,null,""]
[null,null,null,null,null,null,null,null,null,""]
[null,null,null,null,null,null,null,null,null,""]
[null,null,null,null,null,null,null,null,null,""]
[null,null,null,null,null,null,null,null,null,""]
[null,null,null,null,null,null,null,null,null,""]
[null,null,null,null,null,null,null,null,null,""]
[null,null,null,null,null,null,null,null,null,""]
[null,null,null,null,null,null,null,null,null,""]
[null,null,null,null,null,null,null,null,null,""]
[null,null,null,null,null,null,null,null,null,""]
[null,null,null,null,null,null,null,null,null,""]
[null,null,null,null,null,null,null,null,null,""]
[null,null,null,null,null,null,null,null,null,""]
[null,null,null,null,null,null,null,null,null,""]
[null,null,null,null,null,null,null,null,null,""]
[null,null,null,null,null,null,null,null,null,""]
[null,null,null,null,null,null,null,null,null,""]
[null,null,null,null,null,null,null,null,null,""]
[null,null,null,null,null,null,null,null,null,""]
[null,null,null,null,null,null,null,null,null,""]
[null,null,null,null,null,null,null,null,null,""]
[null,null,null,null,null,null,null,null,null,""]
[null,null,null,null,null,null,null,null,null,""]
[null,null,null,null,null,null,null,null,null,""]
[null,null,null,null,null,null,null,null,null,""]
[null,null,null,null,null,null,null,null,null,""]
[null,null,null,null,null,null,null,null,null,""]
[null,null,null,null,null,null,null,null,null,""]
[null,null,null,null,null,null,null,null,null,""]
[null,null,null,null,null,null,null,null,null,""]
[null,null,null,null,null,null,null,null,null,""]
[null,null,null,null,null,null,null,null,null,""]
[null,null,null,null,null,null,null,null,null,""]
[null,null,null,null,null,null,null,null,null,""]
[null,null,null,null,null,null,null,null,null,""]
[null,null,null,null,null,null,null,null,null,""]
[null,null,null,null,null,null,null,null,null,""]
[null,null,null,null,null,null,null,null,null,""]
[null,null,null,null,null,null,null,null,null,""]
[null,null,null,null,null,null,null,null,null,""]
[null,null,null,null,null,null,null,null,null,""]
[null,null,null,null,null,null,null,null,null,""]
[null,null,null,null,null,null,null,null,null,""]
[null,null,null,null,null,null,null,null,null,""]
[null,null,null,null,null,null,null,null,null,""]
[null,null,null,null,null,null,null,null,null,""]
[null,null,null,null,null,null,null,null,null,""]
[null,null,null,null,null,null,null,null,null,""]
[null,null,null,null,null,null,null,null,null,""]
[null,null,null,null,null,null,null,null,null,""]
[null,null,null,null,null,null,null,null,null,""]
[null,null,null,null,null,null,null,null,null,""]
[null,null,null,null,null,null,null,null,null,""]
[null,null,null,null,null,null,null,null,null,""]
[null,null,null,null,null,null,null,null,null,{"$f":"IF(H1687<>\"\",IF(OR(H1687=\"Bridge\",H1687=\"Mast Arm\",H1687=\"Sign Truss\",H1687=\"Temporary Signal\"),\"Vertical\",\"Horizontal\"),\"\")","v":""}]
[null,null,null,null,null,null,null,null,null,""]
[null,null,null,null,null,null,null,null,null,""]
[null,null,null,null,null,null,null,null,null,""]
[null,null,null,null,null,null,null,null,null,""]
[null,null,null,null,null,null,null,null,null,""]
[null,null,null,null,null,null,null,null,null,""]
[null,null,null,null,null,null,null,null,null,""]
[null,null,null,null,null,null,null,null,null,""]
[null,null,null,null,null,null,null,null,null,""]
[null,null,null,null,null,null,null,null,null,""]
[null,null,null,null,null,null,null,null,null,""]
[null,null,null,null,null,null,null,null,null,""]
[null,null,null,null,null,null,null,null,null,""]
[null,null,null,null,null,null,null,null,null,""]
[null,null,null,null,null,null,null,null,null,""]
[null,null,null,null,null,null,null,null,null,""]
[null,null,null,null,null,null,null,null,null,""]
[null,null,null,null,null,null,null,null,null,""]
[null,null,null,null,null,null,null,null,null,""]
[null,null,null,null,null,null,null,null,null,""]
[null,null,null,null,null,null,null,null,null,""]
[null,null,null,null,null,null,null,null,null,""]
[null,null,null,null,null,null,null,null,null,""]
[null,null,null,null,null,null,null,null,null,""]
[null,null,null,null,null,null,null,null,null,""]
[null,null,null,null,null,null,null,null,null,""]
[null,null,null,null,null,null,null,null,null,""]
[null,null,null,null,null,null,null,null,null,""]
[null,null,null,null,null,null,null,null,null,""]
[null,null,null,null,null,null,null,null,null,""]
[null,null,null,null,null,null,null,null,null,""]
[null,null,null,null,null,null,null,null,null,""]
[null,null,null,null,null,null,null,null,null,""]
[null,null,null,null,null,null,null,null,null,""]
[null,null,null,null,null,null,null,null,null,""]
[null,null,null,null,null,null,null,null,null,""]
[null,null,null,null,null,null,null,null,null,""]
[null,null,null,null,null,null,null,null,null,""]
[null,null,null,null,null,null,null,null,null,""]
[null,null,null,null,null,null,null,null,null,""]
[null,null,null,null,null,null,null,null,null,""]
[null,null,null,null,null,null,null,null,null,""]
[null,null,null,null,null,null,null,null,null,""]
[null,null,null,null,null,null,null,null,null,""]
[null,null,null,null,null,null,null,null,null,""]
[null,null,null,null,null,null,null,null,null,""]
[null,null,null,null,null,null,null,null,null,""]
[null,null,null,null,null,null,null,null,null,""]
[null,null,null,null,null,null,null,null,null,""]
[null,null,null,null,null,null,null,null,null,""]
[null,null,null,null,null,null,null,null,null,""]
[null,null,null,null,null,null,null,null,null,""]
[null,null,null,null,null,null,null,null,null,""]
[null,null,null,null,null,null,null,null,null,""]
[null,null,null,null,null,null,null,null,null,""]
[null,null,null,null,null,null,null,null,null,""]
[null,null,null,null,null,null,null,null,null,""]
[null,null,null,null,null,null,null,null,null,""]
[null,null,null,null,null,null,null,null,null,""]
[null,null,null,null,null,null,null,null,null,""]
[null,null,null,null,null,null,null,null,null,""]
[null,null,null,null,null,null,null,null,null,""]
[null,null,null,null,null,null,null,null,null,""]
[null,null,null,null,null,null,null,null,null,{"$f":"IF(H1751<>\"\",IF(OR(H1751=\"Bridge\",H1751=\"Mast Arm\",H1751=\"Sign Truss\",H1751=\"Temporary Signal\"),\"Vertical\",\"Horizontal\"),\"\")","v":""}]
[null,null,null,null,null,null,null,null,null,""]
[null,null,null,null,null,null,null,null,null,""]
[null,null,null,null,null,null,null,null,null,""]
[null,null,null,null,null,null,null,null,null,""]
[null,null,null,null,null,null,null,null,null,""]
[null,null,null,null,null,null,null,null,null,""]
[null,null,null,null,null,null,null,null,null,""]
[null,null,null,null,null,null,null,null,null,""]
[null,null,null,null,null,null,null,null,null,""]
[null,null,null,null,null,null,null,null,null,""]
[null,null,null,null,null,null,null,null,null,""]
[null,null,null,null,null,null,null,null,null,""]
[null,null,null,null,null,null,null,null,null,""]
[null,null,null,null,null,null,null,null,null,""]
[null,null,null,null,null,null,null,null,null,""]
[null,null,null,null,null,null,null,null,null,""]
[null,null,null,null,null,null,null,null,null,""]
[null,null,null,null,null,null,null,null,null,""]
[null,null,null,null,null,null,null,null,null,""]
[null,null,null,null,null,null,null,null,null,""]
[null,null,null,null,null,null,null,null,null,""]
[null,null,null,null,null,null,null,null,null,""]
[null,null,null,null,null,null,null,null,null,""]
[null,null,null,null,null,null,null,null,null,""]
[null,null,null,null,null,null,null,null,null,""]
[null,null,null,null,null,null,null,null,null,""]
[null,null,null,null,null,null,null,null,null,""]
[null,null,null,null,null,null,null,null,null,""]
[null,null,null,null,null,null,null,null,null,""]
[null,null,null,null,null,null,null,null,null,""]
[null,null,null,null,null,null,null,null,null,""]
[null,null,null,null,null,null,null,null,null,""]
[null,null,null,null,null,null,null,null,null,""]
[null,null,null,null,null,null,null,null,null,""]
[null,null,null,null,null,null,null,null,null,""]
[null,null,null,null,null,null,null,null,null,""]
[null,null,null,null,null,null,null,null,null,""]
[null,null,null,null,null,null,null,null,null,""]
[null,null,null,null,null,null,null,null,null,""]
[null,null,null,null,null,null,null,null,null,""]
[null,null,null,null,null,null,null,null,null,""]
[null,null,null,null,null,null,null,null,null,""]
[null,null,null,null,null,null,null,null,null,""]
[null,null,null,null,null,null,null,null,null,""]
[null,null,null,null,null,null,null,null,null,""]
[null,null,null,null,null,null,null,null,null,""]
[null,null,null,null,null,null,null,null,null,""]
[null,null,null,null,null,null,null,null,null,""]
[null,null,null,null,null,null,null,null,null,""]
[null,null,null,null,null,null,null,null,null,""]
[null,null,null,null,null,null,null,null,null,""]
[null,null,null,null,null,null,null,null,null,""]
[null,null,null,null,null,null,null,null,null,""]
[null,null,null,null,null,null,null,null,null,""]
[null,null,null,null,null,null,null,null,null,""]
[null,null,null,null,null,null,null,null,null,""]
[null,null,null,null,null,null,null,null,null,""]
[null,null,null,null,null,null,null,null,null,""]
[null,null,null,null,null,null,null,null,null,""]
[null,null,null,null,null,null,null,null,null,""]
[null,null,null,null,null,null,null,null,null,""]
[null,null,null,null,null,null,null,null,null,""]
[null,null,null,null,null,null,null,null,null,""]
[null,null,null,null,null,null,null,null,null,{"$f":"IF(H1815<>\"\",IF(OR(H1815=\"Bridge\",H1815=\"Mast Arm\",H1815=\"Sign Truss\",H1815=\"Temporary Signal\"),\"Vertical\",\"Horizontal\"),\"\")","v":""}]
[null,null,null,null,null,null,null,null,null,""]
[null,null,null,null,null,null,null,null,null,""]
[null,null,null,null,null,null,null,null,null,""]
[null,null,null,null,null,null,null,null,null,""]
[null,null,null,null,null,null,null,null,null,""]
[null,null,null,null,null,null,null,null,null,""]
[null,null,null,null,null,null,null,null,null,""]
[null,null,null,null,null,null,null,null,null,""]
[null,null,null,null,null,null,null,null,null,""]
[null,null,null,null,null,null,null,null,null,""]
[null,null,null,null,null,null,null,null,null,""]
[null,null,null,null,null,null,null,null,null,""]
[null,null,null,null,null,null,null,null,null,""]
[null,null,null,null,null,null,null,null,null,""]
[null,null,null,null,null,null,null,null,null,""]
[null,null,null,null,null,null,null,null,null,""]
[null,null,null,null,null,null,null,null,null,""]
[null,null,null,null,null,null,null,null,null,""]
[null,null,null,null,null,null,null,null,null,""]
[null,null,null,null,null,null,null,null,null,""]
[null,null,null,null,null,null,null,null,null,""]
[null,null,null,null,null,null,null,null,null,""]
[null,null,null,null,null,null,null,null,null,""]
[null,null,null,null,null,null,null,null,null,""]
[null,null,null,null,null,null,null,null,null,""]
[null,null,null,null,null,null,null,null,null,""]
[null,null,null,null,null,null,null,null,null,""]
[null,null,null,null,null,null,null,null,null,""]
[null,null,null,null,null,null,null,null,null,""]
[null,null,null,null,null,null,null,null,null,""]
[null,null,null,null,null,null,null,null,null,""]
[null,null,null,null,null,null,null,null,null,""]
[null,null,null,null,null,null,null,null,null,""]
[null,null,null,null,null,null,null,null,null,""]
[null,null,null,null,null,null,null,null,null,""]
[null,null,null,null,null,null,null,null,null,""]
[null,null,null,null,null,null,null,null,null,""]
[null,null,null,null,null,null,null,null,null,""]
[null,null,null,null,null,null,null,null,null,""]
[null,null,null,null,null,null,null,null,null,""]
[null,null,null,null,null,null,null,null,null,""]
[null,null,null,null,null,null,null,null,null,""]
[null,null,null,null,null,null,null,null,null,""]
[null,null,null,null,null,null,null,null,null,""]
[null,null,null,null,null,null,null,null,null,""]
[null,null,null,null,null,null,null,null,null,""]
[null,null,null,null,null,null,null,null,null,""]
[null,null,null,null,null,null,null,null,null,""]
[null,null,null,null,null,null,null,null,null,""]
[null,null,null,null,null,null,null,null,null,""]
[null,null,null,null,null,null,null,null,null,""]
[null,null,null,null,null,null,null,null,null,""]
[null,null,null,null,null,null,null,null,null,""]
[null,null,null,null,null,null,null,null,null,""]
[null,null,null,null,null,null,null,null,null,""]
[null,null,null,null,null,null,null,null,null,""]
[null,null,null,null,null,null,null,null,null,""]
[null,null,null,null,null,null,null,null,null,""]
[null,null,null,null,null,null,null,null,null,""]
[null,null,null,null,null,null,null,null,null,""]
[null,null,null,null,null,null,null,null,null,""]
[null,null,null,null,null,null,null,null,null,""]
[null,null,null,null,null,null,null,null,null,""]
[null,null,null,null,null,null,null,null,null,{"$f":"IF(H1879<>\"\",IF(OR(H1879=\"Bridge\",H1879=\"Mast Arm\",H1879=\"Sign Truss\",H1879=\"Temporary Signal\"),\"Vertical\",\"Horizontal\"),\"\")","v":""}]
[null,null,null,null,null,null,null,null,null,""]
[null,null,null,null,null,null,null,null,null,""]
[null,null,null,null,null,null,null,null,null,""]
[null,null,null,null,null,null,null,null,null,""]
[null,null,null,null,null,null,null,null,null,""]
[null,null,null,null,null,null,null,null,null,""]
[null,null,null,null,null,null,null,null,null,""]
[null,null,null,null,null,null,null,null,null,""]
[null,null,null,null,null,null,null,null,null,""]
[null,null,null,null,null,null,null,null,null,""]
[null,null,null,null,null,null,null,null,null,""]
[null,null,null,null,null,null,null,null,null,""]
[null,null,null,null,null,null,null,null,null,""]
[null,null,null,null,null,null,null,null,null,""]
[null,null,null,null,null,null,null,null,null,""]
[null,null,null,null,null,null,null,null,null,""]
[null,null,null,null,null,null,null,null,null,""]
[null,null,null,null,null,null,null,null,null,""]
[null,null,null,null,null,null,null,null,null,""]
[null,null,null,null,null,null,null,null,null,""]
[null,null,null,null,null,null,null,null,null,""]
[null,null,null,null,null,null,null,null,null,""]
[null,null,null,null,null,null,null,null,null,""]
[null,null,null,null,null,null,null,null,null,""]
[null,null,null,null,null,null,null,null,null,""]
[null,null,null,null,null,null,null,null,null,""]
[null,null,null,null,null,null,null,null,null,""]
[null,null,null,null,null,null,null,null,null,""]
[null,null,null,null,null,null,null,null,null,""]
[null,null,null,null,null,null,null,null,null,""]
[null,null,null,null,null,null,null,null,null,""]
[null,null,null,null,null,null,null,null,null,""]
[null,null,null,null,null,null,null,null,null,""]
[null,null,null,null,null,null,null,null,null,""]
[null,null,null,null,null,null,null,null,null,""]
[null,null,null,null,null,null,null,null,null,""]
[null,null,null,null,null,null,null,null,null,""]
[null,null,null,null,null,null,null,null,null,""]
[null,null,null,null,null,null,null,null,null,""]
[null,null,null,null,null,null,null,null,null,""]
[null,null,null,null,null,null,null,null,null,""]
[null,null,null,null,null,null,null,null,null,""]
[null,null,null,null,null,null,null,null,null,""]
[null,null,null,null,null,null,null,null,null,""]
[null,null,null,null,null,null,null,null,null,""]
[null,null,null,null,null,null,null,null,null,""]
[null,null,null,null,null,null,null,null,null,""]
[null,null,null,null,null,null,null,null,null,""]
[null,null,null,null,null,null,null,null,null,""]
[null,null,null,null,null,null,null,null,null,""]
[null,null,null,null,null,null,null,null,null,""]
[null,null,null,null,null,null,null,null,null,""]
[null,null,null,null,null,null,null,null,null,""]
[null,null,null,null,null,null,null,null,null,""]
[null,null,null,null,null,null,null,null,null,""]
[null,null,null,null,null,null,null,null,null,""]
[null,null,null,null,null,null,null,null,null,""]
[null,null,null,null,null,null,null,null,null,""]
[null,null,null,null,null,null,null,null,null,""]
[null,null,null,null,null,null,null,null,null,""]
[null,null,null,null,null,null,null,null,null,""]
[null,null,null,null,null,null,null,null,null,""]
[null,null,null,null,null,null,null,null,null,""]
[null,null,null,null,null,null,null,null,null,{"$f":"IF(H1943<>\"\",IF(OR(H1943=\"Bridge\",H1943=\"Mast Arm\",H1943=\"Sign Truss\",H1943=\"Temporary Signal\"),\"Vertical\",\"Horizontal\"),\"\")","v":""}]
[null,null,null,null,null,null,null,null,null,""]
[null,null,null,null,null,null,null,null,null,""]
[null,null,null,null,null,null,null,null,null,""]
[null,null,null,null,null,null,null,null,null,""]
[null,null,null,null,null,null,null,null,null,""]
[null,null,null,null,null,null,null,null,null,""]
[null,null,null,null,null,null,null,null,null,""]
[null,null,null,null,null,null,null,null,null,""]
[null,null,null,null,null,null,null,null,null,""]
[null,null,null,null,null,null,null,null,null,""]
[null,null,null,null,null,null,null,null,null,""]
[null,null,null,null,null,null,null,null,null,""]
[null,null,null,null,null,null,null,null,null,""]
[null,null,null,null,null,null,null,null,null,""]
[null,null,null,null,null,null,null,null,null,""]
[null,null,null,null,null,null,null,null,null,""]
[null,null,null,null,null,null,null,null,null,""]
[null,null,null,null,null,null,null,null,null,""]
[null,null,null,null,null,null,null,null,null,""]
[null,null,null,null,null,null,null,null,null,""]
[null,null,null,null,null,null,null,null,null,""]
[null,null,null,null,null,null,null,null,null,""]
[null,null,null,null,null,null,null,null,null,""]
[null,null,null,null,null,null,null,null,null,""]
[null,null,null,null,null,null,null,null,null,""]
[null,null,null,null,null,null,null,null,null,""]
[null,null,null,null,null,null,null,null,null,""]
[null,null,null,null,null,null,null,null,null,""]
[null,null,null,null,null,null,null,null,null,""]
[null,null,null,null,null,null,null,null,null,""]
[null,null,null,null,null,null,null,null,null,""]
[null,null,null,null,null,null,null,null,null,""]
[null,null,null,null,null,null,null,null,null,""]
[null,null,null,null,null,null,null,null,null,""]
[null,null,null,null,null,null,null,null,null,""]
[null,null,null,null,null,null,null,null,null,""]
[null,null,null,null,null,null,null,null,null,""]
[null,null,null,null,null,null,null,null,null,""]
[null,null,null,null,null,null,null,null,null,""]
[null,null,null,null,null,null,null,null,null,""]
[null,null,null,null,null,null,null,null,null,""]
[null,null,null,null,null,null,null,null,null,""]
[null,null,null,null,null,null,null,null,null,""]
[null,null,null,null,null,null,null,null,null,""]
[null,null,null,null,null,null,null,null,null,""]
[null,null,null,null,null,null,null,null,null,""]
[null,null,null,null,null,null,null,null,null,""]
[null,null,null,null,null,null,null,null,null,""]
[null,null,null,null,null,null,null,null,null,""]
[null,null,null,null,null,null,null,null,null,""]
[null,null,null,null,null,null,null,null,null,""]
[null,null,null,null,null,null,null,null,null,""]
[null,null,null,null,null,null,null,null,null,""]
[null,null,null,null,null,null,null,null,null,""]
[null,null,null,null,null,null,null,null,null,""]
[null,null,null,null,null,null,null,null,null,""]
[null,null,null,null,null,null,null,null,null,""]
[null,null,null,null,null,null,null,null,null,""]
[null,null,null,null,null,null,null,null,null,""]
[null,null,null,null,null,null,null,null,null,""]
[null,null,null,null,null,null,null,null,null,""]
[null,null,null,null,null,null,null,null,null,""]
[null,null,null,null,null,null,null,null,null,""]
[null,null,null,null,null,null,null,null,null,{"$f":"IF(H2007<>\"\",IF(OR(H2007=\"Bridge\",H2007=\"Mast Arm\",H2007=\"Sign Truss\",H2007=\"Temporary Signal\"),\"Vertical\",\"Horizontal\"),\"\")","v":""}]
[null,null,null,null,null,null,null,null,null,""]
[null,null,null,null,null,null,null,null,null,""]
[null,null,null,null,null,null,null,null,null,""]
[null,null,null,null,null,null,null,null,null,""]
[null,null,null,null,null,null,null,null,null,""]
[null,null,null,null,null,null,null,null,null,""]
[null,null,null,null,null,null,null,null,null,""]
[null,null,null,null,null,null,null,null,null,""]
[null,null,null,null,null,null,null,null,null,""]
[null,null,null,null,null,null,null,null,null,""]
[null,null,null,null,null,null,null,null,null,""]
[null,null,null,null,null,null,null,null,null,""]
[null,null,null,null,null,null,null,null,null,""]
[null,null,null,null,null,null,null,null,null,""]
[null,null,null,null,null,null,null,null,null,""]
[null,null,null,null,null,null,null,null,null,""]
[null,null,null,null,null,null,null,null,null,""]
[null,null,null,null,null,null,null,null,null,""]
[null,null,null,null,null,null,null,null,null,""]
[null,null,null,null,null,null,null,null,null,""]
[null,null,null,null,null,null,null,null,null,""]
[null,null,null,null,null,null,null,null,null,""]
[null,null,null,null,null,null,null,null,null,""]
[null,null,null,null,null,null,null,null,null,""]
[null,null,null,null,null,null,null,null,null,""]
[null,null,null,null,null,null,null,null,null,""]
[null,null,null,null,null,null,null,null,null,""]
[null,null,null,null,null,null,null,null,null,""]
[null,null,null,null,null,null,null,null,null,""]
[null,null,null,null,null,null,null,null,null,""]
[null,null,null,null,null,null,null,null,null,""]
[null,null,null,null,null,null,null,null,null,""]
[null,null,null,null,null,null,null,null,null,""]
[null,null,null,null,null,null,null,null,null,""]
[null,null,null,null,null,null,null,null,null,""]
[null,null,null,null,null,null,null,null,null,""]
[null,null,null,null,null,null,null,null,null,""]
[null,null,null,null,null,null,null,null,null,""]
[null,null,null,null,null,null,null,null,null,""]
[null,null,null,null,null,null,null,null,null,""]
[null,null,null,null,null,null,null,null,null,""]
[null,null,null,null,null,null,null,null,null,""]
[null,null,null,null,null,null,null,null,null,""]
[null,null,null,null,null,null,null,null,null,""]
[null,null,null,null,null,null,null,null,null,""]
[null,null,null,null,null,null,null,null,null,""]
[null,null,null,null,null,null,null,null,null,""]
[null,null,null,null,null,null,null,null,null,""]
[null,null,null,null,null,null,null,null,null,""]
[null,null,null,null,null,null,null,null,null,""]
[null,null,null,null,null,null,null,null,null,""]
[null,null,null,null,null,null,null,null,null,""]
[null,null,null,null,null,null,null,null,null,""]
[null,null,null,null,null,null,null,null,null,""]
[null,null,null,null,null,null,null,null,null,""]
[null,null,null,null,null,null,null,null,null,""]
[null,null,null,null,null,null,null,null,null,""]
[null,null,null,null,null,null,null,null,null,""]
[null,null,null,null,null,null,null,null,null,""]
[null,null,null,null,null,null,null,null,null,""]
[null,null,null,null,null,null,null,null,null,""]
[null,null,null,null,null,null,null,null,null,""]
[null,null,null,null,null,null,null,null,null,""]
[null,null,null,null,null,null,null,null,null,{"$f":"IF(H2071<>\"\",IF(OR(H2071=\"Bridge\",H2071=\"Mast Arm\",H2071=\"Sign Truss\",H2071=\"Temporary Signal\"),\"Vertical\",\"Horizontal\"),\"\")","v":""}]
[null,null,null,null,null,null,null,null,null,""]
[null,null,null,null,null,null,null,null,null,""]
[null,null,null,null,null,null,null,null,null,""]
[null,null,null,null,null,null,null,null,null,""]
[null,null,null,null,null,null,null,null,null,""]
[null,null,null,null,null,null,null,null,null,""]
[null,null,null,null,null,null,null,null,null,""]
[null,null,null,null,null,null,null,null,null,""]
[null,null,null,null,null,null,null,null,null,""]
[null,null,null,null,null,null,null,null,null,""]
[null,null,null,null,null,null,null,null,null,""]
[null,null,null,null,null,null,null,null,null,""]
[null,null,null,null,null,null,null,null,null,""]
[null,null,null,null,null,null,null,null,null,""]
[null,null,null,null,null,null,null,null,null,""]
[null,null,null,null,null,null,null,null,null,""]
[null,null,null,null,null,null,null,null,null,""]
[null,null,null,null,null,null,null,null,null,""]
[null,null,null,null,null,null,null,null,null,""]
[null,null,null,null,null,null,null,null,null,""]
[null,null,null,null,null,null,null,null,null,""]
[null,null,null,null,null,null,null,null,null,""]
[null,null,null,null,null,null,null,null,null,""]
[null,null,null,null,null,null,null,null,null,""]
[null,null,null,null,null,null,null,null,null,""]
[null,null,null,null,null,null,null,null,null,""]
[null,null,null,null,null,null,null,null,null,""]
[null,null,null,null,null,null,null,null,null,""]
[null,null,null,null,null,null,null,null,null,""]
[null,null,null,null,null,null,null,null,null,""]
[null,null,null,null,null,null,null,null,null,""]
[null,null,null,null,null,null,null,null,null,""]
[null,null,null,null,null,null,null,null,null,""]
[null,null,null,null,null,null,null,null,null,""]
[null,null,null,null,null,null,null,null,null,""]
[null,null,null,null,null,null,null,null,null,""]
[null,null,null,null,null,null,null,null,null,""]
[null,null,null,null,null,null,null,null,null,""]
[null,null,null,null,null,null,null,null,null,""]
[null,null,null,null,null,null,null,null,null,""]
[null,null,null,null,null,null,null,null,null,""]
[null,null,null,null,null,null,null,null,null,""]
[null,null,null,null,null,null,null,null,null,""]
[null,null,null,null,null,null,null,null,null,""]
[null,null,null,null,null,null,null,null,null,""]
[null,null,null,null,null,null,null,null,null,""]
[null,null,null,null,null,null,null,null,null,""]
[null,null,null,null,null,null,null,null,null,""]
[null,null,null,null,null,null,null,null,null,""]
[null,null,null,null,null,null,null,null,null,""]
[null,null,null,null,null,null,null,null,null,""]
[null,null,null,null,null,null,null,null,null,""]
[null,null,null,null,null,null,null,null,null,""]
[null,null,null,null,null,null,null,null,null,""]
[null,null,null,null,null,null,null,null,null,""]
[null,null,null,null,null,null,null,null,null,""]
[null,null,null,null,null,null,null,null,null,""]
[null,null,null,null,null,null,null,null,null,""]
[null,null,null,null,null,null,null,null,null,""]
[null,null,null,null,null,null,null,null,null,""]
[null,null,null,null,null,null,null,null,null,""]
[null,null,null,null,null,null,null,null,null,""]
[null,null,null,null,null,null,null,null,null,""]
[null,null,null,null,null,null,null,null,null,{"$f":"IF(H2135<>\"\",IF(OR(H2135=\"Bridge\",H2135=\"Mast Arm\",H2135=\"Sign Truss\",H2135=\"Temporary Signal\"),\"Vertical\",\"Horizontal\"),\"\")","v":""}]
[null,null,null,null,null,null,null,null,null,""]
[null,null,null,null,null,null,null,null,null,""]
[null,null,null,null,null,null,null,null,null,""]
[null,null,null,null,null,null,null,null,null,""]
[null,null,null,null,null,null,null,null,null,""]
[null,null,null,null,null,null,null,null,null,""]
[null,null,null,null,null,null,null,null,null,""]
[null,null,null,null,null,null,null,null,null,""]
[null,null,null,null,null,null,null,null,null,""]
[null,null,null,null,null,null,null,null,null,""]
[null,null,null,null,null,null,null,null,null,""]
[null,null,null,null,null,null,null,null,null,""]
[null,null,null,null,null,null,null,null,null,""]
[null,null,null,null,null,null,null,null,null,""]
[null,null,null,null,null,null,null,null,null,""]
[null,null,null,null,null,null,null,null,null,""]
[null,null,null,null,null,null,null,null,null,""]
[null,null,null,null,null,null,null,null,null,""]
[null,null,null,null,null,null,null,null,null,""]
[null,null,null,null,null,null,null,null,null,""]
[null,null,null,null,null,null,null,null,null,""]
[null,null,null,null,null,null,null,null,null,""]
[null,null,null,null,null,null,null,null,null,""]
[null,null,null,null,null,null,null,null,null,""]
[null,null,null,null,null,null,null,null,null,""]
[null,null,null,null,null,null,null,null,null,""]
[null,null,null,null,null,null,null,null,null,""]
[null,null,null,null,null,null,null,null,null,""]
[null,null,null,null,null,null,null,null,null,""]
[null,null,null,null,null,null,null,null,null,""]
[null,null,null,null,null,null,null,null,null,""]
[null,null,null,null,null,null,null,null,null,""]
[null,null,null,null,null,null,null,null,null,""]
[null,null,null,null,null,null,null,null,null,""]
[null,null,null,null,null,null,null,null,null,""]
[null,null,null,null,null,null,null,null,null,""]
[null,null,null,null,null,null,null,null,null,""]
[null,null,null,null,null,null,null,null,null,""]
[null,null,null,null,null,null,null,null,null,""]
[null,null,null,null,null,null,null,null,null,""]
[null,null,null,null,null,null,null,null,null,""]
[null,null,null,null,null,null,null,null,null,""]
[null,null,null,null,null,null,null,null,null,""]
[null,null,null,null,null,null,null,null,null,""]
[null,null,null,null,null,null,null,null,null,""]
[null,null,null,null,null,null,null,null,null,""]
[null,null,null,null,null,null,null,null,null,""]
[null,null,null,null,null,null,null,null,null,""]
[null,null,null,null,null,null,null,null,null,""]
[null,null,null,null,null,null,null,null,null,""]
[null,null,null,null,null,null,null,null,null,""]
[null,null,null,null,null,null,null,null,null,""]
[null,null,null,null,null,null,null,null,null,""]
[null,null,null,null,null,null,null,null,null,""]
[null,null,null,null,null,null,null,null,null,""]
[null,null,null,null,null,null,null,null,null,""]
[null,null,null,null,null,null,null,null,null,""]
[null,null,null,null,null,null,null,null,null,""]
[null,null,null,null,null,null,null,null,null,""]
[null,null,null,null,null,null,null,null,null,""]
[null,null,null,null,null,null,null,null,null,""]
[null,null,null,null,null,null,null,null,null,""]
[null,null,null,null,null,null,null,null,null,""]
[null,null,null,null,null,null,null,null,null,{"$f":"IF(H2199<>\"\",IF(OR(H2199=\"Bridge\",H2199=\"Mast Arm\",H2199=\"Sign Truss\",H2199=\"Temporary Signal\"),\"Vertical\",\"Horizontal\"),\"\")","v":""}]
[null,null,null,null,null,null,null,null,null,""]
[null,null,null,null,null,null,null,null,null,""]
[null,null,null,null,null,null,null,null,null,""]
[null,null,null,null,null,null,null,null,null,""]
[null,null,null,null,null,null,null,null,null,""]
[null,null,null,null,null,null,null,null,null,""]
[null,null,null,null,null,null,null,null,null,""]
[null,null,null,null,null,null,null,null,null,""]
[null,null,null,null,null,null,null,null,null,""]
[null,null,null,null,null,null,null,null,null,""]
[null,null,null,null,null,null,null,null,null,""]
[null,null,null,null,null,null,null,null,null,""]
[null,null,null,null,null,null,null,null,null,""]
[null,null,null,null,null,null,null,null,null,""]
[null,null,null,null,null,null,null,null,null,""]
[null,null,null,null,null,null,null,null,null,""]
[null,null,null,null,null,null,null,null,null,""]
[null,null,null,null,null,null,null,null,null,""]
[null,null,null,null,null,null,null,null,null,""]
[null,null,null,null,null,null,null,null,null,""]
[null,null,null,null,null,null,null,null,null,""]
[null,null,null,null,null,null,null,null,null,""]
[null,null,null,null,null,null,null,null,null,""]
[null,null,null,null,null,null,null,null,null,""]
[null,null,null,null,null,null,null,null,null,""]
[null,null,null,null,null,null,null,null,null,""]
[null,null,null,null,null,null,null,null,null,""]
[null,null,null,null,null,null,null,null,null,""]
[null,null,null,null,null,null,null,null,null,""]
[null,null,null,null,null,null,null,null,null,""]
[null,null,null,null,null,null,null,null,null,""]
[null,null,null,null,null,null,null,null,null,""]
[null,null,null,null,null,null,null,null,null,""]
[null,null,null,null,null,null,null,null,null,""]
[null,null,null,null,null,null,null,null,null,""]
[null,null,null,null,null,null,null,null,null,""]
[null,null,null,null,null,null,null,null,null,""]
[null,null,null,null,null,null,null,null,null,""]
[null,null,null,null,null,null,null,null,null,""]
[null,null,null,null,null,null,null,null,null,""]
[null,null,null,null,null,null,null,null,null,""]
[null,null,null,null,null,null,null,null,null,""]
[null,null,null,null,null,null,null,null,null,""]
[null,null,null,null,null,null,null,null,null,""]
[null,null,null,null,null,null,null,null,null,""]
[null,null,null,null,null,null,null,null,null,""]
[null,null,null,null,null,null,null,null,null,""]
[null,null,null,null,null,null,null,null,null,""]
[null,null,null,null,null,null,null,null,null,""]
[null,null,null,null,null,null,null,null,null,""]
[null,null,null,null,null,null,null,null,null,""]
[null,null,null,null,null,null,null,null,null,""]
[null,null,null,null,null,null,null,null,null,""]
[null,null,null,null,null,null,null,null,null,""]
[null,null,null,null,null,null,null,null,null,""]
[null,null,null,null,null,null,null,null,null,""]
[null,null,null,null,null,null,null,null,null,""]
[null,null,null,null,null,null,null,null,null,""]
[null,null,null,null,null,null,null,null,null,""]
[null,null,null,null,null,null,null,null,null,""]
[null,null,null,null,null,null,null,null,null,""]
[null,null,null,null,null,null,null,null,null,""]
[null,null,null,null,null,null,null,null,null,""]
[null,null,null,null,null,null,null,null,null,{"$f":"IF(H2263<>\"\",IF(OR(H2263=\"Bridge\",H2263=\"Mast Arm\",H2263=\"Sign Truss\",H2263=\"Temporary Signal\"),\"Vertical\",\"Horizontal\"),\"\")","v":""}]
[null,null,null,null,null,null,null,null,null,""]
[null,null,null,null,null,null,null,null,null,""]
[null,null,null,null,null,null,null,null,null,""]
[null,null,null,null,null,null,null,null,null,""]
[null,null,null,null,null,null,null,null,null,""]
[null,null,null,null,null,null,null,null,null,""]
[null,null,null,null,null,null,null,null,null,""]
[null,null,null,null,null,null,null,null,null,""]
[null,null,null,null,null,null,null,null,null,""]
[null,null,null,null,null,null,null,null,null,""]
[null,null,null,null,null,null,null,null,null,""]
[null,null,null,null,null,null,null,null,null,""]
[null,null,null,null,null,null,null,null,null,""]
[null,null,null,null,null,null,null,null,null,""]
[null,null,null,null,null,null,null,null,null,""]
[null,null,null,null,null,null,null,null,null,""]
[null,null,null,null,null,null,null,null,null,""]
[null,null,null,null,null,null,null,null,null,""]
[null,null,null,null,null,null,null,null,null,""]
[null,null,null,null,null,null,null,null,null,""]
[null,null,null,null,null,null,null,null,null,""]
[null,null,null,null,null,null,null,null,null,""]
[null,null,null,null,null,null,null,null,null,""]
[null,null,null,null,null,null,null,null,null,""]
[null,null,null,null,null,null,null,null,null,""]
[null,null,null,null,null,null,null,null,null,""]
[null,null,null,null,null,null,null,null,null,""]
[null,null,null,null,null,null,null,null,null,""]
[null,null,null,null,null,null,null,null,null,""]
[null,null,null,null,null,null,null,null,null,""]
[null,null,null,null,null,null,null,null,null,""]
[null,null,null,null,null,null,null,null,null,""]
[null,null,null,null,null,null,null,null,null,""]
[null,null,null,null,null,null,null,null,null,""]
[null,null,null,null,null,null,null,null,null,""]
[null,null,null,null,null,null,null,null,null,""]
[null,null,null,null,null,null,null,null,null,""]
[null,null,null,null,null,null,null,null,null,""]
[null,null,null,null,null,null,null,null,null,""]
[null,null,null,null,null,null,null,null,null,""]
[null,null,null,null,null,null,null,null,null,""]
[null,null,null,null,null,null,null,null,null,""]
[null,null,null,null,null,null,null,null,null,""]
[null,null,null,null,null,null,null,null,null,""]
[null,null,null,null,null,null,null,null,null,""]
[null,null,null,null,null,null,null,null,null,""]
[null,null,null,null,null,null,null,null,null,""]
[null,null,null,null,null,null,null,null,null,""]
[null,null,null,null,null,null,null,null,null,""]
[null,null,null,null,null,null,null,null,null,""]
[null,null,null,null,null,null,null,null,null,""]
[null,null,null,null,null,null,null,null,null,""]
[null,null,null,null,null,null,null,null,null,""]
[null,null,null,null,null,null,null,null,null,""]
[null,null,null,null,null,null,null,null,null,""]
[null,null,null,null,null,null,null,null,null,""]
[null,null,null,null,null,null,null,null,null,""]
[null,null,null,null,null,null,null,null,null,""]
[null,null,null,null,null,null,null,null,null,""]
[null,null,null,null,null,null,null,null,null,""]
[null,null,null,null,null,null,null,null,null,""]
[null,null,null,null,null,null,null,null,null,""]
[null,null,null,null,null,null,null,null,null,""]
[null,null,null,null,null,null,null,null,null,{"$f":"IF(H2327<>\"\",IF(OR(H2327=\"Bridge\",H2327=\"Mast Arm\",H2327=\"Sign Truss\",H2327=\"Temporary Signal\"),\"Vertical\",\"Horizontal\"),\"\")","v":""}]
[null,null,null,null,null,null,null,null,null,""]
[null,null,null,null,null,null,null,null,null,""]
[null,null,null,null,null,null,null,null,null,""]
[null,null,null,null,null,null,null,null,null,""]
[null,null,null,null,null,null,null,null,null,""]
[null,null,null,null,null,null,null,null,null,""]
[null,null,null,null,null,null,null,null,null,""]
[null,null,null,null,null,null,null,null,null,""]
[null,null,null,null,null,null,null,null,null,""]
[null,null,null,null,null,null,null,null,null,""]
[null,null,null,null,null,null,null,null,null,""]
[null,null,null,null,null,null,null,null,null,""]
[null,null,null,null,null,null,null,null,null,""]
[null,null,null,null,null,null,null,null,null,""]
[null,null,null,null,null,null,null,null,null,""]
[null,null,null,null,null,null,null,null,null,""]
[null,null,null,null,null,null,null,null,null,""]
[null,null,null,null,null,null,null,null,null,""]
[null,null,null,null,null,null,null,null,null,""]
[null,null,null,null,null,null,null,null,null,""]
[null,null,null,null,null,null,null,null,null,""]
[null,null,null,null,null,null,null,null,null,""]
[null,null,null,null,null,null,null,null,null,""]
[null,null,null,null,null,null,null,null,null,""]
[null,null,null,null,null,null,null,null,null,""]
[null,null,null,null,null,null,null,null,null,""]
[null,null,null,null,null,null,null,null,null,""]
[null,null,null,null,null,null,null,null,null,""]
[null,null,null,null,null,null,null,null,null,""]
[null,null,null,null,null,null,null,null,null,""]
[null,null,null,null,null,null,null,null,null,""]
[null,null,null,null,null,null,null,null,null,""]
[null,null,null,null,null,null,null,null,null,""]
[null,null,null,null,null,null,null,null,null,""]
[null,null,null,null,null,null,null,null,null,""]
[null,null,null,null,null,null,null,null,null,""]
[null,null,null,null,null,null,null,null,null,""]
[null,null,null,null,null,null,null,null,null,""]
[null,null,null,null,null,null,null,null,null,""]
[null,null,null,null,null,null,null,null,null,""]
[null,null,null,null,null,null,null,null,null,""]
[null,null,null,null,null,null,null,null,null,""]
[null,null,null,null,null,null,null,null,null,""]
[null,null,null,null,null,null,null,null,null,""]
[null,null,null,null,null,null,null,null,null,""]
[null,null,null,null,null,null,null,null,null,""]
[null,null,null,null,null,null,null,null,null,""]
[null,null,null,null,null,null,null,null,null,""]
[null,null,null,null,null,null,null,null,null,""]
[null,null,null,null,null,null,null,null,null,""]
[null,null,null,null,null,null,null,null,null,""]
[null,null,null,null,null,null,null,null,null,""]
[null,null,null,null,null,null,null,null,null,""]
[null,null,null,null,null,null,null,null,null,""]
[null,null,null,null,null,null,null,null,null,""]
[null,null,null,null,null,null,null,null,null,""]
[null,null,null,null,null,null,null,null,null,""]
[null,null,null,null,null,null,null,null,null,""]
[null,null,null,null,null,null,null,null,null,""]
[null,null,null,null,null,null,null,null,null,""]
[null,null,null,null,null,null,null,null,null,""]
[null,null,null,null,null,null,null,null,null,""]
[null,null,null,null,null,null,null,null,null,""]
[null,null,null,null,null,null,null,null,null,{"$f":"IF(H2391<>\"\",IF(OR(H2391=\"Bridge\",H2391=\"Mast Arm\",H2391=\"Sign Truss\",H2391=\"Temporary Signal\"),\"Vertical\",\"Horizontal\"),\"\")","v":""}]
[null,null,null,null,null,null,null,null,null,""]
[null,null,null,null,null,null,null,null,null,""]
[null,null,null,null,null,null,null,null,null,""]
[null,null,null,null,null,null,null,null,null,""]
[null,null,null,null,null,null,null,null,null,""]
[null,null,null,null,null,null,null,null,null,""]
[null,null,null,null,null,null,null,null,null,""]
[null,null,null,null,null,null,null,null,null,""]
[null,null,null,null,null,null,null,null,null,""]
[null,null,null,null,null,null,null,null,null,""]
[null,null,null,null,null,null,null,null,null,""]
[null,null,null,null,null,null,null,null,null,""]
[null,null,null,null,null,null,null,null,null,""]
[null,null,null,null,null,null,null,null,null,""]
[null,null,null,null,null,null,null,null,null,""]
[null,null,null,null,null,null,null,null,null,""]
[null,null,null,null,null,null,null,null,null,""]
[null,null,null,null,null,null,null,null,null,""]
[null,null,null,null,null,null,null,null,null,""]
[null,null,null,null,null,null,null,null,null,""]
[null,null,null,null,null,null,null,null,null,""]
[null,null,null,null,null,null,null,null,null,""]
[null,null,null,null,null,null,null,null,null,""]
[null,null,null,null,null,null,null,null,null,""]
[null,null,null,null,null,null,null,null,null,""]
[null,null,null,null,null,null,null,null,null,""]
[null,null,null,null,null,null,null,null,null,""]
[null,null,null,null,null,null,null,null,null,""]
[null,null,null,null,null,null,null,null,null,""]
[null,null,null,null,null,null,null,null,null,""]
[null,null,null,null,null,null,null,null,null,""]
[null,null,null,null,null,null,null,null,null,""]
[null,null,null,null,null,null,null,null,null,""]
[null,null,null,null,null,null,null,null,null,""]
[null,null,null,null,null,null,null,null,null,""]
[null,null,null,null,null,null,null,null,null,""]
[null,null,null,null,null,null,null,null,null,""]
[null,null,null,null,null,null,null,null,null,""]
[null,null,null,null,null,null,null,null,null,""]
[null,null,null,null,null,null,null,null,null,""]
[null,null,null,null,null,null,null,null,null,""]
[null,null,null,null,null,null,null,null,null,""]
[null,null,null,null,null,null,null,null,null,""]
[null,null,null,null,null,null,null,null,null,""]
[null,null,null,null,null,null,null,null,null,""]
[null,null,null,null,null,null,null,null,null,""]
[null,null,null,null,null,null,null,null,null,""]
[null,null,null,null,null,null,null,null,null,""]
[null,null,null,null,null,null,null,null,null,""]
[null,null,null,null,null,null,null,null,null,""]
[null,null,null,null,null,null,null,null,null,""]
[null,null,null,null,null,null,null,null,null,""]
[null,null,null,null,null,null,null,null,null,""]
[null,null,null,null,null,null,null,null,null,""]
[null,null,null,null,null,null,null,null,null,""]
[null,null,null,null,null,null,null,null,null,""]
[null,null,null,null,null,null,null,null,null,""]
[null,null,null,null,null,null,null,null,null,""]
[null,null,null,null,null,null,null,null,null,""]
[null,null,null,null,null,null,null,null,null,""]
[null,null,null,null,null,null,null,null,null,""]
[null,null,null,null,null,null,null,null,null,""]
[null,null,null,null,null,null,null,null,null,""]
[null,null,null,null,null,null,null,null,null,{"$f":"IF(H2455<>\"\",IF(OR(H2455=\"Bridge\",H2455=\"Mast Arm\",H2455=\"Sign Truss\",H2455=\"Temporary Signal\"),\"Vertical\",\"Horizontal\"),\"\")","v":""}]
[null,null,null,null,null,null,null,null,null,""]
[null,null,null,null,null,null,null,null,null,""]
[null,null,null,null,null,null,null,null,null,""]
[null,null,null,null,null,null,null,null,null,""]
[null,null,null,null,null,null,null,null,null,""]
[null,null,null,null,null,null,null,null,null,""]
[null,null,null,null,null,null,null,null,null,""]
[null,null,null,null,null,null,null,null,null,""]
[null,null,null,null,null,null,null,null,null,""]
[null,null,null,null,null,null,null,null,null,""]
[null,null,null,null,null,null,null,null,null,""]
[null,null,null,null,null,null,null,null,null,""]
[null,null,null,null,null,null,null,null,null,""]
[null,null,null,null,null,null,null,null,null,""]
[null,null,null,null,null,null,null,null,null,""]
[null,null,null,null,null,null,null,null,null,""]
[null,null,null,null,null,null,null,null,null,""]
[null,null,null,null,null,null,null,null,null,""]
[null,null,null,null,null,null,null,null,null,""]
[null,null,null,null,null,null,null,null,null,""]
[null,null,null,null,null,null,null,null,null,""]
[null,null,null,null,null,null,null,null,null,""]
[null,null,null,null,null,null,null,null,null,""]
[null,null,null,null,null,null,null,null,null,""]
[null,null,null,null,null,null,null,null,null,""]
[null,null,null,null,null,null,null,null,null,""]
[null,null,null,null,null,null,null,null,null,""]
[null,null,null,null,null,null,null,null,null,""]
[null,null,null,null,null,null,null,null,null,""]
[null,null,null,null,null,null,null,null,null,""]
[null,null,null,null,null,null,null,null,null,""]
[null,null,null,null,null,null,null,null,null,""]
[null,null,null,null,null,null,null,null,null,""]
[null,null,null,null,null,null,null,null,null,""]
[null,null,null,null,null,null,null,null,null,""]
[null,null,null,null,null,null,null,null,null,""]
[null,null,null,null,null,null,null,null,null,""]
[null,null,null,null,null,null,null,null,null,""]
[null,null,null,null,null,null,null,null,null,""]
[null,null,null,null,null,null,null,null,null,""]
[null,null,null,null,null,null,null,null,null,""]
[null,null,null,null,null,null,null,null,null,""]
[null,null,null,null,null,null,null,null,null,""]
[null,null,null,null,null,null,null,null,null,""]
[null,null,null,null,null,null,null,null,null,""]
[null,null,null,null,null,null,null,null,null,""]
[null,null,null,null,null,null,null,null,null,""]
[null,null,null,null,null,null,null,null,null,""]
[null,null,null,null,null,null,null,null,null,""]
[null,null,null,null,null,null,null,null,null,""]
[null,null,null,null,null,null,null,null,null,""]
[null,null,null,null,null,null,null,null,null,""]
[null,null,null,null,null,null,null,null,null,""]
[null,null,null,null,null,null,null,null,null,""]
[null,null,null,null,null,null,null,null,null,""]
[null,null,null,null,null,null,null,null,null,""]
[null,null,null,null,null,null,null,null,null,""]
[null,null,null,null,null,null,null,null,null,""]
[null,null,null,null,null,null,null,null,null,""]
[null,null,null,null,null,null,null,null,null,""]
[null,null,null,null,null,null,null,null,null,""]
[null,null,null,null,null,null,null,null,null,""]
[null,null,null,null,null,null,null,null,null,""]
[null,null,null,null,null,null,null,null,null,{"$f":"IF(H2519<>\"\",IF(OR(H2519=\"Bridge\",H2519=\"Mast Arm\",H2519=\"Sign Truss\",H2519=\"Temporary Signal\"),\"Vertical\",\"Horizontal\"),\"\")","v":""}]
[null,null,null,null,null,null,null,null,null,""]
[null,null,null,null,null,null,null,null,null,""]
[null,null,null,null,null,null,null,null,null,""]
[null,null,null,null,null,null,null,null,null,""]
[null,null,null,null,null,null,null,null,null,""]
[null,null,null,null,null,null,null,null,null,""]
[null,null,null,null,null,null,null,null,null,""]
[null,null,null,null,null,null,null,null,null,""]
[null,null,null,null,null,null,null,null,null,""]
[null,null,null,null,null,null,null,null,null,""]
[null,null,null,null,null,null,null,null,null,""]
[null,null,null,null,null,null,null,null,null,""]
[null,null,null,null,null,null,null,null,null,""]
[null,null,null,null,null,null,null,null,null,""]
[null,null,null,null,null,null,null,null,null,""]
[null,null,null,null,null,null,null,null,null,""]
[null,null,null,null,null,null,null,null,null,""]
[null,null,null,null,null,null,null,null,null,""]
[null,null,null,null,null,null,null,null,null,""]
[null,null,null,null,null,null,null,null,null,""]
[null,null,null,null,null,null,null,null,null,""]
[null,null,null,null,null,null,null,null,null,""]
[null,null,null,null,null,null,null,null,null,""]
[null,null,null,null,null,null,null,null,null,""]
[null,null,null,null,null,null,null,null,null,""]
[null,null,null,null,null,null,null,null,null,""]
[null,null,null,null,null,null,null,null,null,""]
[null,null,null,null,null,null,null,null,null,""]
[null,null,null,null,null,null,null,null,null,""]
[null,null,null,null,null,null,null,null,null,""]
[null,null,null,null,null,null,null,null,null,""]
[null,null,null,null,null,null,null,null,null,""]
[null,null,null,null,null,null,null,null,null,""]
[null,null,null,null,null,null,null,null,null,""]
[null,null,null,null,null,null,null,null,null,""]
[null,null,null,null,null,null,null,null,null,""]
[null,null,null,null,null,null,null,null,null,""]
[null,null,null,null,null,null,null,null,null,""]
[null,null,null,null,null,null,null,null,null,""]
[null,null,null,null,null,null,null,null,null,""]
[null,null,null,null,null,null,null,null,null,""]
[null,null,null,null,null,null,null,null,null,""]
[null,null,null,null,null,null,null,null,null,""]
[null,null,null,null,null,null,null,null,null,""]
[null,null,null,null,null,null,null,null,null,""]
[null,null,null,null,null,null,null,null,null,""]
[null,null,null,null,null,null,null,null,null,""]
[null,null,null,null,null,null,null,null,null,""]
[null,null,null,null,null,null,null,null,null,""]
[null,null,null,null,null,null,null,null,null,""]
[null,null,null,null,null,null,null,null,null,""]
[null,null,null,null,null,null,null,null,null,""]
[null,null,null,null,null,null,null,null,null,""]
[null,null,null,null,null,null,null,null,null,""]
[null,null,null,null,null,null,null,null,null,""]
[null,null,null,null,null,null,null,null,null,""]
[null,null,null,null,null,null,null,null,null,""]
[null,null,null,null,null,null,null,null,null,""]
[null,null,null,null,null,null,null,null,null,""]
[null,null,null,null,null,null,null,null,null,""]
[null,null,null,null,null,null,null,null,null,""]
[null,null,null,null,null,null,null,null,null,""]
[null,null,null,null,null,null,null,null,null,""]
[null,null,null,null,null,null,null,null,null,{"$f":"IF(H2583<>\"\",IF(OR(H2583=\"Bridge\",H2583=\"Mast Arm\",H2583=\"Sign Truss\",H2583=\"Temporary Signal\"),\"Vertical\",\"Horizontal\"),\"\")","v":""}]
[null,null,null,null,null,null,null,null,null,""]
[null,null,null,null,null,null,null,null,null,""]
[null,null,null,null,null,null,null,null,null,""]
[null,null,null,null,null,null,null,null,null,""]
[null,null,null,null,null,null,null,null,null,""]
[null,null,null,null,null,null,null,null,null,""]
[null,null,null,null,null,null,null,null,null,""]
[null,null,null,null,null,null,null,null,null,""]
[null,null,null,null,null,null,null,null,null,""]
[null,null,null,null,null,null,null,null,null,""]
[null,null,null,null,null,null,null,null,null,""]
[null,null,null,null,null,null,null,null,null,""]
[null,null,null,null,null,null,null,null,null,""]
[null,null,null,null,null,null,null,null,null,""]
[null,null,null,null,null,null,null,null,null,""]
[null,null,null,null,null,null,null,null,null,""]
[null,null,null,null,null,null,null,null,null,""]
[null,null,null,null,null,null,null,null,null,""]
[null,null,null,null,null,null,null,null,null,""]
[null,null,null,null,null,null,null,null,null,""]
[null,null,null,null,null,null,null,null,null,""]
[null,null,null,null,null,null,null,null,null,""]
[null,null,null,null,null,null,null,null,null,""]
[null,null,null,null,null,null,null,null,null,""]
[null,null,null,null,null,null,null,null,null,""]
[null,null,null,null,null,null,null,null,null,""]
[null,null,null,null,null,null,null,null,null,""]
[null,null,null,null,null,null,null,null,null,""]
[null,null,null,null,null,null,null,null,null,""]
[null,null,null,null,null,null,null,null,null,""]
[null,null,null,null,null,null,null,null,null,""]
[null,null,null,null,null,null,null,null,null,""]
[null,null,null,null,null,null,null,null,null,""]
[null,null,null,null,null,null,null,null,null,""]
[null,null,null,null,null,null,null,null,null,""]
[null,null,null,null,null,null,null,null,null,""]
[null,null,null,null,null,null,null,null,null,""]
[null,null,null,null,null,null,null,null,null,""]
[null,null,null,null,null,null,null,null,null,""]
[null,null,null,null,null,null,null,null,null,""]
[null,null,null,null,null,null,null,null,null,""]
[null,null,null,null,null,null,null,null,null,""]
[null,null,null,null,null,null,null,null,null,""]
[null,null,null,null,null,null,null,null,null,""]
[null,null,null,null,null,null,null,null,null,""]
[null,null,null,null,null,null,null,null,null,""]
[null,null,null,null,null,null,null,null,null,""]
[null,null,null,null,null,null,null,null,null,""]
[null,null,null,null,null,null,null,null,null,""]
[null,null,null,null,null,null,null,null,null,""]
[null,null,null,null,null,null,null,null,null,""]
[null,null,null,null,null,null,null,null,null,""]
[null,null,null,null,null,null,null,null,null,""]
[null,null,null,null,null,null,null,null,null,""]
[null,null,null,null,null,null,null,null,null,""]
[null,null,null,null,null,null,null,null,null,""]
[null,null,null,null,null,null,null,null,null,""]
[null,null,null,null,null,null,null,null,null,""]
[null,null,null,null,null,null,null,null,null,""]
[null,null,null,null,null,null,null,null,null,""]
[null,null,null,null,null,null,null,null,null,""]
[null,null,null,null,null,null,null,null,null,""]
[null,null,null,null,null,null,null,null,null,""]
[null,null,null,null,null,null,null,null,null,{"$f":"IF(H2647<>\"\",IF(OR(H2647=\"Bridge\",H2647=\"Mast Arm\",H2647=\"Sign Truss\",H2647=\"Temporary Signal\"),\"Vertical\",\"Horizontal\"),\"\")","v":""}]
[null,null,null,null,null,null,null,null,null,""]
[null,null,null,null,null,null,null,null,null,""]
[null,null,null,null,null,null,null,null,null,""]
[null,null,null,null,null,null,null,null,null,""]
[null,null,null,null,null,null,null,null,null,""]
[null,null,null,null,null,null,null,null,null,""]
[null,null,null,null,null,null,null,null,null,""]
[null,null,null,null,null,null,null,null,null,""]
[null,null,null,null,null,null,null,null,null,""]
[null,null,null,null,null,null,null,null,null,""]
[null,null,null,null,null,null,null,null,null,""]
[null,null,null,null,null,null,null,null,null,""]
[null,null,null,null,null,null,null,null,null,""]
[null,null,null,null,null,null,null,null,null,""]
[null,null,null,null,null,null,null,null,null,""]
[null,null,null,null,null,null,null,null,null,""]
[null,null,null,null,null,null,null,null,null,""]
[null,null,null,null,null,null,null,null,null,""]
[null,null,null,null,null,null,null,null,null,""]
[null,null,null,null,null,null,null,null,null,""]
[null,null,null,null,null,null,null,null,null,""]
[null,null,null,null,null,null,null,null,null,""]
[null,null,null,null,null,null,null,null,null,""]
[null,null,null,null,null,null,null,null,null,""]
[null,null,null,null,null,null,null,null,null,""]
[null,null,null,null,null,null,null,null,null,""]
[null,null,null,null,null,null,null,null,null,""]
[null,null,null,null,null,null,null,null,null,""]
[null,null,null,null,null,null,null,null,null,""]
[null,null,null,null,null,null,null,null,null,""]
[null,null,null,null,null,null,null,null,null,""]
[null,null,null,null,null,null,null,null,null,""]
[null,null,null,null,null,null,null,null,null,""]
[null,null,null,null,null,null,null,null,null,""]
[null,null,null,null,null,null,null,null,null,""]
[null,null,null,null,null,null,null,null,null,""]
[null,null,null,null,null,null,null,null,null,""]
[null,null,null,null,null,null,null,null,null,""]
[null,null,null,null,null,null,null,null,null,""]
[null,null,null,null,null,null,null,null,null,""]
[null,null,null,null,null,null,null,null,null,""]
[null,null,null,null,null,null,null,null,null,""]
[null,null,null,null,null,null,null,null,null,""]
[null,null,null,null,null,null,null,null,null,""]
[null,null,null,null,null,null,null,null,null,""]
[null,null,null,null,null,null,null,null,null,""]
[null,null,null,null,null,null,null,null,null,""]
[null,null,null,null,null,null,null,null,null,""]
[null,null,null,null,null,null,null,null,null,""]
[null,null,null,null,null,null,null,null,null,""]
[null,null,null,null,null,null,null,null,null,""]
[null,null,null,null,null,null,null,null,null,""]
[null,null,null,null,null,null,null,null,null,""]
[null,null,null,null,null,null,null,null,null,""]
[null,null,null,null,null,null,null,null,null,""]
[null,null,null,null,null,null,null,null,null,""]
[null,null,null,null,null,null,null,null,null,""]
[null,null,null,null,null,null,null,null,null,""]
[null,null,null,null,null,null,null,null,null,""]
[null,null,null,null,null,null,null,null,null,""]
[null,null,null,null,null,null,null,null,null,""]
[null,null,null,null,null,null,null,null,null,""]
[null,null,null,null,null,null,null,null,null,""]
[null,null,null,null,null,null,null,null,null,{"$f":"IF(H2711<>\"\",IF(OR(H2711=\"Bridge\",H2711=\"Mast Arm\",H2711=\"Sign Truss\",H2711=\"Temporary Signal\"),\"Vertical\",\"Horizontal\"),\"\")","v":""}]
[null,null,null,null,null,null,null,null,null,""]
[null,null,null,null,null,null,null,null,null,""]
[null,null,null,null,null,null,null,null,null,""]
[null,null,null,null,null,null,null,null,null,""]
[null,null,null,null,null,null,null,null,null,""]
[null,null,null,null,null,null,null,null,null,""]
[null,null,null,null,null,null,null,null,null,""]
[null,null,null,null,null,null,null,null,null,""]
[null,null,null,null,null,null,null,null,null,""]
[null,null,null,null,null,null,null,null,null,""]
[null,null,null,null,null,null,null,null,null,""]
[null,null,null,null,null,null,null,null,null,""]
[null,null,null,null,null,null,null,null,null,""]
[null,null,null,null,null,null,null,null,null,""]
[null,null,null,null,null,null,null,null,null,""]
[null,null,null,null,null,null,null,null,null,""]
[null,null,null,null,null,null,null,null,null,""]
[null,null,null,null,null,null,null,null,null,""]
[null,null,null,null,null,null,null,null,null,""]
[null,null,null,null,null,null,null,null,null,""]
[null,null,null,null,null,null,null,null,null,""]
[null,null,null,null,null,null,null,null,null,""]
[null,null,null,null,null,null,null,null,null,""]
[null,null,null,null,null,null,null,null,null,""]
[null,null,null,null,null,null,null,null,null,""]
[null,null,null,null,null,null,null,null,null,""]
[null,null,null,null,null,null,null,null,null,""]
[null,null,null,null,null,null,null,null,null,""]
[null,null,null,null,null,null,null,null,null,""]
[null,null,null,null,null,null,null,null,null,""]
[null,null,null,null,null,null,null,null,null,""]
[null,null,null,null,null,null,null,null,null,""]
[null,null,null,null,null,null,null,null,null,""]
[null,null,null,null,null,null,null,null,null,""]
[null,null,null,null,null,null,null,null,null,""]
[null,null,null,null,null,null,null,null,null,""]
[null,null,null,null,null,null,null,null,null,""]
[null,null,null,null,null,null,null,null,null,""]
[null,null,null,null,null,null,null,null,null,""]
[null,null,null,null,null,null,null,null,null,""]
[null,null,null,null,null,null,null,null,null,""]
[null,null,null,null,null,null,null,null,null,""]
[null,null,null,null,null,null,null,null,null,""]
[null,null,null,null,null,null,null,null,null,""]
[null,null,null,null,null,null,null,null,null,""]
[null,null,null,null,null,null,null,null,null,""]
[null,null,null,null,null,null,null,null,null,""]
[null,null,null,null,null,null,null,null,null,""]
[null,null,null,null,null,null,null,null,null,""]
[null,null,null,null,null,null,null,null,null,""]
[null,null,null,null,null,null,null,null,null,""]
[null,null,null,null,null,null,null,null,null,""]
[null,null,null,null,null,null,null,null,null,""]
[null,null,null,null,null,null,null,null,null,""]
[null,null,null,null,null,null,null,null,null,""]
[null,null,null,null,null,null,null,null,null,""]
[null,null,null,null,null,null,null,null,null,""]
[null,null,null,null,null,null,null,null,null,""]
[null,null,null,null,null,null,null,null,null,""]
[null,null,null,null,null,null,null,null,null,""]
[null,null,null,null,null,null,null,null,null,""]
[null,null,null,null,null,null,null,null,null,""]
[null,null,null,null,null,null,null,null,null,""]
[null,null,null,null,null,null,null,null,null,{"$f":"IF(H2775<>\"\",IF(OR(H2775=\"Bridge\",H2775=\"Mast Arm\",H2775=\"Sign Truss\",H2775=\"Temporary Signal\"),\"Vertical\",\"Horizontal\"),\"\")","v":""}]
[null,null,null,null,null,null,null,null,null,""]
[null,null,null,null,null,null,null,null,null,""]
[null,null,null,null,null,null,null,null,null,""]
[null,null,null,null,null,null,null,null,null,""]
[null,null,null,null,null,null,null,null,null,""]
[null,null,null,null,null,null,null,null,null,""]
[null,null,null,null,null,null,null,null,null,""]
[null,null,null,null,null,null,null,null,null,""]
[null,null,null,null,null,null,null,null,null,""]
[null,null,null,null,null,null,null,null,null,""]
[null,null,null,null,null,null,null,null,null,""]
[null,null,null,null,null,null,null,null,null,""]
[null,null,null,null,null,null,null,null,null,""]
[null,null,null,null,null,null,null,null,null,""]
[null,null,null,null,null,null,null,null,null,""]
[null,null,null,null,null,null,null,null,null,""]
[null,null,null,null,null,null,null,null,null,""]
[null,null,null,null,null,null,null,null,null,""]
[null,null,null,null,null,null,null,null,null,""]
[null,null,null,null,null,null,null,null,null,""]
[null,null,null,null,null,null,null,null,null,""]
[null,null,null,null,null,null,null,null,null,""]
[null,null,null,null,null,null,null,null,null,""]
[null,null,null,null,null,null,null,null,null,""]
[null,null,null,null,null,null,null,null,null,""]
[null,null,null,null,null,null,null,null,null,""]
[null,null,null,null,null,null,null,null,null,""]
[null,null,null,null,null,null,null,null,null,""]
[null,null,null,null,null,null,null,null,null,""]
[null,null,null,null,null,null,null,null,null,""]
[null,null,null,null,null,null,null,null,null,""]
[null,null,null,null,null,null,null,null,null,""]
[null,null,null,null,null,null,null,null,null,""]
[null,null,null,null,null,null,null,null,null,""]
[null,null,null,null,null,null,null,null,null,""]
[null,null,null,null,null,null,null,null,null,""]
[null,null,null,null,null,null,null,null,null,""]
[null,null,null,null,null,null,null,null,null,""]
[null,null,null,null,null,null,null,null,null,""]
[null,null,null,null,null,null,null,null,null,""]
[null,null,null,null,null,null,null,null,null,""]
[null,null,null,null,null,null,null,null,null,""]
[null,null,null,null,null,null,null,null,null,""]
[null,null,null,null,null,null,null,null,null,""]
[null,null,null,null,null,null,null,null,null,""]
[null,null,null,null,null,null,null,null,null,""]
[null,null,null,null,null,null,null,null,null,""]
[null,null,null,null,null,null,null,null,null,""]
[null,null,null,null,null,null,null,null,null,""]
[null,null,null,null,null,null,null,null,null,""]
[null,null,null,null,null,null,null,null,null,""]
[null,null,null,null,null,null,null,null,null,""]
[null,null,null,null,null,null,null,null,null,""]
[null,null,null,null,null,null,null,null,null,""]
[null,null,null,null,null,null,null,null,null,""]
[null,null,null,null,null,null,null,null,null,""]
[null,null,null,null,null,null,null,null,null,""]
[null,null,null,null,null,null,null,null,null,""]
[null,null,null,null,null,null,null,null,null,""]
[null,null,null,null,null,null,null,null,null,""]
[null,null,null,null,null,null,null,null,null,""]
[null,null,null,null,null,null,null,null,null,""]
[null,null,null,null,null,null,null,null,null,""]
[null,null,null,null,null,null,null,null,null,{"$f":"IF(H2839<>\"\",IF(OR(H2839=\"Bridge\",H2839=\"Mast Arm\",H2839=\"Sign Truss\",H2839=\"Temporary Signal\"),\"Vertical\",\"Horizontal\"),\"\")","v":""}]
[null,null,null,null,null,null,null,null,null,""]
[null,null,null,null,null,null,null,null,null,""]
[null,null,null,null,null,null,null,null,null,""]
[null,null,null,null,null,null,null,null,null,""]
[null,null,null,null,null,null,null,null,null,""]
[null,null,null,null,null,null,null,null,null,""]
[null,null,null,null,null,null,null,null,null,""]
[null,null,null,null,null,null,null,null,null,""]
[null,null,null,null,null,null,null,null,null,""]
[null,null,null,null,null,null,null,null,null,""]
[null,null,null,null,null,null,null,null,null,""]
[null,null,null,null,null,null,null,null,null,""]
[null,null,null,null,null,null,null,null,null,""]
[null,null,null,null,null,null,null,null,null,""]
[null,null,null,null,null,null,null,null,null,""]
[null,null,null,null,null,null,null,null,null,""]
[null,null,null,null,null,null,null,null,null,""]
[null,null,null,null,null,null,null,null,null,""]
[null,null,null,null,null,null,null,null,null,""]
[null,null,null,null,null,null,null,null,null,""]
[null,null,null,null,null,null,null,null,null,""]
[null,null,null,null,null,null,null,null,null,""]
[null,null,null,null,null,null,null,null,null,""]
[null,null,null,null,null,null,null,null,null,""]
[null,null,null,null,null,null,null,null,null,""]
[null,null,null,null,null,null,null,null,null,""]
[null,null,null,null,null,null,null,null,null,""]
[null,null,null,null,null,null,null,null,null,""]
[null,null,null,null,null,null,null,null,null,""]
[null,null,null,null,null,null,null,null,null,""]
[null,null,null,null,null,null,null,null,null,""]
[null,null,null,null,null,null,null,null,null,""]
[null,null,null,null,null,null,null,null,null,""]
[null,null,null,null,null,null,null,null,null,""]
[null,null,null,null,null,null,null,null,null,""]
[null,null,null,null,null,null,null,null,null,""]
[null,null,null,null,null,null,null,null,null,""]
[null,null,null,null,null,null,null,null,null,""]
[null,null,null,null,null,null,null,null,null,""]
[null,null,null,null,null,null,null,null,null,""]
[null,null,null,null,null,null,null,null,null,""]
[null,null,null,null,null,null,null,null,null,""]
[null,null,null,null,null,null,null,null,null,""]
[null,null,null,null,null,null,null,null,null,""]
[null,null,null,null,null,null,null,null,null,""]
[null,null,null,null,null,null,null,null,null,""]
[null,null,null,null,null,null,null,null,null,""]
[null,null,null,null,null,null,null,null,null,""]
[null,null,null,null,null,null,null,null,null,""]
[null,null,null,null,null,null,null,null,null,""]
[null,null,null,null,null,null,null,null,null,""]
[null,null,null,null,null,null,null,null,null,""]
[null,null,null,null,null,null,null,null,null,""]
[null,null,null,null,null,null,null,null,null,""]
[null,null,null,null,null,null,null,null,null,""]
[null,null,null,null,null,null,null,null,null,""]
[null,null,null,null,null,null,null,null,null,""]
[null,null,null,null,null,null,null,null,null,""]
[null,null,null,null,null,null,null,null,null,""]
[null,null,null,null,null,null,null,null,null,""]
[null,null,null,null,null,null,null,null,null,""]
[null,null,null,null,null,null,null,null,null,""]
[null,null,null,null,null,null,null,null,null,""]
[null,null,null,null,null,null,null,null,null,{"$f":"IF(H2903<>\"\",IF(OR(H2903=\"Bridge\",H2903=\"Mast Arm\",H2903=\"Sign Truss\",H2903=\"Temporary Signal\"),\"Vertical\",\"Horizontal\"),\"\")","v":""}]
[null,null,null,null,null,null,null,null,null,""]
[null,null,null,null,null,null,null,null,null,""]
[null,null,null,null,null,null,null,null,null,""]
[null,null,null,null,null,null,null,null,null,""]
[null,null,null,null,null,null,null,null,null,""]
[null,null,null,null,null,null,null,null,null,""]
[null,null,null,null,null,null,null,null,null,""]
[null,null,null,null,null,null,null,null,null,""]
[null,null,null,null,null,null,null,null,null,""]
[null,null,null,null,null,null,null,null,null,""]
[null,null,null,null,null,null,null,null,null,""]
[null,null,null,null,null,null,null,null,null,""]
[null,null,null,null,null,null,null,null,null,""]
[null,null,null,null,null,null,null,null,null,""]
[null,null,null,null,null,null,null,null,null,""]
[null,null,null,null,null,null,null,null,null,""]
[null,null,null,null,null,null,null,null,null,""]
[null,null,null,null,null,null,null,null,null,""]
[null,null,null,null,null,null,null,null,null,""]
[null,null,null,null,null,null,null,null,null,""]
[null,null,null,null,null,null,null,null,null,""]
[null,null,null,null,null,null,null,null,null,""]
[null,null,null,null,null,null,null,null,null,""]
[null,null,null,null,null,null,null,null,null,""]
[null,null,null,null,null,null,null,null,null,""]
[null,null,null,null,null,null,null,null,null,""]
[null,null,null,null,null,null,null,null,null,""]
[null,null,null,null,null,null,null,null,null,""]
[null,null,null,null,null,null,null,null,null,""]
[null,null,null,null,null,null,null,null,null,""]
[null,null,null,null,null,null,null,null,null,""]
[null,null,null,null,null,null,null,null,null,""]
[null,null,null,null,null,null,null,null,null,""]
[null,null,null,null,null,null,null,null,null,""]
[null,null,null,null,null,null,null,null,null,""]
[null,null,null,null,null,null,null,null,null,""]
[null,null,null,null,null,null,null,null,null,""]
[null,null,null,null,null,null,null,null,null,""]
[null,null,null,null,null,null,null,null,null,""]
[null,null,null,null,null,null,null,null,null,""]
[null,null,null,null,null,null,null,null,null,""]
[null,null,null,null,null,null,null,null,null,""]
[null,null,null,null,null,null,null,null,null,""]
[null,null,null,null,null,null,null,null,null,""]
[null,null,null,null,null,null,null,null,null,""]
[null,null,null,null,null,null,null,null,null,""]
[null,null,null,null,null,null,null,null,null,""]
[null,null,null,null,null,null,null,null,null,""]
[null,null,null,null,null,null,null,null,null,""]
[null,null,null,null,null,null,null,null,null,""]
[null,null,null,null,null,null,null,null,null,""]
[null,null,null,null,null,null,null,null,null,""]
[null,null,null,null,null,null,null,null,null,""]
[null,null,null,null,null,null,null,null,null,""]
[null,null,null,null,null,null,null,null,null,""]
[null,null,null,null,null,null,null,null,null,""]
[null,null,null,null,null,null,null,null,null,""]
[null,null,null,null,null,null,null,null,null,""]
[null,null,null,null,null,null,null,null,null,""]
[null,null,null,null,null,null,null,null,null,""]
[null,null,null,null,null,null,null,null,null,""]
[null,null,null,null,null,null,null,null,null,""]
[null,null,null,null,null,null,null,null,null,""]
[null,null,null,null,null,null,null,null,null,{"$f":"IF(H2967<>\"\",IF(OR(H2967=\"Bridge\",H2967=\"Mast Arm\",H2967=\"Sign Truss\",H2967=\"Temporary Signal\"),\"Vertical\",\"Horizontal\"),\"\")","v":""}]
[null,null,null,null,null,null,null,null,null,""]
[null,null,null,null,null,null,null,null,null,""]
[null,null,null,null,null,null,null,null,null,""]
[null,null,null,null,null,null,null,null,null,""]
[null,null,null,null,null,null,null,null,null,""]
[null,null,null,null,null,null,null,null,null,""]
[null,null,null,null,null,null,null,null,null,""]
[null,null,null,null,null,null,null,null,null,""]
[null,null,null,null,null,null,null,null,null,""]
[null,null,null,null,null,null,null,null,null,""]
[null,null,null,null,null,null,null,null,null,""]
[null,null,null,null,null,null,null,null,null,""]
[null,null,null,null,null,null,null,null,null,""]
[null,null,null,null,null,null,null,null,null,""]
[null,null,null,null,null,null,null,null,null,""]
[null,null,null,null,null,null,null,null,null,""]
[null,null,null,null,null,null,null,null,null,""]
[null,null,null,null,null,null,null,null,null,""]
[null,null,null,null,null,null,null,null,null,""]
[null,null,null,null,null,null,null,null,null,""]
[null,null,null,null,null,null,null,null,null,""]
[null,null,null,null,null,null,null,null,null,""]
[null,null,null,null,null,null,null,null,null,""]
[null,null,null,null,null,null,null,null,null,""]
[null,null,null,null,null,null,null,null,null,""]
[null,null,null,null,null,null,null,null,null,""]
[null,null,null,null,null,null,null,null,null,""]
[null,null,null,null,null,null,null,null,null,""]
[null,null,null,null,null,null,null,null,null,""]
[null,null,null,null,null,null,null,null,null,""]
[null,null,null,null,null,null,null,null,null,""]
[null,null,null,null,null,null,null,null,null,""]
[null,null,null,null,null,null,null,null,null,""]
[null,null,null,null,null,null,null,null,null,""]
[null,null,null,null,null,null,null,null,null,""]
[null,null,null,null,null,null,null,null,null,""]
[null,null,null,null,null,null,null,null,null,""]
[null,null,null,null,null,null,null,null,null,""]
[null,null,null,null,null,null,null,null,null,""]
[null,null,null,null,null,null,null,null,null,""]
[null,null,null,null,null,null,null,null,null,""]
[null,null,null,null,null,null,null,null,null,""]
[null,null,null,null,null,null,null,null,null,""]
[null,null,null,null,null,null,null,null,null,""]
[null,null,null,null,null,null,null,null,null,""]
[null,null,null,null,null,null,null,null,null,""]
[null,null,null,null,null,null,null,null,null,""]
[null,null,null,null,null,null,null,null,null,""]
[null,null,null,null,null,null,null,null,null,""]
[null,null,null,null,null,null,null,null,null,""]
[null,null,null,null,null,null,null,null,null,""]
[null,null,null,null,null,null,null,null,null,""]
[null,null,null,null,null,null,null,null,null,""]
[null,null,null,null,null,null,null,null,null,""]
[null,null,null,null,null,null,null,null,null,""]
[null,null,null,null,null,null,null,null,null,""]
[null,null,null,null,null,null,null,null,null,""]
[null,null,null,null,null,null,null,null,null,""]
[null,null,null,null,null,null,null,null,null,""]
[null,null,null,null,null,null,null,null,null,""]
[null,null,null,null,null,null,null,null,null,""]
[null,null,null,null,null,null,null,null,null,""]
[null,null,null,null,null,null,null,null,null,""]
[null,null,null,null,null,null,null,null,null,{"$f":"IF(H3031<>\"\",IF(OR(H3031=\"Bridge\",H3031=\"Mast Arm\",H3031=\"Sign Truss\",H3031=\"Temporary Signal\"),\"Vertical\",\"Horizontal\"),\"\")","v":""}]
[null,null,null,null,null,null,null,null,null,""]
[null,null,null,null,null,null,null,null,null,""]
[null,null,null,null,null,null,null,null,null,""]
[null,null,null,null,null,null,null,null,null,""]
[null,null,null,null,null,null,null,null,null,""]
[null,null,null,null,null,null,null,null,null,""]
[null,null,null,null,null,null,null,null,null,""]
[null,null,null,null,null,null,null,null,null,""]
[null,null,null,null,null,null,null,null,null,""]
[null,null,null,null,null,null,null,null,null,""]
[null,null,null,null,null,null,null,null,null,""]
[null,null,null,null,null,null,null,null,null,""]
[null,null,null,null,null,null,null,null,null,""]
[null,null,null,null,null,null,null,null,null,""]
[null,null,null,null,null,null,null,null,null,""]
[null,null,null,null,null,null,null,null,null,""]
[null,null,null,null,null,null,null,null,null,""]
[null,null,null,null,null,null,null,null,null,""]
[null,null,null,null,null,null,null,null,null,""]
[null,null,null,null,null,null,null,null,null,""]
[null,null,null,null,null,null,null,null,null,""]
[null,null,null,null,null,null,null,null,null,""]
[null,null,null,null,null,null,null,null,null,""]
[null,null,null,null,null,null,null,null,null,""]
[null,null,null,null,null,null,null,null,null,""]
[null,null,null,null,null,null,null,null,null,""]
[null,null,null,null,null,null,null,null,null,""]
[null,null,null,null,null,null,null,null,null,""]
[null,null,null,null,null,null,null,null,null,""]
[null,null,null,null,null,null,null,null,null,""]
[null,null,null,null,null,null,null,null,null,""]
[null,null,null,null,null,null,null,null,null,""]
[null,null,null,null,null,null,null,null,null,""]
[null,null,null,null,null,null,null,null,null,""]
[null,null,null,null,null,null,null,null,null,""]
[null,null,null,null,null,null,null,null,null,""]
[null,null,null,null,null,null,null,null,null,""]
[null,null,null,null,null,null,null,null,null,""]
[null,null,null,null,null,null,null,null,null,""]
[null,null,null,null,null,null,null,null,null,""]
[null,null,null,null,null,null,null,null,null,""]
[null,null,null,null,null,null,null,null,null,""]
[null,null,null,null,null,null,null,null,null,""]
[null,null,null,null,null,null,null,null,null,""]
[null,null,null,null,null,null,null,null,null,""]
[null,null,null,null,null,null,null,null,null,""]
[null,null,null,null,null,null,null,null,null,""]
[null,null,null,null,null,null,null,null,null,""]
[null,null,null,null,null,null,null,null,null,""]
[null,null,null,null,null,null,null,null,null,""]
[null,null,null,null,null,null,null,null,null,""]
[null,null,null,null,null,null,null,null,null,""]
[null,null,null,null,null,null,null,null,null,""]
[null,null,null,null,null,null,null,null,null,""]
[null,null,null,null,null,null,null,null,null,""]
[null,null,null,null,null,null,null,null,null,""]
[null,null,null,null,null,null,null,null,null,""]
[null,null,null,null,null,null,null,null,null,""]
[null,null,null,null,null,null,null,null,null,""]
[null,null,null,null,null,null,null,null,null,""]
[null,null,null,null,null,null,null,null,null,""]
[null,null,null,null,null,null,null,null,null,""]
[null,null,null,null,null,null,null,null,null,""]
[null,null,null,null,null,null,null,null,null,{"$f":"IF(H3095<>\"\",IF(OR(H3095=\"Bridge\",H3095=\"Mast Arm\",H3095=\"Sign Truss\",H3095=\"Temporary Signal\"),\"Vertical\",\"Horizontal\"),\"\")","v":""}]
[null,null,null,null,null,null,null,null,null,""]
[null,null,null,null,null,null,null,null,null,""]
[null,null,null,null,null,null,null,null,null,""]
[null,null,null,null,null,null,null,null,null,""]
[null,null,null,null,null,null,null,null,null,""]
[null,null,null,null,null,null,null,null,null,""]
[null,null,null,null,null,null,null,null,null,""]
[null,null,null,null,null,null,null,null,null,""]
[null,null,null,null,null,null,null,null,null,""]
[null,null,null,null,null,null,null,null,null,""]
[null,null,null,null,null,null,null,null,null,""]
[null,null,null,null,null,null,null,null,null,""]
[null,null,null,null,null,null,null,null,null,""]
[null,null,null,null,null,null,null,null,null,""]
[null,null,null,null,null,null,null,null,null,""]
[null,null,null,null,null,null,null,null,null,""]
[null,null,null,null,null,null,null,null,null,""]
[null,null,null,null,null,null,null,null,null,""]
[null,null,null,null,null,null,null,null,null,""]
[null,null,null,null,null,null,null,null,null,""]
[null,null,null,null,null,null,null,null,null,""]
[null,null,null,null,null,null,null,null,null,""]
[null,null,null,null,null,null,null,null,null,""]
[null,null,null,null,null,null,null,null,null,""]
[null,null,null,null,null,null,null,null,null,""]
[null,null,null,null,null,null,null,null,null,""]
[null,null,null,null,null,null,null,null,null,""]
[null,null,null,null,null,null,null,null,null,""]
[null,null,null,null,null,null,null,null,null,""]
[null,null,null,null,null,null,null,null,null,""]
[null,null,null,null,null,null,null,null,null,""]
[null,null,null,null,null,null,null,null,null,""]
[null,null,null,null,null,null,null,null,null,""]
[null,null,null,null,null,null,null,null,null,""]
[null,null,null,null,null,null,null,null,null,""]
[null,null,null,null,null,null,null,null,null,""]
[null,null,null,null,null,null,null,null,null,""]
[null,null,null,null,null,null,null,null,null,""]
[null,null,null,null,null,null,null,null,null,""]
[null,null,null,null,null,null,null,null,null,""]
[null,null,null,null,null,null,null,null,null,""]
[null,null,null,null,null,null,null,null,null,""]
[null,null,null,null,null,null,null,null,null,""]
[null,null,null,null,null,null,null,null,null,""]
[null,null,null,null,null,null,null,null,null,""]
[null,null,null,null,null,null,null,null,null,""]
[null,null,null,null,null,null,null,null,null,""]
[null,null,null,null,null,null,null,null,null,""]
[null,null,null,null,null,null,null,null,null,""]
[null,null,null,null,null,null,null,null,null,""]
[null,null,null,null,null,null,null,null,null,""]
[null,null,null,null,null,null,null,null,null,""]
[null,null,null,null,null,null,null,null,null,""]
[null,null,null,null,null,null,null,null,null,""]
[null,null,null,null,null,null,null,null,null,""]
[null,null,null,null,null,null,null,null,null,""]
[null,null,null,null,null,null,null,null,null,""]
[null,null,null,null,null,null,null,null,null,""]
[null,null,null,null,null,null,null,null,null,""]
[null,null,null,null,null,null,null,null,null,""]
[null,null,null,null,null,null,null,null,null,""]
[null,null,null,null,null,null,null,null,null,""]
[null,null,null,null,null,null,null,null,null,""]
[null,null,null,null,null,null,null,null,null,{"$f":"IF(H3159<>\"\",IF(OR(H3159=\"Bridge\",H3159=\"Mast Arm\",H3159=\"Sign Truss\",H3159=\"Temporary Signal\"),\"Vertical\",\"Horizontal\"),\"\")","v":""}]
[null,null,null,null,null,null,null,null,null,""]
[null,null,null,null,null,null,null,null,null,""]
[null,null,null,null,null,null,null,null,null,""]
[null,null,null,null,null,null,null,null,null,""]
[null,null,null,null,null,null,null,null,null,""]
[null,null,null,null,null,null,null,null,null,""]
[null,null,null,null,null,null,null,null,null,""]
[null,null,null,null,null,null,null,null,null,""]
[null,null,null,null,null,null,null,null,null,""]
[null,null,null,null,null,null,null,null,null,""]
[null,null,null,null,null,null,null,null,null,""]
[null,null,null,null,null,null,null,null,null,""]
[null,null,null,null,null,null,null,null,null,""]
[null,null,null,null,null,null,null,null,null,""]
[null,null,null,null,null,null,null,null,null,""]
[null,null,null,null,null,null,null,null,null,""]
[null,null,null,null,null,null,null,null,null,""]
[null,null,null,null,null,null,null,null,null,""]
[null,null,null,null,null,null,null,null,null,""]
[null,null,null,null,null,null,null,null,null,""]
[null,null,null,null,null,null,null,null,null,""]
[null,null,null,null,null,null,null,null,null,""]
[null,null,null,null,null,null,null,null,null,""]
[null,null,null,null,null,null,null,null,null,""]
[null,null,null,null,null,null,null,null,null,""]
[null,null,null,null,null,null,null,null,null,""]
[null,null,null,null,null,null,null,null,null,""]
[null,null,null,null,null,null,null,null,null,""]
[null,null,null,null,null,null,null,null,null,""]
[null,null,null,null,null,null,null,null,null,""]
[null,null,null,null,null,null,null,null,null,""]
[null,null,null,null,null,null,null,null,null,""]
[null,null,null,null,null,null,null,null,null,""]
[null,null,null,null,null,null,null,null,null,""]
[null,null,null,null,null,null,null,null,null,""]
[null,null,null,null,null,null,null,null,null,""]
[null,null,null,null,null,null,null,null,null,""]
[null,null,null,null,null,null,null,null,null,""]
[null,null,null,null,null,null,null,null,null,""]
[null,null,null,null,null,null,null,null,null,""]
[null,null,null,null,null,null,null,null,null,""]
[null,null,null,null,null,null,null,null,null,""]
[null,null,null,null,null,null,null,null,null,""]
[null,null,null,null,null,null,null,null,null,""]
[null,null,null,null,null,null,null,null,null,""]
[null,null,null,null,null,null,null,null,null,""]
[null,null,null,null,null,null,null,null,null,""]
[null,null,null,null,null,null,null,null,null,""]
[null,null,null,null,null,null,null,null,null,""]
[null,null,null,null,null,null,null,null,null,""]
[null,null,null,null,null,null,null,null,null,""]
[null,null,null,null,null,null,null,null,null,""]
[null,null,null,null,null,null,null,null,null,""]
[null,null,null,null,null,null,null,null,null,""]
[null,null,null,null,null,null,null,null,null,""]
[null,null,null,null,null,null,null,null,null,""]
[null,null,null,null,null,null,null,null,null,""]
[null,null,null,null,null,null,null,null,null,""]
[null,null,null,null,null,null,null,null,null,""]
[null,null,null,null,null,null,null,null,null,""]
[null,null,null,null,null,null,null,null,null,""]
[null,null,null,null,null,null,null,null,null,""]
[null,null,null,null,null,null,null,null,null,""]
[null,null,null,null,null,null,null,null,null,{"$f":"IF(H3223<>\"\",IF(OR(H3223=\"Bridge\",H3223=\"Mast Arm\",H3223=\"Sign Truss\",H3223=\"Temporary Signal\"),\"Vertical\",\"Horizontal\"),\"\")","v":""}]
[null,null,null,null,null,null,null,null,null,""]
[null,null,null,null,null,null,null,null,null,""]
[null,null,null,null,null,null,null,null,null,""]
[null,null,null,null,null,null,null,null,null,""]
[null,null,null,null,null,null,null,null,null,""]
[null,null,null,null,null,null,null,null,null,""]
[null,null,null,null,null,null,null,null,null,""]
[null,null,null,null,null,null,null,null,null,""]
[null,null,null,null,null,null,null,null,null,""]
[null,null,null,null,null,null,null,null,null,""]
[null,null,null,null,null,null,null,null,null,""]
[null,null,null,null,null,null,null,null,null,""]
[null,null,null,null,null,null,null,null,null,""]
[null,null,null,null,null,null,null,null,null,""]
[null,null,null,null,null,null,null,null,null,""]
[null,null,null,null,null,null,null,null,null,""]
[null,null,null,null,null,null,null,null,null,""]
[null,null,null,null,null,null,null,null,null,""]
[null,null,null,null,null,null,null,null,null,""]
[null,null,null,null,null,null,null,null,null,""]
[null,null,null,null,null,null,null,null,null,""]
[null,null,null,null,null,null,null,null,null,""]
[null,null,null,null,null,null,null,null,null,""]
[null,null,null,null,null,null,null,null,null,""]
[null,null,null,null,null,null,null,null,null,""]
[null,null,null,null,null,null,null,null,null,""]
[null,null,null,null,null,null,null,null,null,""]
[null,null,null,null,null,null,null,null,null,""]
[null,null,null,null,null,null,null,null,null,""]
[null,null,null,null,null,null,null,null,null,""]
[null,null,null,null,null,null,null,null,null,""]
[null,null,null,null,null,null,null,null,null,""]
[null,null,null,null,null,null,null,null,null,""]
[null,null,null,null,null,null,null,null,null,""]
[null,null,null,null,null,null,null,null,null,""]
[null,null,null,null,null,null,null,null,null,""]
[null,null,null,null,null,null,null,null,null,""]
[null,null,null,null,null,null,null,null,null,""]
[null,null,null,null,null,null,null,null,null,""]
[null,null,null,null,null,null,null,null,null,""]
[null,null,null,null,null,null,null,null,null,""]
[null,null,null,null,null,null,null,null,null,""]
[null,null,null,null,null,null,null,null,null,""]
[null,null,null,null,null,null,null,null,null,""]
[null,null,null,null,null,null,null,null,null,""]
[null,null,null,null,null,null,null,null,null,""]
[null,null,null,null,null,null,null,null,null,""]
[null,null,null,null,null,null,null,null,null,""]
[null,null,null,null,null,null,null,null,null,""]
[null,null,null,null,null,null,null,null,null,""]
[null,null,null,null,null,null,null,null,null,""]
[null,null,null,null,null,null,null,null,null,""]
[null,null,null,null,null,null,null,null,null,""]
[null,null,null,null,null,null,null,null,null,""]
[null,null,null,null,null,null,null,null,null,""]
[null,null,null,null,null,null,null,null,null,""]
[null,null,null,null,null,null,null,null,null,""]
[null,null,null,null,null,null,null,null,null,""]
[null,null,null,null,null,null,null,null,null,""]
[null,null,null,null,null,null,null,null,null,""]
[null,null,null,null,null,null,null,null,null,""]
[null,null,null,null,null,null,null,null,null,""]
[null,null,null,null,null,null,null,null,null,""]
[null,null,null,null,null,null,null,null,null,{"$f":"IF(H3287<>\"\",IF(OR(H3287=\"Bridge\",H3287=\"Mast Arm\",H3287=\"Sign Truss\",H3287=\"Temporary Signal\"),\"Vertical\",\"Horizontal\"),\"\")","v":""}]
[null,null,null,null,null,null,null,null,null,""]
[null,null,null,null,null,null,null,null,null,""]
[null,null,null,null,null,null,null,null,null,""]
[null,null,null,null,null,null,null,null,null,""]
[null,null,null,null,null,null,null,null,null,""]
[null,null,null,null,null,null,null,null,null,""]
[null,null,null,null,null,null,null,null,null,""]
[null,null,null,null,null,null,null,null,null,""]
[null,null,null,null,null,null,null,null,null,""]
[null,null,null,null,null,null,null,null,null,""]
[null,null,null,null,null,null,null,null,null,""]
[null,null,null,null,null,null,null,null,null,""]
[null,null,null,null,null,null,null,null,null,""]
[null,null,null,null,null,null,null,null,null,""]
[null,null,null,null,null,null,null,null,null,""]
[null,null,null,null,null,null,null,null,null,""]
[null,null,null,null,null,null,null,null,null,""]
[null,null,null,null,null,null,null,null,null,""]
[null,null,null,null,null,null,null,null,null,""]
[null,null,null,null,null,null,null,null,null,""]
[null,null,null,null,null,null,null,null,null,""]
[null,null,null,null,null,null,null,null,null,""]
[null,null,null,null,null,null,null,null,null,""]
[null,null,null,null,null,null,null,null,null,""]
[null,null,null,null,null,null,null,null,null,""]
[null,null,null,null,null,null,null,null,null,""]
[null,null,null,null,null,null,null,null,null,""]
[null,null,null,null,null,null,null,null,null,""]
[null,null,null,null,null,null,null,null,null,""]
[null,null,null,null,null,null,null,null,null,""]
[null,null,null,null,null,null,null,null,null,""]
[null,null,null,null,null,null,null,null,null,""]
[null,null,null,null,null,null,null,null,null,""]
[null,null,null,null,null,null,null,null,null,""]
[null,null,null,null,null,null,null,null,null,""]
[null,null,null,null,null,null,null,null,null,""]
[null,null,null,null,null,null,null,null,null,""]
[null,null,null,null,null,null,null,null,null,""]
[null,null,null,null,null,null,null,null,null,""]
[null,null,null,null,null,null,null,null,null,""]
[null,null,null,null,null,null,null,null,null,""]
[null,null,null,null,null,null,null,null,null,""]
[null,null,null,null,null,null,null,null,null,""]
[null,null,null,null,null,null,null,null,null,""]
[null,null,null,null,null,null,null,null,null,""]
[null,null,null,null,null,null,null,null,null,""]
[null,null,null,null,null,null,null,null,null,""]
[null,null,null,null,null,null,null,null,null,""]
[null,null,null,null,null,null,null,null,null,""]
[null,null,null,null,null,null,null,null,null,""]
[null,null,null,null,null,null,null,null,null,""]
[null,null,null,null,null,null,null,null,null,""]
[null,null,null,null,null,null,null,null,null,""]
[null,null,null,null,null,null,null,null,null,""]
[null,null,null,null,null,null,null,null,null,""]
[null,null,null,null,null,null,null,null,null,""]
[null,null,null,null,null,null,null,null,null,""]
[null,null,null,null,null,null,null,null,null,""]
[null,null,null,null,null,null,null,null,null,""]
[null,null,null,null,null,null,null,null,null,""]
[null,null,null,null,null,null,null,null,null,""]
[null,null,null,null,null,null,null,null,null,""]
[null,null,null,null,null,null,null,null,null,""]
[null,null,null,null,null,null,null,null,null,{"$f":"IF(H3351<>\"\",IF(OR(H3351=\"Bridge\",H3351=\"Mast Arm\",H3351=\"Sign Truss\",H3351=\"Temporary Signal\"),\"Vertical\",\"Horizontal\"),\"\")","v":""}]
[null,null,null,null,null,null,null,null,null,""]
[null,null,null,null,null,null,null,null,null,""]
[null,null,null,null,null,null,null,null,null,""]
[null,null,null,null,null,null,null,null,null,""]
[null,null,null,null,null,null,null,null,null,""]
[null,null,null,null,null,null,null,null,null,""]
[null,null,null,null,null,null,null,null,null,""]
[null,null,null,null,null,null,null,null,null,""]
[null,null,null,null,null,null,null,null,null,""]
[null,null,null,null,null,null,null,null,null,""]
[null,null,null,null,null,null,null,null,null,""]
[null,null,null,null,null,null,null,null,null,""]
[null,null,null,null,null,null,null,null,null,""]
[null,null,null,null,null,null,null,null,null,""]
[null,null,null,null,null,null,null,null,null,""]
[null,null,null,null,null,null,null,null,null,""]
[null,null,null,null,null,null,null,null,null,""]
[null,null,null,null,null,null,null,null,null,""]
[null,null,null,null,null,null,null,null,null,""]
[null,null,null,null,null,null,null,null,null,""]
[null,null,null,null,null,null,null,null,null,""]
[null,null,null,null,null,null,null,null,null,""]
[null,null,null,null,null,null,null,null,null,""]
[null,null,null,null,null,null,null,null,null,""]
[null,null,null,null,null,null,null,null,null,""]
[null,null,null,null,null,null,null,null,null,""]
[null,null,null,null,null,null,null,null,null,""]
[null,null,null,null,null,null,null,null,null,""]
[null,null,null,null,null,null,null,null,null,""]
[null,null,null,null,null,null,null,null,null,""]
[null,null,null,null,null,null,null,null,null,""]
[null,null,null,null,null,null,null,null,null,""]
[null,null,null,null,null,null,null,null,null,""]
[null,null,null,null,null,null,null,null,null,""]
[null,null,null,null,null,null,null,null,null,""]
[null,null,null,null,null,null,null,null,null,""]
[null,null,null,null,null,null,null,null,null,""]
[null,null,null,null,null,null,null,null,null,""]
[null,null,null,null,null,null,null,null,null,""]
[null,null,null,null,null,null,null,null,null,""]
[null,null,null,null,null,null,null,null,null,""]
[null,null,null,null,null,null,null,null,null,""]
[null,null,null,null,null,null,null,null,null,""]
[null,null,null,null,null,null,null,null,null,""]
[null,null,null,null,null,null,null,null,null,""]
[null,null,null,null,null,null,null,null,null,""]
[null,null,null,null,null,null,null,null,null,""]
[null,null,null,null,null,null,null,null,null,""]
[null,null,null,null,null,null,null,null,null,""]
[null,null,null,null,null,null,null,null,null,""]
[null,null,null,null,null,null,null,null,null,""]
[null,null,null,null,null,null,null,null,null,""]
[null,null,null,null,null,null,null,null,null,""]
[null,null,null,null,null,null,null,null,null,""]
[null,null,null,null,null,null,null,null,null,""]
[null,null,null,null,null,null,null,null,null,""]
[null,null,null,null,null,null,null,null,null,""]
[null,null,null,null,null,null,null,null,null,""]
[null,null,null,null,null,null,null,null,null,""]
[null,null,null,null,null,null,null,null,null,""]
[null,null,null,null,null,null,null,null,null,""]
[null,null,null,null,null,null,null,null,null,""]
[null,null,null,null,null,null,null,null,null,""]
[null,null,null,null,null,null,null,null,null,{"$f":"IF(H3415<>\"\",IF(OR(H3415=\"Bridge\",H3415=\"Mast Arm\",H3415=\"Sign Truss\",H3415=\"Temporary Signal\"),\"Vertical\",\"Horizontal\"),\"\")","v":""}]
[null,null,null,null,null,null,null,null,null,""]
[null,null,null,null,null,null,null,null,null,""]
[null,null,null,null,null,null,null,null,null,""]
[null,null,null,null,null,null,null,null,null,""]
[null,null,null,null,null,null,null,null,null,""]
[null,null,null,null,null,null,null,null,null,""]
[null,null,null,null,null,null,null,null,null,""]
[null,null,null,null,null,null,null,null,null,""]
[null,null,null,null,null,null,null,null,null,""]
[null,null,null,null,null,null,null,null,null,""]
[null,null,null,null,null,null,null,null,null,""]
[null,null,null,null,null,null,null,null,null,""]
[null,null,null,null,null,null,null,null,null,""]
[null,null,null,null,null,null,null,null,null,""]
[null,null,null,null,null,null,null,null,null,""]
[null,null,null,null,null,null,null,null,null,""]
[null,null,null,null,null,null,null,null,null,""]
[null,null,null,null,null,null,null,null,null,""]
[null,null,null,null,null,null,null,null,null,""]
[null,null,null,null,null,null,null,null,null,""]
[null,null,null,null,null,null,null,null,null,""]
[null,null,null,null,null,null,null,null,null,""]
[null,null,null,null,null,null,null,null,null,""]
[null,null,null,null,null,null,null,null,null,""]
[null,null,null,null,null,null,null,null,null,""]
[null,null,null,null,null,null,null,null,null,""]
[null,null,null,null,null,null,null,null,null,""]
[null,null,null,null,null,null,null,null,null,""]
[null,null,null,null,null,null,null,null,null,""]
[null,null,null,null,null,null,null,null,null,""]
[null,null,null,null,null,null,null,null,null,""]
[null,null,null,null,null,null,null,null,null,""]
[null,null,null,null,null,null,null,null,null,""]
[null,null,null,null,null,null,null,null,null,""]
[null,null,null,null,null,null,null,null,null,""]
[null,null,null,null,null,null,null,null,null,""]
[null,null,null,null,null,null,null,null,null,""]
[null,null,null,null,null,null,null,null,null,""]
[null,null,null,null,null,null,null,null,null,""]
[null,null,null,null,null,null,null,null,null,""]
[null,null,null,null,null,null,null,null,null,""]
[null,null,null,null,null,null,null,null,null,""]
[null,null,null,null,null,null,null,null,null,""]
[null,null,null,null,null,null,null,null,null,""]
[null,null,null,null,null,null,null,null,null,""]
[null,null,null,null,null,null,null,null,null,""]
[null,null,null,null,null,null,null,null,null,""]
[null,null,null,null,null,null,null,null,null,""]
[null,null,null,null,null,null,null,null,null,""]
[null,null,null,null,null,null,null,null,null,""]
[null,null,null,null,null,null,null,null,null,""]
[null,null,null,null,null,null,null,null,null,""]
[null,null,null,null,null,null,null,null,null,""]
[null,null,null,null,null,null,null,null,null,""]
[null,null,null,null,null,null,null,null,null,""]
[null,null,null,null,null,null,null,null,null,""]
[null,null,null,null,null,null,null,null,null,""]
[null,null,null,null,null,null,null,null,null,""]
[null,null,null,null,null,null,null,null,null,""]
[null,null,null,null,null,null,null,null,null,""]
[null,null,null,null,null,null,null,null,null,""]
[null,null,null,null,null,null,null,null,null,""]
[null,null,null,null,null,null,null,null,null,""]
[null,null,null,null,null,null,null,null,null,{"$f":"IF(H3479<>\"\",IF(OR(H3479=\"Bridge\",H3479=\"Mast Arm\",H3479=\"Sign Truss\",H3479=\"Temporary Signal\"),\"Vertical\",\"Horizontal\"),\"\")","v":""}]
[null,null,null,null,null,null,null,null,null,""]
[null,null,null,null,null,null,null,null,null,""]
[null,null,null,null,null,null,null,null,null,""]
[null,null,null,null,null,null,null,null,null,""]
[null,null,null,null,null,null,null,null,null,""]
[null,null,null,null,null,null,null,null,null,""]
[null,null,null,null,null,null,null,null,null,""]
[null,null,null,null,null,null,null,null,null,""]
[null,null,null,null,null,null,null,null,null,""]
[null,null,null,null,null,null,null,null,null,""]
[null,null,null,null,null,null,null,null,null,""]
[null,null,null,null,null,null,null,null,null,""]
[null,null,null,null,null,null,null,null,null,""]
[null,null,null,null,null,null,null,null,null,""]
[null,null,null,null,null,null,null,null,null,""]
[null,null,null,null,null,null,null,null,null,""]
[null,null,null,null,null,null,null,null,null,""]
[null,null,null,null,null,null,null,null,null,""]
[null,null,null,null,null,null,null,null,null,""]
[null,null,null,null,null,null,null,null,null,""]
[null,null,null,null,null,null,null,null,null,""]
[null,null,null,null,null,null,null,null,null,""]
[null,null,null,null,null,null,null,null,null,""]
[null,null,null,null,null,null,null,null,null,""]
[null,null,null,null,null,null,null,null,null,""]
[null,null,null,null,null,null,null,null,null,""]
[null,null,null,null,null,null,null,null,null,""]
[null,null,null,null,null,null,null,null,null,""]
[null,null,null,null,null,null,null,null,null,""]
[null,null,null,null,null,null,null,null,null,""]
[null,null,null,null,null,null,null,null,null,""]
[null,null,null,null,null,null,null,null,null,""]
[null,null,null,null,null,null,null,null,null,""]
[null,null,null,null,null,null,null,null,null,""]
[null,null,null,null,null,null,null,null,null,""]
[null,null,null,null,null,null,null,null,null,""]
[null,null,null,null,null,null,null,null,null,""]
[null,null,null,null,null,null,null,null,null,""]
[null,null,null,null,null,null,null,null,null,""]
[null,null,null,null,null,null,null,null,null,""]
[null,null,null,null,null,null,null,null,null,""]
[null,null,null,null,null,null,null,null,null,""]
[null,null,null,null,null,null,null,null,null,""]
[null,null,null,null,null,null,null,null,null,""]
[null,null,null,null,null,null,null,null,null,""]
[null,null,null,null,null,null,null,null,null,""]
[null,null,null,null,null,null,null,null,null,""]
[null,null,null,null,null,null,null,null,null,""]
[null,null,null,null,null,null,null,null,null,""]
[null,null,null,null,null,null,null,null,null,""]
[null,null,null,null,null,null,null,null,null,""]
[null,null,null,null,null,null,null,null,null,""]
[null,null,null,null,null,null,null,null,null,""]
[null,null,null,null,null,null,null,null,null,""]
[null,null,null,null,null,null,null,null,null,""]
[null,null,null,null,null,null,null,null,null,""]
[null,null,null,null,null,null,null,null,null,""]
[null,null,null,null,null,null,null,null,null,""]
[null,null,null,null,null,null,null,null,null,""]
[null,null,null,null,null,null,null,null,null,""]
[null,null,null,null,null,null,null,null,null,""]
[null,null,null,null,null,null,null,null,null,""]
[null,null,null,null,null,null,null,null,null,""]
[null,null,null,null,null,null,null,null,null,{"$f":"IF(H3543<>\"\",IF(OR(H3543=\"Bridge\",H3543=\"Mast Arm\",H3543=\"Sign Truss\",H3543=\"Temporary Signal\"),\"Vertical\",\"Horizontal\"),\"\")","v":""}]
[null,null,null,null,null,null,null,null,null,""]
[null,null,null,null,null,null,null,null,null,""]
[null,null,null,null,null,null,null,null,null,""]
[null,null,null,null,null,null,null,null,null,""]
[null,null,null,null,null,null,null,null,null,""]
[null,null,null,null,null,null,null,null,null,""]
[null,null,null,null,null,null,null,null,null,""]
[null,null,null,null,null,null,null,null,null,""]
[null,null,null,null,null,null,null,null,null,""]
[null,null,null,null,null,null,null,null,null,""]
[null,null,null,null,null,null,null,null,null,""]
[null,null,null,null,null,null,null,null,null,""]
[null,null,null,null,null,null,null,null,null,""]
[null,null,null,null,null,null,null,null,null,""]
[null,null,null,null,null,null,null,null,null,""]
[null,null,null,null,null,null,null,null,null,""]
[null,null,null,null,null,null,null,null,null,""]
[null,null,null,null,null,null,null,null,null,""]
[null,null,null,null,null,null,null,null,null,""]
[null,null,null,null,null,null,null,null,null,""]
[null,null,null,null,null,null,null,null,null,""]
[null,null,null,null,null,null,null,null,null,""]
[null,null,null,null,null,null,null,null,null,""]
[null,null,null,null,null,null,null,null,null,""]
[null,null,null,null,null,null,null,null,null,""]
[null,null,null,null,null,null,null,null,null,""]
[null,null,null,null,null,null,null,null,null,""]
[null,null,null,null,null,null,null,null,null,""]
[null,null,null,null,null,null,null,null,null,""]
[null,null,null,null,null,null,null,null,null,""]
[null,null,null,null,null,null,null,null,null,""]
[null,null,null,null,null,null,null,null,null,""]
[null,null,null,null,null,null,null,null,null,""]
[null,null,null,null,null,null,null,null,null,""]
[null,null,null,null,null,null,null,null,null,""]
[null,null,null,null,null,null,null,null,null,""]
[null,null,null,null,null,null,null,null,null,""]
[null,null,null,null,null,null,null,null,null,""]
[null,null,null,null,null,null,null,null,null,""]
[null,null,null,null,null,null,null,null,null,""]
[null,null,null,null,null,null,null,null,null,""]
[null,null,null,null,null,null,null,null,null,""]
[null,null,null,null,null,null,null,null,null,""]
[null,null,null,null,null,null,null,null,null,""]
[null,null,null,null,null,null,null,null,null,""]
[null,null,null,null,null,null,null,null,null,""]
[null,null,null,null,null,null,null,null,null,""]
[null,null,null,null,null,null,null,null,null,""]
[null,null,null,null,null,null,null,null,null,""]
[null,null,null,null,null,null,null,null,null,""]
[null,null,null,null,null,null,null,null,null,""]
[null,null,null,null,null,null,null,null,null,""]
[null,null,null,null,null,null,null,null,null,""]
[null,null,null,null,null,null,null,null,null,""]
[null,null,null,null,null,null,null,null,null,""]
[null,null,null,null,null,null,null,null,null,""]
[null,null,null,null,null,null,null,null,null,""]
[null,null,null,null,null,null,null,null,null,""]
[null,null,null,null,null,null,null,null,null,""]
[null,null,null,null,null,null,null,null,null,""]
[null,null,null,null,null,null,null,null,null,""]
[null,null,null,null,null,null,null,null,null,""]
[null,null,null,null,null,null,null,null,null,""]
[null,null,null,null,null,null,null,null,null,{"$f":"IF(H3607<>\"\",IF(OR(H3607=\"Bridge\",H3607=\"Mast Arm\",H3607=\"Sign Truss\",H3607=\"Temporary Signal\"),\"Vertical\",\"Horizontal\"),\"\")","v":""}]
[null,null,null,null,null,null,null,null,null,""]
[null,null,null,null,null,null,null,null,null,""]
[null,null,null,null,null,null,null,null,null,""]
[null,null,null,null,null,null,null,null,null,""]
[null,null,null,null,null,null,null,null,null,""]
[null,null,null,null,null,null,null,null,null,""]
[null,null,null,null,null,null,null,null,null,""]
[null,null,null,null,null,null,null,null,null,""]
[null,null,null,null,null,null,null,null,null,""]
[null,null,null,null,null,null,null,null,null,""]
[null,null,null,null,null,null,null,null,null,""]
[null,null,null,null,null,null,null,null,null,""]
[null,null,null,null,null,null,null,null,null,""]
[null,null,null,null,null,null,null,null,null,""]
[null,null,null,null,null,null,null,null,null,""]
[null,null,null,null,null,null,null,null,null,""]
[null,null,null,null,null,null,null,null,null,""]
[null,null,null,null,null,null,null,null,null,""]
[null,null,null,null,null,null,null,null,null,""]
[null,null,null,null,null,null,null,null,null,""]
[null,null,null,null,null,null,null,null,null,""]
[null,null,null,null,null,null,null,null,null,""]
[null,null,null,null,null,null,null,null,null,""]
[null,null,null,null,null,null,null,null,null,""]
[null,null,null,null,null,null,null,null,null,""]
[null,null,null,null,null,null,null,null,null,""]
[null,null,null,null,null,null,null,null,null,""]
[null,null,null,null,null,null,null,null,null,""]
[null,null,null,null,null,null,null,null,null,""]
[null,null,null,null,null,null,null,null,null,""]
[null,null,null,null,null,null,null,null,null,""]
[null,null,null,null,null,null,null,null,null,""]
[null,null,null,null,null,null,null,null,null,""]
[null,null,null,null,null,null,null,null,null,""]
[null,null,null,null,null,null,null,null,null,""]
[null,null,null,null,null,null,null,null,null,""]
[null,null,null,null,null,null,null,null,null,""]
[null,null,null,null,null,null,null,null,null,""]
[null,null,null,null,null,null,null,null,null,""]
[null,null,null,null,null,null,null,null,null,""]
[null,null,null,null,null,null,null,null,null,""]
[null,null,null,null,null,null,null,null,null,""]
[null,null,null,null,null,null,null,null,null,""]
[null,null,null,null,null,null,null,null,null,""]
[null,null,null,null,null,null,null,null,null,""]
[null,null,null,null,null,null,null,null,null,""]
[null,null,null,null,null,null,null,null,null,""]
[null,null,null,null,null,null,null,null,null,""]
[null,null,null,null,null,null,null,null,null,""]
[null,null,null,null,null,null,null,null,null,""]
[null,null,null,null,null,null,null,null,null,""]
[null,null,null,null,null,null,null,null,null,""]
[null,null,null,null,null,null,null,null,null,""]
[null,null,null,null,null,null,null,null,null,""]
[null,null,null,null,null,null,null,null,null,""]
[null,null,null,null,null,null,null,null,null,""]
[null,null,null,null,null,null,null,null,null,""]
[null,null,null,null,null,null,null,null,null,""]
[null,null,null,null,null,null,null,null,null,""]
[null,null,null,null,null,null,null,null,null,""]
[null,null,null,null,null,null,null,null,null,""]
[null,null,null,null,null,null,null,null,null,""]
[null,null,null,null,null,null,null,null,null,""]
[null,null,null,null,null,null,null,null,null,{"$f":"IF(H3671<>\"\",IF(OR(H3671=\"Bridge\",H3671=\"Mast Arm\",H3671=\"Sign Truss\",H3671=\"Temporary Signal\"),\"Vertical\",\"Horizontal\"),\"\")","v":""}]
[null,null,null,null,null,null,null,null,null,""]
[null,null,null,null,null,null,null,null,null,""]
[null,null,null,null,null,null,null,null,null,""]
[null,null,null,null,null,null,null,null,null,""]
[null,null,null,null,null,null,null,null,null,""]
[null,null,null,null,null,null,null,null,null,""]
[null,null,null,null,null,null,null,null,null,""]
[null,null,null,null,null,null,null,null,null,""]
[null,null,null,null,null,null,null,null,null,""]
[null,null,null,null,null,null,null,null,null,""]
[null,null,null,null,null,null,null,null,null,""]
[null,null,null,null,null,null,null,null,null,""]
[null,null,null,null,null,null,null,null,null,""]
[null,null,null,null,null,null,null,null,null,""]
[null,null,null,null,null,null,null,null,null,""]
[null,null,null,null,null,null,null,null,null,""]
[null,null,null,null,null,null,null,null,null,""]
[null,null,null,null,null,null,null,null,null,""]
[null,null,null,null,null,null,null,null,null,""]
[null,null,null,null,null,null,null,null,null,""]
[null,null,null,null,null,null,null,null,null,""]
[null,null,null,null,null,null,null,null,null,""]
[null,null,null,null,null,null,null,null,null,""]
[null,null,null,null,null,null,null,null,null,""]
[null,null,null,null,null,null,null,null,null,""]
[null,null,null,null,null,null,null,null,null,""]
[null,null,null,null,null,null,null,null,null,""]
[null,null,null,null,null,null,null,null,null,""]
[null,null,null,null,null,null,null,null,null,""]
[null,null,null,null,null,null,null,null,null,""]
[null,null,null,null,null,null,null,null,null,""]
[null,null,null,null,null,null,null,null,null,""]
[null,null,null,null,null,null,null,null,null,""]
[null,null,null,null,null,null,null,null,null,""]
[null,null,null,null,null,null,null,null,null,""]
[null,null,null,null,null,null,null,null,null,""]
[null,null,null,null,null,null,null,null,null,""]
[null,null,null,null,null,null,null,null,null,""]
[null,null,null,null,null,null,null,null,null,""]
[null,null,null,null,null,null,null,null,null,""]
[null,null,null,null,null,null,null,null,null,""]
[null,null,null,null,null,null,null,null,null,""]
[null,null,null,null,null,null,null,null,null,""]
[null,null,null,null,null,null,null,null,null,""]
[null,null,null,null,null,null,null,null,null,""]
[null,null,null,null,null,null,null,null,null,""]
[null,null,null,null,null,null,null,null,null,""]
[null,null,null,null,null,null,null,null,null,""]
[null,null,null,null,null,null,null,null,null,""]
[null,null,null,null,null,null,null,null,null,""]
[null,null,null,null,null,null,null,null,null,""]
[null,null,null,null,null,null,null,null,null,""]
[null,null,null,null,null,null,null,null,null,""]
[null,null,null,null,null,null,null,null,null,""]
[null,null,null,null,null,null,null,null,null,""]
[null,null,null,null,null,null,null,null,null,""]
[null,null,null,null,null,null,null,null,null,""]
[null,null,null,null,null,null,null,null,null,""]
[null,null,null,null,null,null,null,null,null,""]
[null,null,null,null,null,null,null,null,null,""]
[null,null,null,null,null,null,null,null,null,""]
[null,null,null,null,null,null,null,null,null,""]
[null,null,null,null,null,null,null,null,null,""]
[null,null,null,null,null,null,null,null,null,{"$f":"IF(H3735<>\"\",IF(OR(H3735=\"Bridge\",H3735=\"Mast Arm\",H3735=\"Sign Truss\",H3735=\"Temporary Signal\"),\"Vertical\",\"Horizontal\"),\"\")","v":""}]
[null,null,null,null,null,null,null,null,null,""]
[null,null,null,null,null,null,null,null,null,""]
[null,null,null,null,null,null,null,null,null,""]
[null,null,null,null,null,null,null,null,null,""]
[null,null,null,null,null,null,null,null,null,""]
[null,null,null,null,null,null,null,null,null,""]
[null,null,null,null,null,null,null,null,null,""]
[null,null,null,null,null,null,null,null,null,""]
[null,null,null,null,null,null,null,null,null,""]
[null,null,null,null,null,null,null,null,null,""]
[null,null,null,null,null,null,null,null,null,""]
[null,null,null,null,null,null,null,null,null,""]
[null,null,null,null,null,null,null,null,null,""]
[null,null,null,null,null,null,null,null,null,""]
[null,null,null,null,null,null,null,null,null,""]
[null,null,null,null,null,null,null,null,null,""]
[null,null,null,null,null,null,null,null,null,""]
[null,null,null,null,null,null,null,null,null,""]
[null,null,null,null,null,null,null,null,null,""]
[null,null,null,null,null,null,null,null,null,""]
[null,null,null,null,null,null,null,null,null,""]
[null,null,null,null,null,null,null,null,null,""]
[null,null,null,null,null,null,null,null,null,""]
[null,null,null,null,null,null,null,null,null,""]
[null,null,null,null,null,null,null,null,null,""]
[null,null,null,null,null,null,null,null,null,""]
[null,null,null,null,null,null,null,null,null,""]
[null,null,null,null,null,null,null,null,null,""]
[null,null,null,null,null,null,null,null,null,""]
[null,null,null,null,null,null,null,null,null,""]
[null,null,null,null,null,null,null,null,null,""]
[null,null,null,null,null,null,null,null,null,""]
[null,null,null,null,null,null,null,null,null,""]
[null,null,null,null,null,null,null,null,null,""]
[null,null,null,null,null,null,null,null,null,""]
[null,null,null,null,null,null,null,null,null,""]
[null,null,null,null,null,null,null,null,null,""]
[null,null,null,null,null,null,null,null,null,""]
[null,null,null,null,null,null,null,null,null,""]
[null,null,null,null,null,null,null,null,null,""]
[null,null,null,null,null,null,null,null,null,""]
[null,null,null,null,null,null,null,null,null,""]
[null,null,null,null,null,null,null,null,null,""]
[null,null,null,null,null,null,null,null,null,""]
[null,null,null,null,null,null,null,null,null,""]
[null,null,null,null,null,null,null,null,null,""]
[null,null,null,null,null,null,null,null,null,""]
[null,null,null,null,null,null,null,null,null,""]
[null,null,null,null,null,null,null,null,null,""]
[null,null,null,null,null,null,null,null,null,""]
[null,null,null,null,null,null,null,null,null,""]
[null,null,null,null,null,null,null,null,null,""]
[null,null,null,null,null,null,null,null,null,""]
[null,null,null,null,null,null,null,null,null,""]
[null,null,null,null,null,null,null,null,null,""]
[null,null,null,null,null,null,null,null,null,""]
[null,null,null,null,null,null,null,null,null,""]
[null,null,null,null,null,null,null,null,null,""]
[null,null,null,null,null,null,null,null,null,""]
[null,null,null,null,null,null,null,null,null,""]
[null,null,null,null,null,null,null,null,null,""]
[null,null,null,null,null,null,null,null,null,""]
[null,null,null,null,null,null,null,null,null,""]
[null,null,null,null,null,null,null,null,null,{"$f":"IF(H3799<>\"\",IF(OR(H3799=\"Bridge\",H3799=\"Mast Arm\",H3799=\"Sign Truss\",H3799=\"Temporary Signal\"),\"Vertical\",\"Horizontal\"),\"\")","v":""}]
[null,null,null,null,null,null,null,null,null,""]
[null,null,null,null,null,null,null,null,null,""]
[null,null,null,null,null,null,null,null,null,""]
[null,null,null,null,null,null,null,null,null,""]
[null,null,null,null,null,null,null,null,null,""]
[null,null,null,null,null,null,null,null,null,""]
[null,null,null,null,null,null,null,null,null,""]
[null,null,null,null,null,null,null,null,null,""]
[null,null,null,null,null,null,null,null,null,""]
[null,null,null,null,null,null,null,null,null,""]
[null,null,null,null,null,null,null,null,null,""]
[null,null,null,null,null,null,null,null,null,""]
[null,null,null,null,null,null,null,null,null,""]
[null,null,null,null,null,null,null,null,null,""]
[null,null,null,null,null,null,null,null,null,""]
[null,null,null,null,null,null,null,null,null,""]
[null,null,null,null,null,null,null,null,null,""]
[null,null,null,null,null,null,null,null,null,""]
[null,null,null,null,null,null,null,null,null,""]
[null,null,null,null,null,null,null,null,null,""]
[null,null,null,null,null,null,null,null,null,""]
[null,null,null,null,null,null,null,null,null,""]
[null,null,null,null,null,null,null,null,null,""]
[null,null,null,null,null,null,null,null,null,""]
[null,null,null,null,null,null,null,null,null,""]
[null,null,null,null,null,null,null,null,null,""]
[null,null,null,null,null,null,null,null,null,""]
[null,null,null,null,null,null,null,null,null,""]
[null,null,null,null,null,null,null,null,null,""]
[null,null,null,null,null,null,null,null,null,""]
[null,null,null,null,null,null,null,null,null,""]
[null,null,null,null,null,null,null,null,null,""]
[null,null,null,null,null,null,null,null,null,""]
[null,null,null,null,null,null,null,null,null,""]
[null,null,null,null,null,null,null,null,null,""]
[null,null,null,null,null,null,null,null,null,""]
[null,null,null,null,null,null,null,null,null,""]
[null,null,null,null,null,null,null,null,null,""]
[null,null,null,null,null,null,null,null,null,""]
[null,null,null,null,null,null,null,null,null,""]
[null,null,null,null,null,null,null,null,null,""]
[null,null,null,null,null,null,null,null,null,""]
[null,null,null,null,null,null,null,null,null,""]
[null,null,null,null,null,null,null,null,null,""]
[null,null,null,null,null,null,null,null,null,""]
[null,null,null,null,null,null,null,null,null,""]
[null,null,null,null,null,null,null,null,null,""]
[null,null,null,null,null,null,null,null,null,""]
[null,null,null,null,null,null,null,null,null,""]
[null,null,null,null,null,null,null,null,null,""]
[null,null,null,null,null,null,null,null,null,""]
[null,null,null,null,null,null,null,null,null,""]
[null,null,null,null,null,null,null,null,null,""]
[null,null,null,null,null,null,null,null,null,""]
[null,null,null,null,null,null,null,null,null,""]
[null,null,null,null,null,null,null,null,null,""]
[null,null,null,null,null,null,null,null,null,""]
[null,null,null,null,null,null,null,null,null,""]
[null,null,null,null,null,null,null,null,null,""]
[null,null,null,null,null,null,null,null,null,""]
[null,null,null,null,null,null,null,null,null,""]
[null,null,null,null,null,null,null,null,null,""]
[null,null,null,null,null,null,null,null,null,""]
[null,null,null,null,null,null,null,null,null,{"$f":"IF(H3863<>\"\",IF(OR(H3863=\"Bridge\",H3863=\"Mast Arm\",H3863=\"Sign Truss\",H3863=\"Temporary Signal\"),\"Vertical\",\"Horizontal\"),\"\")","v":""}]
[null,null,null,null,null,null,null,null,null,""]
[null,null,null,null,null,null,null,null,null,""]
[null,null,null,null,null,null,null,null,null,""]
[null,null,null,null,null,null,null,null,null,""]
[null,null,null,null,null,null,null,null,null,""]
[null,null,null,null,null,null,null,null,null,""]
[null,null,null,null,null,null,null,null,null,""]
[null,null,null,null,null,null,null,null,null,""]
[null,null,null,null,null,null,null,null,null,""]
[null,null,null,null,null,null,null,null,null,""]
[null,null,null,null,null,null,null,null,null,""]
[null,null,null,null,null,null,null,null,null,""]
[null,null,null,null,null,null,null,null,null,""]
[null,null,null,null,null,null,null,null,null,""]
[null,null,null,null,null,null,null,null,null,""]
[null,null,null,null,null,null,null,null,null,""]
[null,null,null,null,null,null,null,null,null,""]
[null,null,null,null,null,null,null,null,null,""]
[null,null,null,null,null,null,null,null,null,""]
[null,null,null,null,null,null,null,null,null,""]
[null,null,null,null,null,null,null,null,null,""]
[null,null,null,null,null,null,null,null,null,""]
[null,null,null,null,null,null,null,null,null,""]
[null,null,null,null,null,null,null,null,null,""]
[null,null,null,null,null,null,null,null,null,""]
[null,null,null,null,null,null,null,null,null,""]
[null,null,null,null,null,null,null,null,null,""]
[null,null,null,null,null,null,null,null,null,""]
[null,null,null,null,null,null,null,null,null,""]
[null,null,null,null,null,null,null,null,null,""]
[null,null,null,null,null,null,null,null,null,""]
[null,null,null,null,null,null,null,null,null,""]
[null,null,null,null,null,null,null,null,null,""]
[null,null,null,null,null,null,null,null,null,""]
[null,null,null,null,null,null,null,null,null,""]
[null,null,null,null,null,null,null,null,null,""]
[null,null,null,null,null,null,null,null,null,""]
[null,null,null,null,null,null,null,null,null,""]
[null,null,null,null,null,null,null,null,null,""]
[null,null,null,null,null,null,null,null,null,""]
[null,null,null,null,null,null,null,null,null,""]
[null,null,null,null,null,null,null,null,null,""]
[null,null,null,null,null,null,null,null,null,""]
[null,null,null,null,null,null,null,null,null,""]
[null,null,null,null,null,null,null,null,null,""]
[null,null,null,null,null,null,null,null,null,""]
[null,null,null,null,null,null,null,null,null,""]
[null,null,null,null,null,null,null,null,null,""]
[null,null,null,null,null,null,null,null,null,""]
[null,null,null,null,null,null,null,null,null,""]
[null,null,null,null,null,null,null,null,null,""]
[null,null,null,null,null,null,null,null,null,""]
[null,null,null,null,null,null,null,null,null,""]
[null,null,null,null,null,null,null,null,null,""]
[null,null,null,null,null,null,null,null,null,""]
[null,null,null,null,null,null,null,null,null,""]
[null,null,null,null,null,null,null,null,null,""]
[null,null,null,null,null,null,null,null,null,""]
[null,null,null,null,null,null,null,null,null,""]
[null,null,null,null,null,null,null,null,null,""]
[null,null,null,null,null,null,null,null,null,""]
[null,null,null,null,null,null,null,null,null,""]
[null,null,null,null,null,null,null,null,null,""]
[null,null,null,null,null,null,null,null,null,{"$f":"IF(H3927<>\"\",IF(OR(H3927=\"Bridge\",H3927=\"Mast Arm\",H3927=\"Sign Truss\",H3927=\"Temporary Signal\"),\"Vertical\",\"Horizontal\"),\"\")","v":""}]
[null,null,null,null,null,null,null,null,null,""]
[null,null,null,null,null,null,null,null,null,""]
[null,null,null,null,null,null,null,null,null,""]
[null,null,null,null,null,null,null,null,null,""]
[null,null,null,null,null,null,null,null,null,""]
[null,null,null,null,null,null,null,null,null,""]
[null,null,null,null,null,null,null,null,null,""]
[null,null,null,null,null,null,null,null,null,""]
[null,null,null,null,null,null,null,null,null,""]
[null,null,null,null,null,null,null,null,null,""]
[null,null,null,null,null,null,null,null,null,""]
[null,null,null,null,null,null,null,null,null,""]
[null,null,null,null,null,null,null,null,null,""]
[null,null,null,null,null,null,null,null,null,""]
[null,null,null,null,null,null,null,null,null,""]
[null,null,null,null,null,null,null,null,null,""]
[null,null,null,null,null,null,null,null,null,""]
[null,null,null,null,null,null,null,null,null,""]
[null,null,null,null,null,null,null,null,null,""]
[null,null,null,null,null,null,null,null,null,""]
[null,null,null,null,null,null,null,null,null,""]
[null,null,null,null,null,null,null,null,null,""]
[null,null,null,null,null,null,null,null,null,""]
[null,null,null,null,null,null,null,null,null,""]
[null,null,null,null,null,null,null,null,null,""]
[null,null,null,null,null,null,null,null,null,""]
[null,null,null,null,null,null,null,null,null,""]
[null,null,null,null,null,null,null,null,null,""]
[null,null,null,null,null,null,null,null,null,""]
[null,null,null,null,null,null,null,null,null,""]
[null,null,null,null,null,null,null,null,null,""]
[null,null,null,null,null,null,null,null,null,""]
[null,null,null,null,null,null,null,null,null,""]
[null,null,null,null,null,null,null,null,null,""]
[null,null,null,null,null,null,null,null,null,""]
[null,null,null,null,null,null,null,null,null,""]
[null,null,null,null,null,null,null,null,null,""]
[null,null,null,null,null,null,null,null,null,""]
[null,null,null,null,null,null,null,null,null,""]
[null,null,null,null,null,null,null,null,null,""]
[null,null,null,null,null,null,null,null,null,""]
[null,null,null,null,null,null,null,null,null,""]
[null,null,null,null,null,null,null,null,null,""]
[null,null,null,null,null,null,null,null,null,""]
[null,null,null,null,null,null,null,null,null,""]
[null,null,null,null,null,null,null,null,null,""]
[null,null,null,null,null,null,null,null,null,""]
[null,null,null,null,null,null,null,null,null,""]
[null,null,null,null,null,null,null,null,null,""]
[null,null,null,null,null,null,null,null,null,""]
[null,null,null,null,null,null,null,null,null,""]
[null,null,null,null,null,null,null,null,null,""]
[null,null,null,null,null,null,null,null,null,""]
[null,null,null,null,null,null,null,null,null,""]
[null,null,null,null,null,null,null,null,null,""]
[null,null,null,null,null,null,null,null,null,""]
[null,null,null,null,null,null,null,null,null,""]
[null,null,null,null,null,null,null,null,null,""]
[null,null,null,null,null,null,null,null,null,""]
[null,null,null,null,null,null,null,null,null,""]
[null,null,null,null,null,null,null,null,null,""]
[null,null,null,null,null,null,null,null,null,""]
[null,null,null,null,null,null,null,null,null,""]
[null,null,null,null,null,null,null,null,null,{"$f":"IF(H3991<>\"\",IF(OR(H3991=\"Bridge\",H3991=\"Mast Arm\",H3991=\"Sign Truss\",H3991=\"Temporary Signal\"),\"Vertical\",\"Horizontal\"),\"\")","v":""}]
[null,null,null,null,null,null,null,null,null,""]
[null,null,null,null,null,null,null,null,null,""]
[null,null,null,null,null,null,null,null,null,""]
[null,null,null,null,null,null,null,null,null,""]
[null,null,null,null,null,null,null,null,null,""]
[null,null,null,null,null,null,null,null,null,""]
[null,null,null,null,null,null,null,null,null,""]
[null,null,null,null,null,null,null,null,null,""]
[null,null,null,null,null,null,null,null,null,""]
[null,null,null,null,null,null,null,null,null,""]
[null,null,null,null,null,null,null,null,null,""]
[null,null,null,null,null,null,null,null,null,""]
[null,null,null,null,null,null,null,null,null,""]
[null,null,null,null,null,null,null,null,null,""]
[null,null,null,null,null,null,null,null,null,""]
[null,null,null,null,null,null,null,null,null,""]
[null,null,null,null,null,null,null,null,null,""]
[null,null,null,null,null,null,null,null,null,""]
[null,null,null,null,null,null,null,null,null,""]
[null,null,null,null,null,null,null,null,null,""]
[null,null,null,null,null,null,null,null,null,""]
[null,null,null,null,null,null,null,null,null,""]
[null,null,null,null,null,null,null,null,null,""]
[null,null,null,null,null,null,null,null,null,""]
[null,null,null,null,null,null,null,null,null,""]
[null,null,null,null,null,null,null,null,null,""]
[null,null,null,null,null,null,null,null,null,""]
[null,null,null,null,null,null,null,null,null,""]
[null,null,null,null,null,null,null,null,null,""]
[null,null,null,null,null,null,null,null,null,""]
[null,null,null,null,null,null,null,null,null,""]
[null,null,null,null,null,null,null,null,null,""]
[null,null,null,null,null,null,null,null,null,""]
[null,null,null,null,null,null,null,null,null,""]
[null,null,null,null,null,null,null,null,null,""]
[null,null,null,null,null,null,null,null,null,""]
[null,null,null,null,null,null,null,null,null,""]
[null,null,null,null,null,null,null,null,null,""]
[null,null,null,null,null,null,null,null,null,""]
[null,null,null,null,null,null,null,null,null,""]
[null,null,null,null,null,null,null,null,null,""]
[null,null,null,null,null,null,null,null,null,""]
[null,null,null,null,null,null,null,null,null,""]
[null,null,null,null,null,null,null,null,null,""]
[null,null,null,null,null,null,null,null,null,""]
[null,null,null,null,null,null,null,null,null,""]
[null,null,null,null,null,null,null,null,null,""]
[null,null,null,null,null,null,null,null,null,""]
[null,null,null,null,null,null,null,null,null,""]
[null,null,null,null,null,null,null,null,null,""]
[null,null,null,null,null,null,null,null,null,""]
[null,null,null,null,null,null,null,null,null,""]
[null,null,null,null,null,null,null,null,null,""]
[null,null,null,null,null,null,null,null,null,""]
[null,null,null,null,null,null,null,null,null,""]
[null,null,null,null,null,null,null,null,null,""]
[null,null,null,null,null,null,null,null,null,""]
[null,null,null,null,null,null,null,null,null,""]
[null,null,null,null,null,null,null,null,null,""]
[null,null,null,null,null,null,null,null,null,""]
[null,null,null,null,null,null,null,null,null,""]
[null,null,null,null,null,null,null,null,null,""]
[null,null,null,null,null,null,null,null,null,""]
[null,null,null,null,null,null,null,null,null,{"$f":"IF(H4055<>\"\",IF(OR(H4055=\"Bridge\",H4055=\"Mast Arm\",H4055=\"Sign Truss\",H4055=\"Temporary Signal\"),\"Vertical\",\"Horizontal\"),\"\")","v":""}]
[null,null,null,null,null,null,null,null,null,""]
[null,null,null,null,null,null,null,null,null,""]
[null,null,null,null,null,null,null,null,null,""]
[null,null,null,null,null,null,null,null,null,""]
[null,null,null,null,null,null,null,null,null,""]
[null,null,null,null,null,null,null,null,null,""]
[null,null,null,null,null,null,null,null,null,""]
[null,null,null,null,null,null,null,null,null,""]
[null,null,null,null,null,null,null,null,null,""]
[null,null,null,null,null,null,null,null,null,""]
[null,null,null,null,null,null,null,null,null,""]
[null,null,null,null,null,null,null,null,null,""]
[null,null,null,null,null,null,null,null,null,""]
[null,null,null,null,null,null,null,null,null,""]
[null,null,null,null,null,null,null,null,null,""]
[null,null,null,null,null,null,null,null,null,""]
[null,null,null,null,null,null,null,null,null,""]
[null,null,null,null,null,null,null,null,null,""]
[null,null,null,null,null,null,null,null,null,""]
[null,null,null,null,null,null,null,null,null,""]
[null,null,null,null,null,null,null,null,null,""]
[null,null,null,null,null,null,null,null,null,""]
[null,null,null,null,null,null,null,null,null,""]
[null,null,null,null,null,null,null,null,null,""]
[null,null,null,null,null,null,null,null,null,""]
[null,null,null,null,null,null,null,null,null,""]
[null,null,null,null,null,null,null,null,null,""]
[null,null,null,null,null,null,null,null,null,""]
[null,null,null,null,null,null,null,null,null,""]
[null,null,null,null,null,null,null,null,null,""]
[null,null,null,null,null,null,null,null,null,""]
[null,null,null,null,null,null,null,null,null,""]
[null,null,null,null,null,null,null,null,null,""]
[null,null,null,null,null,null,null,null,null,""]
[null,null,null,null,null,null,null,null,null,""]
[null,null,null,null,null,null,null,null,null,""]
[null,null,null,null,null,null,null,null,null,""]
[null,null,null,null,null,null,null,null,null,""]
[null,null,null,null,null,null,null,null,null,""]
[null,null,null,null,null,null,null,null,null,""]
[null,null,null,null,null,null,null,null,null,""]
[null,null,null,null,null,null,null,null,null,""]
[null,null,null,null,null,null,null,null,null,""]
[null,null,null,null,null,null,null,null,null,""]
[null,null,null,null,null,null,null,null,null,""]
[null,null,null,null,null,null,null,null,null,""]
[null,null,null,null,null,null,null,null,null,""]
[null,null,null,null,null,null,null,null,null,""]
[null,null,null,null,null,null,null,null,null,""]
[null,null,null,null,null,null,null,null,null,""]
[null,null,null,null,null,null,null,null,null,""]
[null,null,null,null,null,null,null,null,null,""]
[null,null,null,null,null,null,null,null,null,""]
[null,null,null,null,null,null,null,null,null,""]
[null,null,null,null,null,null,null,null,null,""]
[null,null,null,null,null,null,null,null,null,""]
[null,null,null,null,null,null,null,null,null,""]
[null,null,null,null,null,null,null,null,null,""]
[null,null,null,null,null,null,null,null,null,""]
[null,null,null,null,null,null,null,null,null,""]
[null,null,null,null,null,null,null,null,null,""]
[null,null,null,null,null,null,null,null,null,""]
[null,null,null,null,null,null,null,null,null,""]
[null,null,null,null,null,null,null,null,null,{"$f":"IF(H4119<>\"\",IF(OR(H4119=\"Bridge\",H4119=\"Mast Arm\",H4119=\"Sign Truss\",H4119=\"Temporary Signal\"),\"Vertical\",\"Horizontal\"),\"\")","v":""}]
[null,null,null,null,null,null,null,null,null,""]
[null,null,null,null,null,null,null,null,null,""]
[null,null,null,null,null,null,null,null,null,""]
[null,null,null,null,null,null,null,null,null,""]
[null,null,null,null,null,null,null,null,null,""]
[null,null,null,null,null,null,null,null,null,""]
[null,null,null,null,null,null,null,null,null,""]
[null,null,null,null,null,null,null,null,null,""]
[null,null,null,null,null,null,null,null,null,""]
[null,null,null,null,null,null,null,null,null,""]
[null,null,null,null,null,null,null,null,null,""]
[null,null,null,null,null,null,null,null,null,""]
[null,null,null,null,null,null,null,null,null,""]
[null,null,null,null,null,null,null,null,null,""]
[null,null,null,null,null,null,null,null,null,""]
[null,null,null,null,null,null,null,null,null,""]
[null,null,null,null,null,null,null,null,null,""]
[null,null,null,null,null,null,null,null,null,""]
[null,null,null,null,null,null,null,null,null,""]
[null,null,null,null,null,null,null,null,null,""]
[null,null,null,null,null,null,null,null,null,""]
[null,null,null,null,null,null,null,null,null,""]
[null,null,null,null,null,null,null,null,null,""]
[null,null,null,null,null,null,null,null,null,""]
[null,null,null,null,null,null,null,null,null,""]
[null,null,null,null,null,null,null,null,null,""]
[null,null,null,null,null,null,null,null,null,""]
[null,null,null,null,null,null,null,null,null,""]
[null,null,null,null,null,null,null,null,null,""]
[null,null,null,null,null,null,null,null,null,""]
[null,null,null,null,null,null,null,null,null,""]
[null,null,null,null,null,null,null,null,null,""]
[null,null,null,null,null,null,null,null,null,""]
[null,null,null,null,null,null,null,null,null,""]
[null,null,null,null,null,null,null,null,null,""]
[null,null,null,null,null,null,null,null,null,""]
[null,null,null,null,null,null,null,null,null,""]
[null,null,null,null,null,null,null,null,null,""]
[null,null,null,null,null,null,null,null,null,""]
[null,null,null,null,null,null,null,null,null,""]
[null,null,null,null,null,null,null,null,null,""]
[null,null,null,null,null,null,null,null,null,""]
[null,null,null,null,null,null,null,null,null,""]
[null,null,null,null,null,null,null,null,null,""]
[null,null,null,null,null,null,null,null,null,""]
[null,null,null,null,null,null,null,null,null,""]
[null,null,null,null,null,null,null,null,null,""]
[null,null,null,null,null,null,null,null,null,""]
[null,null,null,null,null,null,null,null,null,""]
[null,null,null,null,null,null,null,null,null,""]
[null,null,null,null,null,null,null,null,null,""]
[null,null,null,null,null,null,null,null,null,""]
[null,null,null,null,null,null,null,null,null,""]
[null,null,null,null,null,null,null,null,null,""]
[null,null,null,null,null,null,null,null,null,""]
[null,null,null,null,null,null,null,null,null,""]
[null,null,null,null,null,null,null,null,null,""]
[null,null,null,null,null,null,null,null,null,""]
[null,null,null,null,null,null,null,null,null,""]
[null,null,null,null,null,null,null,null,null,""]
[null,null,null,null,null,null,null,null,null,""]
[null,null,null,null,null,null,null,null,null,""]
[null,null,null,null,null,null,null,null,null,""]
[null,null,null,null,null,null,null,null,null,{"$f":"IF(H4183<>\"\",IF(OR(H4183=\"Bridge\",H4183=\"Mast Arm\",H4183=\"Sign Truss\",H4183=\"Temporary Signal\"),\"Vertical\",\"Horizontal\"),\"\")","v":""}]
[null,null,null,null,null,null,null,null,null,""]
[null,null,null,null,null,null,null,null,null,""]
[null,null,null,null,null,null,null,null,null,""]
[null,null,null,null,null,null,null,null,null,""]
[null,null,null,null,null,null,null,null,null,""]
[null,null,null,null,null,null,null,null,null,""]
[null,null,null,null,null,null,null,null,null,""]
[null,null,null,null,null,null,null,null,null,""]
[null,null,null,null,null,null,null,null,null,""]
[null,null,null,null,null,null,null,null,null,""]
[null,null,null,null,null,null,null,null,null,""]
[null,null,null,null,null,null,null,null,null,""]
[null,null,null,null,null,null,null,null,null,""]
[null,null,null,null,null,null,null,null,null,""]
[null,null,null,null,null,null,null,null,null,""]
[null,null,null,null,null,null,null,null,null,""]
[null,null,null,null,null,null,null,null,null,""]
[null,null,null,null,null,null,null,null,null,""]
[null,null,null,null,null,null,null,null,null,""]
[null,null,null,null,null,null,null,null,null,""]
[null,null,null,null,null,null,null,null,null,""]
[null,null,null,null,null,null,null,null,null,""]
[null,null,null,null,null,null,null,null,null,""]
[null,null,null,null,null,null,null,null,null,""]
[null,null,null,null,null,null,null,null,null,""]
[null,null,null,null,null,null,null,null,null,""]
[null,null,null,null,null,null,null,null,null,""]
[null,null,null,null,null,null,null,null,null,""]
[null,null,null,null,null,null,null,null,null,""]
[null,null,null,null,null,null,null,null,null,""]
[null,null,null,null,null,null,null,null,null,""]
[null,null,null,null,null,null,null,null,null,""]
[null,null,null,null,null,null,null,null,null,""]
[null,null,null,null,null,null,null,null,null,""]
[null,null,null,null,null,null,null,null,null,""]
[null,null,null,null,null,null,null,null,null,""]
[null,null,null,null,null,null,null,null,null,""]
[null,null,null,null,null,null,null,null,null,""]
[null,null,null,null,null,null,null,null,null,""]
[null,null,null,null,null,null,null,null,null,""]
[null,null,null,null,null,null,null,null,null,""]
[null,null,null,null,null,null,null,null,null,""]
[null,null,null,null,null,null,null,null,null,""]
[null,null,null,null,null,null,null,null,null,""]
[null,null,null,null,null,null,null,null,null,""]
[null,null,null,null,null,null,null,null,null,""]
[null,null,null,null,null,null,null,null,null,""]
[null,null,null,null,null,null,null,null,null,""]
[null,null,null,null,null,null,null,null,null,""]
[null,null,null,null,null,null,null,null,null,""]
[null,null,null,null,null,null,null,null,null,""]
[null,null,null,null,null,null,null,null,null,""]
[null,null,null,null,null,null,null,null,null,""]
[null,null,null,null,null,null,null,null,null,""]
[null,null,null,null,null,null,null,null,null,""]
[null,null,null,null,null,null,null,null,null,""]
[null,null,null,null,null,null,null,null,null,""]
[null,null,null,null,null,null,null,null,null,""]
[null,null,null,null,null,null,null,null,null,""]
[null,null,null,null,null,null,null,null,null,""]
[null,null,null,null,null,null,null,null,null,""]
[null,null,null,null,null,null,null,null,null,""]
[null,null,null,null,null,null,null,null,null,""]
[null,null,null,null,null,null,null,null,null,{"$f":"IF(H4247<>\"\",IF(OR(H4247=\"Bridge\",H4247=\"Mast Arm\",H4247=\"Sign Truss\",H4247=\"Temporary Signal\"),\"Vertical\",\"Horizontal\"),\"\")","v":""}]
[null,null,null,null,null,null,null,null,null,""]
[null,null,null,null,null,null,null,null,null,""]
[null,null,null,null,null,null,null,null,null,""]
[null,null,null,null,null,null,null,null,null,""]
[null,null,null,null,null,null,null,null,null,""]
[null,null,null,null,null,null,null,null,null,""]
[null,null,null,null,null,null,null,null,null,""]
[null,null,null,null,null,null,null,null,null,""]
[null,null,null,null,null,null,null,null,null,""]
[null,null,null,null,null,null,null,null,null,""]
[null,null,null,null,null,null,null,null,null,""]
[null,null,null,null,null,null,null,null,null,""]
[null,null,null,null,null,null,null,null,null,""]
[null,null,null,null,null,null,null,null,null,""]
[null,null,null,null,null,null,null,null,null,""]
[null,null,null,null,null,null,null,null,null,""]
[null,null,null,null,null,null,null,null,null,""]
[null,null,null,null,null,null,null,null,null,""]
[null,null,null,null,null,null,null,null,null,""]
[null,null,null,null,null,null,null,null,null,""]
[null,null,null,null,null,null,null,null,null,""]
[null,null,null,null,null,null,null,null,null,""]
[null,null,null,null,null,null,null,null,null,""]
[null,null,null,null,null,null,null,null,null,""]
[null,null,null,null,null,null,null,null,null,""]
[null,null,null,null,null,null,null,null,null,""]
[null,null,null,null,null,null,null,null,null,""]
[null,null,null,null,null,null,null,null,null,""]
[null,null,null,null,null,null,null,null,null,""]
[null,null,null,null,null,null,null,null,null,""]
[null,null,null,null,null,null,null,null,null,""]
[null,null,null,null,null,null,null,null,null,""]
[null,null,null,null,null,null,null,null,null,""]
[null,null,null,null,null,null,null,null,null,""]
[null,null,null,null,null,null,null,null,null,""]
[null,null,null,null,null,null,null,null,null,""]
[null,null,null,null,null,null,null,null,null,""]
[null,null,null,null,null,null,null,null,null,""]
[null,null,null,null,null,null,null,null,null,""]
[null,null,null,null,null,null,null,null,null,""]
[null,null,null,null,null,null,null,null,null,""]
[null,null,null,null,null,null,null,null,null,""]
[null,null,null,null,null,null,null,null,null,""]
[null,null,null,null,null,null,null,null,null,""]
[null,null,null,null,null,null,null,null,null,""]
[null,null,null,null,null,null,null,null,null,""]
[null,null,null,null,null,null,null,null,null,""]
[null,null,null,null,null,null,null,null,null,""]
[null,null,null,null,null,null,null,null,null,""]
[null,null,null,null,null,null,null,null,null,""]
[null,null,null,null,null,null,null,null,null,""]
[null,null,null,null,null,null,null,null,null,""]
[null,null,null,null,null,null,null,null,null,""]
[null,null,null,null,null,null,null,null,null,""]
[null,null,null,null,null,null,null,null,null,""]
[null,null,null,null,null,null,null,null,null,""]
[null,null,null,null,null,null,null,null,null,""]
[null,null,null,null,null,null,null,null,null,""]
[null,null,null,null,null,null,null,null,null,""]
[null,null,null,null,null,null,null,null,null,""]
[null,null,null,null,null,null,null,null,null,""]
[null,null,null,null,null,null,null,null,null,""]
[null,null,null,null,null,null,null,null,null,""]
[null,null,null,null,null,null,null,null,null,{"$f":"IF(H4311<>\"\",IF(OR(H4311=\"Bridge\",H4311=\"Mast Arm\",H4311=\"Sign Truss\",H4311=\"Temporary Signal\"),\"Vertical\",\"Horizontal\"),\"\")","v":""}]
[null,null,null,null,null,null,null,null,null,""]
[null,null,null,null,null,null,null,null,null,""]
[null,null,null,null,null,null,null,null,null,""]
[null,null,null,null,null,null,null,null,null,""]
[null,null,null,null,null,null,null,null,null,""]
[null,null,null,null,null,null,null,null,null,""]
[null,null,null,null,null,null,null,null,null,""]
[null,null,null,null,null,null,null,null,null,""]
[null,null,null,null,null,null,null,null,null,""]
[null,null,null,null,null,null,null,null,null,""]
[null,null,null,null,null,null,null,null,null,""]
[null,null,null,null,null,null,null,null,null,""]
[null,null,null,null,null,null,null,null,null,""]
[null,null,null,null,null,null,null,null,null,""]
[null,null,null,null,null,null,null,null,null,""]
[null,null,null,null,null,null,null,null,null,""]
[null,null,null,null,null,null,null,null,null,""]
[null,null,null,null,null,null,null,null,null,""]
[null,null,null,null,null,null,null,null,null,""]
[null,null,null,null,null,null,null,null,null,""]
[null,null,null,null,null,null,null,null,null,""]
[null,null,null,null,null,null,null,null,null,""]
[null,null,null,null,null,null,null,null,null,""]
[null,null,null,null,null,null,null,null,null,""]
[null,null,null,null,null,null,null,null,null,""]
[null,null,null,null,null,null,null,null,null,""]
[null,null,null,null,null,null,null,null,null,""]
[null,null,null,null,null,null,null,null,null,""]
[null,null,null,null,null,null,null,null,null,""]
[null,null,null,null,null,null,null,null,null,""]
[null,null,null,null,null,null,null,null,null,""]
[null,null,null,null,null,null,null,null,null,""]
[null,null,null,null,null,null,null,null,null,""]
[null,null,null,null,null,null,null,null,null,""]
[null,null,null,null,null,null,null,null,null,""]
[null,null,null,null,null,null,null,null,null,""]
[null,null,null,null,null,null,null,null,null,""]
[null,null,null,null,null,null,null,null,null,""]
[null,null,null,null,null,null,null,null,null,""]
[null,null,null,null,null,null,null,null,null,""]
[null,null,null,null,null,null,null,null,null,""]
[null,null,null,null,null,null,null,null,null,""]
[null,null,null,null,null,null,null,null,null,""]
[null,null,null,null,null,null,null,null,null,""]
[null,null,null,null,null,null,null,null,null,""]
[null,null,null,null,null,null,null,null,null,""]
[null,null,null,null,null,null,null,null,null,""]
[null,null,null,null,null,null,null,null,null,""]
[null,null,null,null,null,null,null,null,null,""]
[null,null,null,null,null,null,null,null,null,""]
[null,null,null,null,null,null,null,null,null,""]
[null,null,null,null,null,null,null,null,null,""]
[null,null,null,null,null,null,null,null,null,""]
[null,null,null,null,null,null,null,null,null,""]
[null,null,null,null,null,null,null,null,null,""]
[null,null,null,null,null,null,null,null,null,""]
[null,null,null,null,null,null,null,null,null,""]
[null,null,null,null,null,null,null,null,null,""]
[null,null,null,null,null,null,null,null,null,""]
[null,null,null,null,null,null,null,null,null,""]
[null,null,null,null,null,null,null,null,null,""]
[null,null,null,null,null,null,null,null,null,""]
[null,null,null,null,null,null,null,null,null,""]
[null,null,null,null,null,null,null,null,null,{"$f":"IF(H4375<>\"\",IF(OR(H4375=\"Bridge\",H4375=\"Mast Arm\",H4375=\"Sign Truss\",H4375=\"Temporary Signal\"),\"Vertical\",\"Horizontal\"),\"\")","v":""}]
[null,null,null,null,null,null,null,null,null,""]
[null,null,null,null,null,null,null,null,null,""]
[null,null,null,null,null,null,null,null,null,""]
[null,null,null,null,null,null,null,null,null,""]
[null,null,null,null,null,null,null,null,null,""]
[null,null,null,null,null,null,null,null,null,""]
[null,null,null,null,null,null,null,null,null,""]
[null,null,null,null,null,null,null,null,null,""]
[null,null,null,null,null,null,null,null,null,""]
[null,null,null,null,null,null,null,null,null,""]
[null,null,null,null,null,null,null,null,null,""]
[null,null,null,null,null,null,null,null,null,""]
[null,null,null,null,null,null,null,null,null,""]
[null,null,null,null,null,null,null,null,null,""]
[null,null,null,null,null,null,null,null,null,""]
[null,null,null,null,null,null,null,null,null,""]
[null,null,null,null,null,null,null,null,null,""]
[null,null,null,null,null,null,null,null,null,""]
[null,null,null,null,null,null,null,null,null,""]
[null,null,null,null,null,null,null,null,null,""]
[null,null,null,null,null,null,null,null,null,""]
[null,null,null,null,null,null,null,null,null,""]
[null,null,null,null,null,null,null,null,null,""]
[null,null,null,null,null,null,null,null,null,""]
[null,null,null,null,null,null,null,null,null,""]
[null,null,null,null,null,null,null,null,null,""]
[null,null,null,null,null,null,null,null,null,""]
[null,null,null,null,null,null,null,null,null,""]
[null,null,null,null,null,null,null,null,null,""]
[null,null,null,null,null,null,null,null,null,""]
[null,null,null,null,null,null,null,null,null,""]
[null,null,null,null,null,null,null,null,null,""]
[null,null,null,null,null,null,null,null,null,""]
[null,null,null,null,null,null,null,null,null,""]
[null,null,null,null,null,null,null,null,null,""]
[null,null,null,null,null,null,null,null,null,""]
[null,null,null,null,null,null,null,null,null,""]
[null,null,null,null,null,null,null,null,null,""]
[null,null,null,null,null,null,null,null,null,""]
[null,null,null,null,null,null,null,null,null,""]
[null,null,null,null,null,null,null,null,null,""]
[null,null,null,null,null,null,null,null,null,""]
[null,null,null,null,null,null,null,null,null,""]
[null,null,null,null,null,null,null,null,null,""]
[null,null,null,null,null,null,null,null,null,""]
[null,null,null,null,null,null,null,null,null,""]
[null,null,null,null,null,null,null,null,null,""]
[null,null,null,null,null,null,null,null,null,""]
[null,null,null,null,null,null,null,null,null,""]
[null,null,null,null,null,null,null,null,null,""]
[null,null,null,null,null,null,null,null,null,""]
[null,null,null,null,null,null,null,null,null,""]
[null,null,null,null,null,null,null,null,null,""]
[null,null,null,null,null,null,null,null,null,""]
[null,null,null,null,null,null,null,null,null,""]
[null,null,null,null,null,null,null,null,null,""]
[null,null,null,null,null,null,null,null,null,""]
[null,null,null,null,null,null,null,null,null,""]
[null,null,null,null,null,null,null,null,null,""]
[null,null,null,null,null,null,null,null,null,""]
[null,null,null,null,null,null,null,null,null,""]
[null,null,null,null,null,null,null,null,null,""]
[null,null,null,null,null,null,null,null,null,""]
[null,null,null,null,null,null,null,null,null,{"$f":"IF(H4439<>\"\",IF(OR(H4439=\"Bridge\",H4439=\"Mast Arm\",H4439=\"Sign Truss\",H4439=\"Temporary Signal\"),\"Vertical\",\"Horizontal\"),\"\")","v":""}]
[null,null,null,null,null,null,null,null,null,""]
[null,null,null,null,null,null,null,null,null,""]
[null,null,null,null,null,null,null,null,null,""]
[null,null,null,null,null,null,null,null,null,""]
[null,null,null,null,null,null,null,null,null,""]
[null,null,null,null,null,null,null,null,null,""]
[null,null,null,null,null,null,null,null,null,""]
[null,null,null,null,null,null,null,null,null,""]
[null,null,null,null,null,null,null,null,null,""]
[null,null,null,null,null,null,null,null,null,""]
[null,null,null,null,null,null,null,null,null,""]
[null,null,null,null,null,null,null,null,null,""]
[null,null,null,null,null,null,null,null,null,""]
[null,null,null,null,null,null,null,null,null,""]
[null,null,null,null,null,null,null,null,null,""]
[null,null,null,null,null,null,null,null,null,""]
[null,null,null,null,null,null,null,null,null,""]
[null,null,null,null,null,null,null,null,null,""]
[null,null,null,null,null,null,null,null,null,""]
[null,null,null,null,null,null,null,null,null,""]
[null,null,null,null,null,null,null,null,null,""]
[null,null,null,null,null,null,null,null,null,""]
[null,null,null,null,null,null,null,null,null,""]
[null,null,null,null,null,null,null,null,null,""]
[null,null,null,null,null,null,null,null,null,""]
[null,null,null,null,null,null,null,null,null,""]
[null,null,null,null,null,null,null,null,null,""]
[null,null,null,null,null,null,null,null,null,""]
[null,null,null,null,null,null,null,null,null,""]
[null,null,null,null,null,null,null,null,null,""]
[null,null,null,null,null,null,null,null,null,""]
[null,null,null,null,null,null,null,null,null,""]
[null,null,null,null,null,null,null,null,null,""]
[null,null,null,null,null,null,null,null,null,""]
[null,null,null,null,null,null,null,null,null,""]
[null,null,null,null,null,null,null,null,null,""]
[null,null,null,null,null,null,null,null,null,""]
[null,null,null,null,null,null,null,null,null,""]
[null,null,null,null,null,null,null,null,null,""]
[null,null,null,null,null,null,null,null,null,""]
[null,null,null,null,null,null,null,null,null,""]
[null,null,null,null,null,null,null,null,null,""]
[null,null,null,null,null,null,null,null,null,""]
[null,null,null,null,null,null,null,null,null,""]
[null,null,null,null,null,null,null,null,null,""]
[null,null,null,null,null,null,null,null,null,""]
[null,null,null,null,null,null,null,null,null,""]
[null,null,null,null,null,null,null,null,null,""]
[null,null,null,null,null,null,null,null,null,""]
[null,null,null,null,null,null,null,null,null,""]
[null,null,null,null,null,null,null,null,null,""]
[null,null,null,null,null,null,null,null,null,""]
[null,null,null,null,null,null,null,null,null,""]
[null,null,null,null,null,null,null,null,null,""]
[null,null,null,null,null,null,null,null,null,""]
[null,null,null,null,null,null,null,null,null,""]
[null,null,null,null,null,null,null,null,null,""]
[null,null,null,null,null,null,null,null,null,""]
[null,null,null,null,null,null,null,null,null,""]
[null,null,null,null,null,null,null,null,null,""]
[null,null,null,null,null,null,null,null,null,""]
[null,null,null,null,null,null,null,null,null,""]
[null,null,null,null,null,null,null,null,null,""]
[null,null,null,null,null,null,null,null,null,{"$f":"IF(H4503<>\"\",IF(OR(H4503=\"Bridge\",H4503=\"Mast Arm\",H4503=\"Sign Truss\",H4503=\"Temporary Signal\"),\"Vertical\",\"Horizontal\"),\"\")","v":""}]
[null,null,null,null,null,null,null,null,null,""]
[null,null,null,null,null,null,null,null,null,""]
[null,null,null,null,null,null,null,null,null,""]
[null,null,null,null,null,null,null,null,null,""]
[null,null,null,null,null,null,null,null,null,""]
[null,null,null,null,null,null,null,null,null,""]
[null,null,null,null,null,null,null,null,null,""]
[null,null,null,null,null,null,null,null,null,""]
[null,null,null,null,null,null,null,null,null,""]
[null,null,null,null,null,null,null,null,null,""]
[null,null,null,null,null,null,null,null,null,""]
[null,null,null,null,null,null,null,null,null,""]
[null,null,null,null,null,null,null,null,null,""]
[null,null,null,null,null,null,null,null,null,""]
[null,null,null,null,null,null,null,null,null,""]
[null,null,null,null,null,null,null,null,null,""]
[null,null,null,null,null,null,null,null,null,""]
[null,null,null,null,null,null,null,null,null,""]
[null,null,null,null,null,null,null,null,null,""]
[null,null,null,null,null,null,null,null,null,""]
[null,null,null,null,null,null,null,null,null,""]
[null,null,null,null,null,null,null,null,null,""]
[null,null,null,null,null,null,null,null,null,""]
[null,null,null,null,null,null,null,null,null,""]
[null,null,null,null,null,null,null,null,null,""]
[null,null,null,null,null,null,null,null,null,""]
[null,null,null,null,null,null,null,null,null,""]
[null,null,null,null,null,null,null,null,null,""]
[null,null,null,null,null,null,null,null,null,""]
[null,null,null,null,null,null,null,null,null,""]
[null,null,null,null,null,null,null,null,null,""]
[null,null,null,null,null,null,null,null,null,""]
[null,null,null,null,null,null,null,null,null,""]
[null,null,null,null,null,null,null,null,null,""]
[null,null,null,null,null,null,null,null,null,""]
[null,null,null,null,null,null,null,null,null,""]
[null,null,null,null,null,null,null,null,null,""]
[null,null,null,null,null,null,null,null,null,""]
[null,null,null,null,null,null,null,null,null,""]
[null,null,null,null,null,null,null,null,null,""]
[null,null,null,null,null,null,null,null,null,""]
[null,null,null,null,null,null,null,null,null,""]
[null,null,null,null,null,null,null,null,null,""]
[null,null,null,null,null,null,null,null,null,""]
[null,null,null,null,null,null,null,null,null,""]
[null,null,null,null,null,null,null,null,null,""]
[null,null,null,null,null,null,null,null,null,""]
[null,null,null,null,null,null,null,null,null,""]
[null,null,null,null,null,null,null,null,null,""]
[null,null,null,null,null,null,null,null,null,""]
[null,null,null,null,null,null,null,null,null,""]
[null,null,null,null,null,null,null,null,null,""]
[null,null,null,null,null,null,null,null,null,""]
[null,null,null,null,null,null,null,null,null,""]
[null,null,null,null,null,null,null,null,null,""]
[null,null,null,null,null,null,null,null,null,""]
[null,null,null,null,null,null,null,null,null,""]
[null,null,null,null,null,null,null,null,null,""]
[null,null,null,null,null,null,null,null,null,""]
[null,null,null,null,null,null,null,null,null,""]
[null,null,null,null,null,null,null,null,null,""]
[null,null,null,null,null,null,null,null,null,""]
[null,null,null,null,null,null,null,null,null,""]
[null,null,null,null,null,null,null,null,null,{"$f":"IF(H4567<>\"\",IF(OR(H4567=\"Bridge\",H4567=\"Mast Arm\",H4567=\"Sign Truss\",H4567=\"Temporary Signal\"),\"Vertical\",\"Horizontal\"),\"\")","v":""}]
[null,null,null,null,null,null,null,null,null,""]
[null,null,null,null,null,null,null,null,null,""]
[null,null,null,null,null,null,null,null,null,""]
[null,null,null,null,null,null,null,null,null,""]
[null,null,null,null,null,null,null,null,null,""]
[null,null,null,null,null,null,null,null,null,""]
[null,null,null,null,null,null,null,null,null,""]
[null,null,null,null,null,null,null,null,null,""]
[null,null,null,null,null,null,null,null,null,""]
[null,null,null,null,null,null,null,null,null,""]
[null,null,null,null,null,null,null,null,null,""]
[null,null,null,null,null,null,null,null,null,""]
[null,null,null,null,null,null,null,null,null,""]
[null,null,null,null,null,null,null,null,null,""]
[null,null,null,null,null,null,null,null,null,""]
[null,null,null,null,null,null,null,null,null,""]
[null,null,null,null,null,null,null,null,null,""]
[null,null,null,null,null,null,null,null,null,""]
[null,null,null,null,null,null,null,null,null,""]
[null,null,null,null,null,null,null,null,null,""]
[null,null,null,null,null,null,null,null,null,""]
[null,null,null,null,null,null,null,null,null,""]
[null,null,null,null,null,null,null,null,null,""]
[null,null,null,null,null,null,null,null,null,""]
[null,null,null,null,null,null,null,null,null,""]
[null,null,null,null,null,null,null,null,null,""]
[null,null,null,null,null,null,null,null,null,""]
[null,null,null,null,null,null,null,null,null,""]
[null,null,null,null,null,null,null,null,null,""]
[null,null,null,null,null,null,null,null,null,""]
[null,null,null,null,null,null,null,null,null,""]
[null,null,null,null,null,null,null,null,null,""]
[null,null,null,null,null,null,null,null,null,""]
[null,null,null,null,null,null,null,null,null,""]
[null,null,null,null,null,null,null,null,null,""]
[null,null,null,null,null,null,null,null,null,""]
[null,null,null,null,null,null,null,null,null,""]
[null,null,null,null,null,null,null,null,null,""]
[null,null,null,null,null,null,null,null,null,""]
[null,null,null,null,null,null,null,null,null,""]
[null,null,null,null,null,null,null,null,null,""]
[null,null,null,null,null,null,null,null,null,""]
[null,null,null,null,null,null,null,null,null,""]
[null,null,null,null,null,null,null,null,null,""]
[null,null,null,null,null,null,null,null,null,""]
[null,null,null,null,null,null,null,null,null,""]
[null,null,null,null,null,null,null,null,null,""]
[null,null,null,null,null,null,null,null,null,""]
[null,null,null,null,null,null,null,null,null,""]
[null,null,null,null,null,null,null,null,null,""]
[null,null,null,null,null,null,null,null,null,""]
[null,null,null,null,null,null,null,null,null,""]
[null,null,null,null,null,null,null,null,null,""]
[null,null,null,null,null,null,null,null,null,""]
[null,null,null,null,null,null,null,null,null,""]
[null,null,null,null,null,null,null,null,null,""]
[null,null,null,null,null,null,null,null,null,""]
[null,null,null,null,null,null,null,null,null,""]
[null,null,null,null,null,null,null,null,null,""]
[null,null,null,null,null,null,null,null,null,""]
[null,null,null,null,null,null,null,null,null,""]
[null,null,null,null,null,null,null,null,null,""]
[null,null,null,null,null,null,null,null,null,""]
[null,null,null,null,null,null,null,null,null,{"$f":"IF(H4631<>\"\",IF(OR(H4631=\"Bridge\",H4631=\"Mast Arm\",H4631=\"Sign Truss\",H4631=\"Temporary Signal\"),\"Vertical\",\"Horizontal\"),\"\")","v":""}]
[null,null,null,null,null,null,null,null,null,""]
[null,null,null,null,null,null,null,null,null,""]
[null,null,null,null,null,null,null,null,null,""]
[null,null,null,null,null,null,null,null,null,""]
[null,null,null,null,null,null,null,null,null,""]
[null,null,null,null,null,null,null,null,null,""]
[null,null,null,null,null,null,null,null,null,""]
[null,null,null,null,null,null,null,null,null,""]
[null,null,null,null,null,null,null,null,null,""]
[null,null,null,null,null,null,null,null,null,""]
[null,null,null,null,null,null,null,null,null,""]
[null,null,null,null,null,null,null,null,null,""]
[null,null,null,null,null,null,null,null,null,""]
[null,null,null,null,null,null,null,null,null,""]
[null,null,null,null,null,null,null,null,null,""]
[null,null,null,null,null,null,null,null,null,""]
[null,null,null,null,null,null,null,null,null,""]
[null,null,null,null,null,null,null,null,null,""]
[null,null,null,null,null,null,null,null,null,""]
[null,null,null,null,null,null,null,null,null,""]
[null,null,null,null,null,null,null,null,null,""]
[null,null,null,null,null,null,null,null,null,""]
[null,null,null,null,null,null,null,null,null,""]
[null,null,null,null,null,null,null,null,null,""]
[null,null,null,null,null,null,null,null,null,""]
[null,null,null,null,null,null,null,null,null,""]
[null,null,null,null,null,null,null,null,null,""]
[null,null,null,null,null,null,null,null,null,""]
[null,null,null,null,null,null,null,null,null,""]
[null,null,null,null,null,null,null,null,null,""]
[null,null,null,null,null,null,null,null,null,""]
[null,null,null,null,null,null,null,null,null,""]
[null,null,null,null,null,null,null,null,null,""]
[null,null,null,null,null,null,null,null,null,""]
[null,null,null,null,null,null,null,null,null,""]
[null,null,null,null,null,null,null,null,null,""]
[null,null,null,null,null,null,null,null,null,""]
[null,null,null,null,null,null,null,null,null,""]
[null,null,null,null,null,null,null,null,null,""]
[null,null,null,null,null,null,null,null,null,""]
[null,null,null,null,null,null,null,null,null,""]
[null,null,null,null,null,null,null,null,null,""]
[null,null,null,null,null,null,null,null,null,""]
[null,null,null,null,null,null,null,null,null,""]
[null,null,null,null,null,null,null,null,null,""]
[null,null,null,null,null,null,null,null,null,""]
[null,null,null,null,null,null,null,null,null,""]
[null,null,null,null,null,null,null,null,null,""]
[null,null,null,null,null,null,null,null,null,""]
[null,null,null,null,null,null,null,null,null,""]
[null,null,null,null,null,null,null,null,null,""]
[null,null,null,null,null,null,null,null,null,""]
[null,null,null,null,null,null,null,null,null,""]
[null,null,null,null,null,null,null,null,null,""]
[null,null,null,null,null,null,null,null,null,""]
[null,null,null,null,null,null,null,null,null,""]
[null,null,null,null,null,null,null,null,null,""]
[null,null,null,null,null,null,null,null,null,""]
[null,null,null,null,null,null,null,null,null,""]
[null,null,null,null,null,null,null,null,null,""]
[null,null,null,null,null,null,null,null,null,""]
[null,null,null,null,null,null,null,null,null,""]
[null,null,null,null,null,null,null,null,null,""]
[null,null,null,null,null,null,null,null,null,{"$f":"IF(H4695<>\"\",IF(OR(H4695=\"Bridge\",H4695=\"Mast Arm\",H4695=\"Sign Truss\",H4695=\"Temporary Signal\"),\"Vertical\",\"Horizontal\"),\"\")","v":""}]
[null,null,null,null,null,null,null,null,null,""]
[null,null,null,null,null,null,null,null,null,""]
[null,null,null,null,null,null,null,null,null,""]
[null,null,null,null,null,null,null,null,null,""]
[null,null,null,null,null,null,null,null,null,""]
[null,null,null,null,null,null,null,null,null,""]
[null,null,null,null,null,null,null,null,null,""]
[null,null,null,null,null,null,null,null,null,""]
[null,null,null,null,null,null,null,null,null,""]
[null,null,null,null,null,null,null,null,null,""]
[null,null,null,null,null,null,null,null,null,""]
[null,null,null,null,null,null,null,null,null,""]
[null,null,null,null,null,null,null,null,null,""]
[null,null,null,null,null,null,null,null,null,""]
[null,null,null,null,null,null,null,null,null,""]
[null,null,null,null,null,null,null,null,null,""]
[null,null,null,null,null,null,null,null,null,""]
[null,null,null,null,null,null,null,null,null,""]
[null,null,null,null,null,null,null,null,null,""]
[null,null,null,null,null,null,null,null,null,""]
[null,null,null,null,null,null,null,null,null,""]
[null,null,null,null,null,null,null,null,null,""]
[null,null,null,null,null,null,null,null,null,""]
[null,null,null,null,null,null,null,null,null,""]
[null,null,null,null,null,null,null,null,null,""]
[null,null,null,null,null,null,null,null,null,""]
[null,null,null,null,null,null,null,null,null,""]
[null,null,null,null,null,null,null,null,null,""]
[null,null,null,null,null,null,null,null,null,""]
[null,null,null,null,null,null,null,null,null,""]
[null,null,null,null,null,null,null,null,null,""]
[null,null,null,null,null,null,null,null,null,""]
[null,null,null,null,null,null,null,null,null,""]
[null,null,null,null,null,null,null,null,null,""]
[null,null,null,null,null,null,null,null,null,""]
[null,null,null,null,null,null,null,null,null,""]
[null,null,null,null,null,null,null,null,null,""]
[null,null,null,null,null,null,null,null,null,""]
[null,null,null,null,null,null,null,null,null,""]
[null,null,null,null,null,null,null,null,null,""]
[null,null,null,null,null,null,null,null,null,""]
[null,null,null,null,null,null,null,null,null,""]
[null,null,null,null,null,null,null,null,null,""]
[null,null,null,null,null,null,null,null,null,""]
[null,null,null,null,null,null,null,null,null,""]
[null,null,null,null,null,null,null,null,null,""]
[null,null,null,null,null,null,null,null,null,""]
[null,null,null,null,null,null,null,null,null,""]
[null,null,null,null,null,null,null,null,null,""]
[null,null,null,null,null,null,null,null,null,""]
[null,null,null,null,null,null,null,null,null,""]
[null,null,null,null,null,null,null,null,null,""]
[null,null,null,null,null,null,null,null,null,""]
[null,null,null,null,null,null,null,null,null,""]
[null,null,null,null,null,null,null,null,null,""]
[null,null,null,null,null,null,null,null,null,""]
[null,null,null,null,null,null,null,null,null,""]
[null,null,null,null,null,null,null,null,null,""]
[null,null,null,null,null,null,null,null,null,""]
[null,null,null,null,null,null,null,null,null,""]
[null,null,null,null,null,null,null,null,null,""]
[null,null,null,null,null,null,null,null,null,""]
[null,null,null,null,null,null,null,null,null,""]
[null,null,null,null,null,null,null,null,null,{"$f":"IF(H4759<>\"\",IF(OR(H4759=\"Bridge\",H4759=\"Mast Arm\",H4759=\"Sign Truss\",H4759=\"Temporary Signal\"),\"Vertical\",\"Horizontal\"),\"\")","v":""}]
[null,null,null,null,null,null,null,null,null,""]
[null,null,null,null,null,null,null,null,null,""]
[null,null,null,null,null,null,null,null,null,""]
[null,null,null,null,null,null,null,null,null,""]
[null,null,null,null,null,null,null,null,null,""]
[null,null,null,null,null,null,null,null,null,""]
[null,null,null,null,null,null,null,null,null,""]
[null,null,null,null,null,null,null,null,null,""]
[null,null,null,null,null,null,null,null,null,""]
[null,null,null,null,null,null,null,null,null,""]
[null,null,null,null,null,null,null,null,null,""]
[null,null,null,null,null,null,null,null,null,""]
[null,null,null,null,null,null,null,null,null,""]
[null,null,null,null,null,null,null,null,null,""]
[null,null,null,null,null,null,null,null,null,""]
[null,null,null,null,null,null,null,null,null,""]
[null,null,null,null,null,null,null,null,null,""]
[null,null,null,null,null,null,null,null,null,""]
[null,null,null,null,null,null,null,null,null,""]
[null,null,null,null,null,null,null,null,null,""]
[null,null,null,null,null,null,null,null,null,""]
[null,null,null,null,null,null,null,null,null,""]
[null,null,null,null,null,null,null,null,null,""]
[null,null,null,null,null,null,null,null,null,""]
[null,null,null,null,null,null,null,null,null,""]
[null,null,null,null,null,null,null,null,null,""]
[null,null,null,null,null,null,null,null,null,""]
[null,null,null,null,null,null,null,null,null,""]
[null,null,null,null,null,null,null,null,null,""]
[null,null,null,null,null,null,null,null,null,""]
[null,null,null,null,null,null,null,null,null,""]
[null,null,null,null,null,null,null,null,null,""]
[null,null,null,null,null,null,null,null,null,""]
[null,null,null,null,null,null,null,null,null,""]
[null,null,null,null,null,null,null,null,null,""]
[null,null,null,null,null,null,null,null,null,""]
[null,null,null,null,null,null,null,null,null,""]
[null,null,null,null,null,null,null,null,null,""]
[null,null,null,null,null,null,null,null,null,""]
[null,null,null,null,null,null,null,null,null,""]
[null,null,null,null,null,null,null,null,null,""]
[null,null,null,null,null,null,null,null,null,""]
[null,null,null,null,null,null,null,null,null,""]
[null,null,null,null,null,null,null,null,null,""]
[null,null,null,null,null,null,null,null,null,""]
[null,null,null,null,null,null,null,null,null,""]
[null,null,null,null,null,null,null,null,null,""]
[null,null,null,null,null,null,null,null,null,""]
[null,null,null,null,null,null,null,null,null,""]
[null,null,null,null,null,null,null,null,null,""]
[null,null,null,null,null,null,null,null,null,""]
[null,null,null,null,null,null,null,null,null,""]
[null,null,null,null,null,null,null,null,null,""]
[null,null,null,null,null,null,null,null,null,""]
[null,null,null,null,null,null,null,null,null,""]
[null,null,null,null,null,null,null,null,null,""]
[null,null,null,null,null,null,null,null,null,""]
[null,null,null,null,null,null,null,null,null,""]
[null,null,null,null,null,null,null,null,null,""]
[null,null,null,null,null,null,null,null,null,""]
[null,null,null,null,null,null,null,null,null,""]
[null,null,null,null,null,null,null,null,null,""]
[null,null,null,null,null,null,null,null,null,""]
[null,null,null,null,null,null,null,null,null,{"$f":"IF(H4823<>\"\",IF(OR(H4823=\"Bridge\",H4823=\"Mast Arm\",H4823=\"Sign Truss\",H4823=\"Temporary Signal\"),\"Vertical\",\"Horizontal\"),\"\")","v":""}]
[null,null,null,null,null,null,null,null,null,""]
[null,null,null,null,null,null,null,null,null,""]
[null,null,null,null,null,null,null,null,null,""]
[null,null,null,null,null,null,null,null,null,""]
[null,null,null,null,null,null,null,null,null,""]
[null,null,null,null,null,null,null,null,null,""]
[null,null,null,null,null,null,null,null,null,""]
[null,null,null,null,null,null,null,null,null,""]
[null,null,null,null,null,null,null,null,null,""]
[null,null,null,null,null,null,null,null,null,""]
[null,null,null,null,null,null,null,null,null,""]
[null,null,null,null,null,null,null,null,null,""]
[null,null,null,null,null,null,null,null,null,""]
[null,null,null,null,null,null,null,null,null,""]
[null,null,null,null,null,null,null,null,null,""]
[null,null,null,null,null,null,null,null,null,""]
[null,null,null,null,null,null,null,null,null,""]
[null,null,null,null,null,null,null,null,null,""]
[null,null,null,null,null,null,null,null,null,""]
[null,null,null,null,null,null,null,null,null,""]
[null,null,null,null,null,null,null,null,null,""]
[null,null,null,null,null,null,null,null,null,""]
[null,null,null,null,null,null,null,null,null,""]
[null,null,null,null,null,null,null,null,null,""]
[null,null,null,null,null,null,null,null,null,""]
[null,null,null,null,null,null,null,null,null,""]
[null,null,null,null,null,null,null,null,null,""]
[null,null,null,null,null,null,null,null,null,""]
[null,null,null,null,null,null,null,null,null,""]
[null,null,null,null,null,null,null,null,null,""]
[null,null,null,null,null,null,null,null,null,""]
[null,null,null,null,null,null,null,null,null,""]
[null,null,null,null,null,null,null,null,null,""]
[null,null,null,null,null,null,null,null,null,""]
[null,null,null,null,null,null,null,null,null,""]
[null,null,null,null,null,null,null,null,null,""]
[null,null,null,null,null,null,null,null,null,""]
[null,null,null,null,null,null,null,null,null,""]
[null,null,null,null,null,null,null,null,null,""]
[null,null,null,null,null,null,null,null,null,""]
[null,null,null,null,null,null,null,null,null,""]
[null,null,null,null,null,null,null,null,null,""]
[null,null,null,null,null,null,null,null,null,""]
[null,null,null,null,null,null,null,null,null,""]
[null,null,null,null,null,null,null,null,null,""]
[null,null,null,null,null,null,null,null,null,""]
[null,null,null,null,null,null,null,null,null,""]
[null,null,null,null,null,null,null,null,null,""]
[null,null,null,null,null,null,null,null,null,""]
[null,null,null,null,null,null,null,null,null,""]
[null,null,null,null,null,null,null,null,null,""]
[null,null,null,null,null,null,null,null,null,""]
[null,null,null,null,null,null,null,null,null,""]
[null,null,null,null,null,null,null,null,null,""]
[null,null,null,null,null,null,null,null,null,""]
[null,null,null,null,null,null,null,null,null,""]
[null,null,null,null,null,null,null,null,null,""]
[null,null,null,null,null,null,null,null,null,""]
[null,null,null,null,null,null,null,null,null,""]
[null,null,null,null,null,null,null,null,null,""]
[null,null,null,null,null,null,null,null,null,""]
[null,null,null,null,null,null,null,null,null,""]
[null,null,null,null,null,null,null,null,null,""]
[null,null,null,null,null,null,null,null,null,{"$f":"IF(H4887<>\"\",IF(OR(H4887=\"Bridge\",H4887=\"Mast Arm\",H4887=\"Sign Truss\",H4887=\"Temporary Signal\"),\"Vertical\",\"Horizontal\"),\"\")","v":""}]
[null,null,null,null,null,null,null,null,null,""]
[null,null,null,null,null,null,null,null,null,""]
[null,null,null,null,null,null,null,null,null,""]
[null,null,null,null,null,null,null,null,null,""]
[null,null,null,null,null,null,null,null,null,""]
[null,null,null,null,null,null,null,null,null,""]
[null,null,null,null,null,null,null,null,null,""]
[null,null,null,null,null,null,null,null,null,""]
[null,null,null,null,null,null,null,null,null,""]
[null,null,null,null,null,null,null,null,null,""]
[null,null,null,null,null,null,null,null,null,""]
[null,null,null,null,null,null,null,null,null,""]
[null,null,null,null,null,null,null,null,null,""]
[null,null,null,null,null,null,null,null,null,""]
[null,null,null,null,null,null,null,null,null,""]
[null,null,null,null,null,null,null,null,null,""]
[null,null,null,null,null,null,null,null,null,""]
[null,null,null,null,null,null,null,null,null,""]
[null,null,null,null,null,null,null,null,null,""]
[null,null,null,null,null,null,null,null,null,""]
[null,null,null,null,null,null,null,null,null,""]
[null,null,null,null,null,null,null,null,null,""]
[null,null,null,null,null,null,null,null,null,""]
[null,null,null,null,null,null,null,null,null,""]
[null,null,null,null,null,null,null,null,null,""]
[null,null,null,null,null,null,null,null,null,""]
[null,null,null,null,null,null,null,null,null,""]
[null,null,null,null,null,null,null,null,null,""]
[null,null,null,null,null,null,null,null,null,""]
[null,null,null,null,null,null,null,null,null,""]
[null,null,null,null,null,null,null,null,null,""]
[null,null,null,null,null,null,null,null,null,""]
[null,null,null,null,null,null,null,null,null,""]
[null,null,null,null,null,null,null,null,null,""]
[null,null,null,null,null,null,null,null,null,""]
[null,null,null,null,null,null,null,null,null,""]
[null,null,null,null,null,null,null,null,null,""]
[null,null,null,null,null,null,null,null,null,""]
[null,null,null,null,null,null,null,null,null,""]
[null,null,null,null,null,null,null,null,null,""]
[null,null,null,null,null,null,null,null,null,""]
[null,null,null,null,null,null,null,null,null,""]
[null,null,null,null,null,null,null,null,null,""]
[null,null,null,null,null,null,null,null,null,""]
[null,null,null,null,null,null,null,null,null,""]
[null,null,null,null,null,null,null,null,null,""]
[null,null,null,null,null,null,null,null,null,""]
[null,null,null,null,null,null,null,null,null,""]
[null,null,null,null,null,null,null,null,null,""]
[null,null,null,null,null,null,null,null,null,""]
[null,null,null,null,null,null,null,null,null,""]
[null,null,null,null,null,null,null,null,null,""]
[null,null,null,null,null,null,null,null,null,""]
[null,null,null,null,null,null,null,null,null,""]
[null,null,null,null,null,null,null,null,null,""]
[null,null,null,null,null,null,null,null,null,""]
[null,null,null,null,null,null,null,null,null,""]
[null,null,null,null,null,null,null,null,null,""]
[null,null,null,null,null,null,null,null,null,""]
[null,null,null,null,null,null,null,null,null,""]
[null,null,null,null,null,null,null,null,null,""]
[null,null,null,null,null,null,null,null,null,""]
[null,null,null,null,null,null,null,null,null,""]
[null,null,null,null,null,null,null,null,null,{"$f":"IF(H4951<>\"\",IF(OR(H4951=\"Bridge\",H4951=\"Mast Arm\",H4951=\"Sign Truss\",H4951=\"Temporary Signal\"),\"Vertical\",\"Horizontal\"),\"\")","v":""}]
[null,null,null,null,null,null,null,null,null,""]
[null,null,null,null,null,null,null,null,null,""]
[null,null,null,null,null,null,null,null,null,""]
[null,null,null,null,null,null,null,null,null,""]
[null,null,null,null,null,null,null,null,null,""]
[null,null,null,null,null,null,null,null,null,""]
[null,null,null,null,null,null,null,null,null,""]
[null,null,null,null,null,null,null,null,null,""]
[null,null,null,null,null,null,null,null,null,""]
[null,null,null,null,null,null,null,null,null,""]
[null,null,null,null,null,null,null,null,null,""]
[null,null,null,null,null,null,null,null,null,""]
[null,null,null,null,null,null,null,null,null,""]
[null,null,null,null,null,null,null,null,null,""]
[null,null,null,null,null,null,null,null,null,""]
[null,null,null,null,null,null,null,null,null,""]
[null,null,null,null,null,null,null,null,null,""]
[null,null,null,null,null,null,null,null,null,""]
[null,null,null,null,null,null,null,null,null,""]
[null,null,null,null,null,null,null,null,null,""]
[null,null,null,null,null,null,null,null,null,""]
[null,null,null,null,null,null,null,null,null,""]
[null,null,null,null,null,null,null,null,null,""]
[null,null,null,null,null,null,null,null,null,""]
[null,null,null,null,null,null,null,null,null,""]
[null,null,null,null,null,null,null,null,null,""]
[null,null,null,null,null,null,null,null,null,""]
[null,null,null,null,null,null,null,null,null,""]
[null,null,null,null,null,null,null,null,null,""]
[null,null,null,null,null,null,null,null,null,""]
[null,null,null,null,null,null,null,null,null,""]
[null,null,null,null,null,null,null,null,null,""]
[null,null,null,null,null,null,null,null,null,""]
[null,null,null,null,null,null,null,null,null,""]
[null,null,null,null,null,null,null,null,null,""]
[null,null,null,null,null,null,null,null,null,""]
[null,null,null,null,null,null,null,null,null,""]
[null,null,null,null,null,null,null,null,null,""]
[null,null,null,null,null,null,null,null,null,""]
[null,null,null,null,null,null,null,null,null,""]
[null,null,null,null,null,null,null,null,null,""]
[null,null,null,null,null,null,null,null,null,""]
[null,null,null,null,null,null,null,null,null,""]
[null,null,null,null,null,null,null,null,null,""]
[null,null,null,null,null,null,null,null,null,""]
[null,null,null,null,null,null,null,null,null,""]
[null,null,null,null,null,null,null,null,null,""]
[null,null,null,null,null,null,null,null,null,""]
[null,null,null,null,null,null,null,null,null,""]
[null,null,null,null,null,null,null,null,null,""]
[null,null,null,null,null,null,null,null,null,""]
[null,null,null,null,null,null,null,null,null,""]
[null,null,null,null,null,null,null,null,null,""]
[null,null,null,null,null,null,null,null,null,""]
[null,null,null,null,null,null,null,null,null,""]
[null,null,null,null,null,null,null,null,null,""]
[null,null,null,null,null,null,null,null,null,""]
[null,null,null,null,null,null,null,null,null,""]
[null,null,null,null,null,null,null,null,null,""]
[null,null,null,null,null,null,null,null,null,""]
[null,null,null,null,null,null,null,null,null,""]
[null,null,null,null,null,null,null,null,null,""]
[null,null,null,null,null,null,null,null,null,""]
[null,null,null,null,null,null,null,null,null,{"$f":"IF(H5015<>\"\",IF(OR(H5015=\"Bridge\",H5015=\"Mast Arm\",H5015=\"Sign Truss\",H5015=\"Temporary Signal\"),\"Vertical\",\"Horizontal\"),\"\")","v":""}]
[null,null,null,null,null,null,null,null,null,""]
[null,null,null,null,null,null,null,null,null,""]
[null,null,null,null,null,null,null,null,null,""]
[null,null,null,null,null,null,null,null,null,""]
[null,null,null,null,null,null,null,null,null,""]
[null,null,null,null,null,null,null,null,null,""]
[null,null,null,null,null,null,null,null,null,""]
[null,null,null,null,null,null,null,null,null,""]
[null,null,null,null,null,null,null,null,null,""]
[null,null,null,null,null,null,null,null,null,""]
[null,null,null,null,null,null,null,null,null,""]
[null,null,null,null,null,null,null,null,null,""]
[null,null,null,null,null,null,null,null,null,""]
[null,null,null,null,null,null,null,null,null,""]
[null,null,null,null,null,null,null,null,null,""]
[null,null,null,null,null,null,null,null,null,""]
[null,null,null,null,null,null,null,null,null,""]
[null,null,null,null,null,null,null,null,null,""]
[null,null,null,null,null,null,null,null,null,""]
[null,null,null,null,null,null,null,null,null,""]
[null,null,null,null,null,null,null,null,null,""]
[null,null,null,null,null,null,null,null,null,""]
[null,null,null,null,null,null,null,null,null,""]
[null,null,null,null,null,null,null,null,null,""]
[null,null,null,null,null,null,null,null,null,""]
[null,null,null,null,null,null,null,null,null,""]
[null,null,null,null,null,null,null,null,null,""]
[null,null,null,null,null,null,null,null,null,""]
[null,null,null,null,null,null,null,null,null,""]
[null,null,null,null,null,null,null,null,null,""]
[null,null,null,null,null,null,null,null,null,""]
[null,null,null,null,null,null,null,null,null,""]
[null,null,null,null,null,null,null,null,null,""]
[null,null,null,null,null,null,null,null,null,""]
[null,null,null,null,null,null,null,null,null,""]
[null,null,null,null,null,null,null,null,null,""]
[null,null,null,null,null,null,null,null,null,""]
[null,null,null,null,null,null,null,null,null,""]
[null,null,null,null,null,null,null,null,null,""]
[null,null,null,null,null,null,null,null,null,""]
[null,null,null,null,null,null,null,null,null,""]
[null,null,null,null,null,null,null,null,null,""]
[null,null,null,null,null,null,null,null,null,""]
[null,null,null,null,null,null,null,null,null,""]
[null,null,null,null,null,null,null,null,null,""]
[null,null,null,null,null,null,null,null,null,""]
[null,null,null,null,null,null,null,null,null,""]
[null,null,null,null,null,null,null,null,null,""]
[null,null,null,null,null,null,null,null,null,""]
[null,null,null,null,null,null,null,null,null,""]
[null,null,null,null,null,null,null,null,null,""]
[null,null,null,null,null,null,null,null,null,""]
[null,null,null,null,null,null,null,null,null,""]
[null,null,null,null,null,null,null,null,null,""]
[null,null,null,null,null,null,null,null,null,""]
[null,null,null,null,null,null,null,null,null,""]
[null,null,null,null,null,null,null,null,null,""]
[null,null,null,null,null,null,null,null,null,""]
[null,null,null,null,null,null,null,null,null,""]
[null,null,null,null,null,null,null,null,null,""]
[null,null,null,null,null,null,null,null,null,""]
[null,null,null,null,null,null,null,null,null,""]
[null,null,null,null,null,null,null,null,null,""]
[null,null,null,null,null,null,null,null,null,{"$f":"IF(H5079<>\"\",IF(OR(H5079=\"Bridge\",H5079=\"Mast Arm\",H5079=\"Sign Truss\",H5079=\"Temporary Signal\"),\"Vertical\",\"Horizontal\"),\"\")","v":""}]
[null,null,null,null,null,null,null,null,null,""]
[null,null,null,null,null,null,null,null,null,""]
[null,null,null,null,null,null,null,null,null,""]
[null,null,null,null,null,null,null,null,null,""]
[null,null,null,null,null,null,null,null,null,""]
[null,null,null,null,null,null,null,null,null,""]
[null,null,null,null,null,null,null,null,null,""]
[null,null,null,null,null,null,null,null,null,""]
[null,null,null,null,null,null,null,null,null,""]
[null,null,null,null,null,null,null,null,null,""]
[null,null,null,null,null,null,null,null,null,""]
[null,null,null,null,null,null,null,null,null,""]
[null,null,null,null,null,null,null,null,null,""]
[null,null,null,null,null,null,null,null,null,""]
[null,null,null,null,null,null,null,null,null,""]
[null,null,null,null,null,null,null,null,null,""]
[null,null,null,null,null,null,null,null,null,""]
[null,null,null,null,null,null,null,null,null,""]
[null,null,null,null,null,null,null,null,null,""]
[null,null,null,null,null,null,null,null,null,""]
[null,null,null,null,null,null,null,null,null,""]
[null,null,null,null,null,null,null,null,null,""]
[null,null,null,null,null,null,null,null,null,""]
[null,null,null,null,null,null,null,null,null,""]
[null,null,null,null,null,null,null,null,null,""]
[null,null,null,null,null,null,null,null,null,""]
[null,null,null,null,null,null,null,null,null,""]
[null,null,null,null,null,null,null,null,null,""]
[null,null,null,null,null,null,null,null,null,""]
[null,null,null,null,null,null,null,null,null,""]
[null,null,null,null,null,null,null,null,null,""]
[null,null,null,null,null,null,null,null,null,""]
[null,null,null,null,null,null,null,null,null,""]
[null,null,null,null,null,null,null,null,null,""]
[null,null,null,null,null,null,null,null,null,""]
[null,null,null,null,null,null,null,null,null,""]
[null,null,null,null,null,null,null,null,null,""]
[null,null,null,null,null,null,null,null,null,""]
[null,null,null,null,null,null,null,null,null,""]
[null,null,null,null,null,null,null,null,null,""]
[null,null,null,null,null,null,null,null,null,""]
[null,null,null,null,null,null,null,null,null,""]
[null,null,null,null,null,null,null,null,null,""]
[null,null,null,null,null,null,null,null,null,""]
[null,null,null,null,null,null,null,null,null,""]
[null,null,null,null,null,null,null,null,null,""]
[null,null,null,null,null,null,null,null,null,""]
[null,null,null,null,null,null,null,null,null,""]
[null,null,null,null,null,null,null,null,null,""]
[null,null,null,null,null,null,null,null,null,""]
[null,null,null,null,null,null,null,null,null,""]
[null,null,null,null,null,null,null,null,null,""]
[null,null,null,null,null,null,null,null,null,""]
[null,null,null,null,null,null,null,null,null,""]
[null,null,null,null,null,null,null,null,null,""]
[null,null,null,null,null,null,null,null,null,""]
[null,null,null,null,null,null,null,null,null,""]
[null,null,null,null,null,null,null,null,null,""]
[null,null,null,null,null,null,null,null,null,""]
[null,null,null,null,null,null,null,null,null,""]
[null,null,null,null,null,null,null,null,null,""]
[null,null,null,null,null,null,null,null,null,""]
[null,null,null,null,null,null,null,null,null,""]
[null,null,null,null,null,null,null,null,null,{"$f":"IF(H5143<>\"\",IF(OR(H5143=\"Bridge\",H5143=\"Mast Arm\",H5143=\"Sign Truss\",H5143=\"Temporary Signal\"),\"Vertical\",\"Horizontal\"),\"\")","v":""}]
[null,null,null,null,null,null,null,null,null,""]
[null,null,null,null,null,null,null,null,null,""]
[null,null,null,null,null,null,null,null,null,""]
[null,null,null,null,null,null,null,null,null,""]
[null,null,null,null,null,null,null,null,null,""]
[null,null,null,null,null,null,null,null,null,""]
[null,null,null,null,null,null,null,null,null,""]
[null,null,null,null,null,null,null,null,null,""]
[null,null,null,null,null,null,null,null,null,""]
[null,null,null,null,null,null,null,null,null,""]
[null,null,null,null,null,null,null,null,null,""]
[null,null,null,null,null,null,null,null,null,""]
[null,null,null,null,null,null,null,null,null,""]
[null,null,null,null,null,null,null,null,null,""]
[null,null,null,null,null,null,null,null,null,""]
[null,null,null,null,null,null,null,null,null,""]
[null,null,null,null,null,null,null,null,null,""]
[null,null,null,null,null,null,null,null,null,""]
[null,null,null,null,null,null,null,null,null,""]
[null,null,null,null,null,null,null,null,null,""]
[null,null,null,null,null,null,null,null,null,""]
[null,null,null,null,null,null,null,null,null,""]
[null,null,null,null,null,null,null,null,null,""]
[null,null,null,null,null,null,null,null,null,""]
[null,null,null,null,null,null,null,null,null,""]
[null,null,null,null,null,null,null,null,null,""]
[null,null,null,null,null,null,null,null,null,""]
[null,null,null,null,null,null,null,null,null,""]
[null,null,null,null,null,null,null,null,null,""]
[null,null,null,null,null,null,null,null,null,""]
[null,null,null,null,null,null,null,null,null,""]
[null,null,null,null,null,null,null,null,null,""]
[null,null,null,null,null,null,null,null,null,""]
[null,null,null,null,null,null,null,null,null,""]
[null,null,null,null,null,null,null,null,null,""]
[null,null,null,null,null,null,null,null,null,""]
[null,null,null,null,null,null,null,null,null,""]
[null,null,null,null,null,null,null,null,null,""]
[null,null,null,null,null,null,null,null,null,""]
[null,null,null,null,null,null,null,null,null,""]
[null,null,null,null,null,null,null,null,null,""]
[null,null,null,null,null,null,null,null,null,""]
[null,null,null,null,null,null,null,null,null,""]
[null,null,null,null,null,null,null,null,null,""]
[null,null,null,null,null,null,null,null,null,""]
[null,null,null,null,null,null,null,null,null,""]
[null,null,null,null,null,null,null,null,null,""]
[null,null,null,null,null,null,null,null,null,""]
[null,null,null,null,null,null,null,null,null,""]
[null,null,null,null,null,null,null,null,null,""]
[null,null,null,null,null,null,null,null,null,""]
[null,null,null,null,null,null,null,null,null,""]
[null,null,null,null,null,null,null,null,null,""]
[null,null,null,null,null,null,null,null,null,""]
[null,null,null,null,null,null,null,null,null,""]
[null,null,null,null,null,null,null,null,null,""]
[null,null,null,null,null,null,null,null,null,""]
[null,null,null,null,null,null,null,null,null,""]
[null,null,null,null,null,null,null,null,null,""]
[null,null,null,null,null,null,null,null,null,""]
[null,null,null,null,null,null,null,null,null,""]
[null,null,null,null,null,null,null,null,null,""]
[null,null,null,null,null,null,null,null,null,""]
[null,null,null,null,null,null,null,null,null,{"$f":"IF(H5207<>\"\",IF(OR(H5207=\"Bridge\",H5207=\"Mast Arm\",H5207=\"Sign Truss\",H5207=\"Temporary Signal\"),\"Vertical\",\"Horizontal\"),\"\")","v":""}]
[null,null,null,null,null,null,null,null,null,""]
[null,null,null,null,null,null,null,null,null,""]
[null,null,null,null,null,null,null,null,null,""]
[null,null,null,null,null,null,null,null,null,""]
[null,null,null,null,null,null,null,null,null,""]
[null,null,null,null,null,null,null,null,null,""]
[null,null,null,null,null,null,null,null,null,""]
[null,null,null,null,null,null,null,null,null,""]
[null,null,null,null,null,null,null,null,null,""]
[null,null,null,null,null,null,null,null,null,""]
[null,null,null,null,null,null,null,null,null,""]
[null,null,null,null,null,null,null,null,null,""]
[null,null,null,null,null,null,null,null,null,""]
[null,null,null,null,null,null,null,null,null,""]
[null,null,null,null,null,null,null,null,null,""]
[null,null,null,null,null,null,null,null,null,""]
[null,null,null,null,null,null,null,null,null,""]
[null,null,null,null,null,null,null,null,null,""]
[null,null,null,null,null,null,null,null,null,""]
[null,null,null,null,null,null,null,null,null,""]
[null,null,null,null,null,null,null,null,null,""]
[null,null,null,null,null,null,null,null,null,""]
[null,null,null,null,null,null,null,null,null,""]
[null,null,null,null,null,null,null,null,null,""]
[null,null,null,null,null,null,null,null,null,""]
[null,null,null,null,null,null,null,null,null,""]
[null,null,null,null,null,null,null,null,null,""]
[null,null,null,null,null,null,null,null,null,""]
[null,null,null,null,null,null,null,null,null,""]
[null,null,null,null,null,null,null,null,null,""]
[null,null,null,null,null,null,null,null,null,""]
[null,null,null,null,null,null,null,null,null,""]
[null,null,null,null,null,null,null,null,null,""]
[null,null,null,null,null,null,null,null,null,""]
[null,null,null,null,null,null,null,null,null,""]
[null,null,null,null,null,null,null,null,null,""]
[null,null,null,null,null,null,null,null,null,""]
[null,null,null,null,null,null,null,null,null,""]
[null,null,null,null,null,null,null,null,null,""]
[null,null,null,null,null,null,null,null,null,""]
[null,null,null,null,null,null,null,null,null,""]
[null,null,null,null,null,null,null,null,null,""]
[null,null,null,null,null,null,null,null,null,""]
[null,null,null,null,null,null,null,null,null,""]
[null,null,null,null,null,null,null,null,null,""]
[null,null,null,null,null,null,null,null,null,""]
[null,null,null,null,null,null,null,null,null,""]
[null,null,null,null,null,null,null,null,null,""]
[null,null,null,null,null,null,null,null,null,""]
[null,null,null,null,null,null,null,null,null,""]
[null,null,null,null,null,null,null,null,null,""]
[null,null,null,null,null,null,null,null,null,""]
[null,null,null,null,null,null,null,null,null,""]
[null,null,null,null,null,null,null,null,null,""]
[null,null,null,null,null,null,null,null,null,""]
[null,null,null,null,null,null,null,null,null,""]
[null,null,null,null,null,null,null,null,null,""]
[null,null,null,null,null,null,null,null,null,""]
[null,null,null,null,null,null,null,null,null,""]
[null,null,null,null,null,null,null,null,null,""]
[null,null,null,null,null,null,null,null,null,""]
[null,null,null,null,null,null,null,null,null,""]
[null,null,null,null,null,null,null,null,null,""]
[null,null,null,null,null,null,null,null,null,{"$f":"IF(H5271<>\"\",IF(OR(H5271=\"Bridge\",H5271=\"Mast Arm\",H5271=\"Sign Truss\",H5271=\"Temporary Signal\"),\"Vertical\",\"Horizontal\"),\"\")","v":""}]
[null,null,null,null,null,null,null,null,null,""]
[null,null,null,null,null,null,null,null,null,""]
[null,null,null,null,null,null,null,null,null,""]
[null,null,null,null,null,null,null,null,null,""]
[null,null,null,null,null,null,null,null,null,""]
[null,null,null,null,null,null,null,null,null,""]
[null,null,null,null,null,null,null,null,null,""]
[null,null,null,null,null,null,null,null,null,""]
[null,null,null,null,null,null,null,null,null,""]
[null,null,null,null,null,null,null,null,null,""]
[null,null,null,null,null,null,null,null,null,""]
[null,null,null,null,null,null,null,null,null,""]
[null,null,null,null,null,null,null,null,null,""]
[null,null,null,null,null,null,null,null,null,""]
[null,null,null,null,null,null,null,null,null,""]
[null,null,null,null,null,null,null,null,null,""]
[null,null,null,null,null,null,null,null,null,""]
[null,null,null,null,null,null,null,null,null,""]
[null,null,null,null,null,null,null,null,null,""]
[null,null,null,null,null,null,null,null,null,""]
[null,null,null,null,null,null,null,null,null,""]
[null,null,null,null,null,null,null,null,null,""]
[null,null,null,null,null,null,null,null,null,""]
[null,null,null,null,null,null,null,null,null,""]
[null,null,null,null,null,null,null,null,null,""]
[null,null,null,null,null,null,null,null,null,""]
[null,null,null,null,null,null,null,null,null,""]
[null,null,null,null,null,null,null,null,null,""]
[null,null,null,null,null,null,null,null,null,""]
[null,null,null,null,null,null,null,null,null,""]
[null,null,null,null,null,null,null,null,null,""]
[null,null,null,null,null,null,null,null,null,""]
[null,null,null,null,null,null,null,null,null,""]
[null,null,null,null,null,null,null,null,null,""]
[null,null,null,null,null,null,null,null,null,""]
[null,null,null,null,null,null,null,null,null,""]
[null,null,null,null,null,null,null,null,null,""]
[null,null,null,null,null,null,null,null,null,""]
[null,null,null,null,null,null,null,null,null,""]
[null,null,null,null,null,null,null,null,null,""]
[null,null,null,null,null,null,null,null,null,""]
[null,null,null,null,null,null,null,null,null,""]
[null,null,null,null,null,null,null,null,null,""]
[null,null,null,null,null,null,null,null,null,""]
[null,null,null,null,null,null,null,null,null,""]
[null,null,null,null,null,null,null,null,null,""]
[null,null,null,null,null,null,null,null,null,""]
[null,null,null,null,null,null,null,null,null,""]
[null,null,null,null,null,null,null,null,null,""]
[null,null,null,null,null,null,null,null,null,""]
[null,null,null,null,null,null,null,null,null,""]
[null,null,null,null,null,null,null,null,null,""]
[null,null,null,null,null,null,null,null,null,""]
[null,null,null,null,null,null,null,null,null,""]
[null,null,null,null,null,null,null,null,null,""]
[null,null,null,null,null,null,null,null,null,""]
[null,null,null,null,null,null,null,null,null,""]
[null,null,null,null,null,null,null,null,null,""]
[null,null,null,null,null,null,null,null,null,""]
[null,null,null,null,null,null,null,null,null,""]
[null,null,null,null,null,null,null,null,null,""]
[null,null,null,null,null,null,null,null,null,""]
[null,null,null,null,null,null,null,null,null,""]
[null,null,null,null,null,null,null,null,null,{"$f":"IF(H5335<>\"\",IF(OR(H5335=\"Bridge\",H5335=\"Mast Arm\",H5335=\"Sign Truss\",H5335=\"Temporary Signal\"),\"Vertical\",\"Horizontal\"),\"\")","v":""}]
[null,null,null,null,null,null,null,null,null,""]
[null,null,null,null,null,null,null,null,null,""]
[null,null,null,null,null,null,null,null,null,""]
[null,null,null,null,null,null,null,null,null,""]
[null,null,null,null,null,null,null,null,null,""]
[null,null,null,null,null,null,null,null,null,""]
[null,null,null,null,null,null,null,null,null,""]
[null,null,null,null,null,null,null,null,null,""]
[null,null,null,null,null,null,null,null,null,""]
[null,null,null,null,null,null,null,null,null,""]
[null,null,null,null,null,null,null,null,null,""]
[null,null,null,null,null,null,null,null,null,""]
[null,null,null,null,null,null,null,null,null,""]
[null,null,null,null,null,null,null,null,null,""]
[null,null,null,null,null,null,null,null,null,""]
[null,null,null,null,null,null,null,null,null,""]
[null,null,null,null,null,null,null,null,null,""]
[null,null,null,null,null,null,null,null,null,""]
[null,null,null,null,null,null,null,null,null,""]
[null,null,null,null,null,null,null,null,null,""]
[null,null,null,null,null,null,null,null,null,""]
[null,null,null,null,null,null,null,null,null,""]
[null,null,null,null,null,null,null,null,null,""]
[null,null,null,null,null,null,null,null,null,""]
[null,null,null,null,null,null,null,null,null,""]
[null,null,null,null,null,null,null,null,null,""]
[null,null,null,null,null,null,null,null,null,""]
[null,null,null,null,null,null,null,null,null,""]
[null,null,null,null,null,null,null,null,null,""]
[null,null,null,null,null,null,null,null,null,""]
[null,null,null,null,null,null,null,null,null,""]
[null,null,null,null,null,null,null,null,null,""]
[null,null,null,null,null,null,null,null,null,""]
[null,null,null,null,null,null,null,null,null,""]
[null,null,null,null,null,null,null,null,null,""]
[null,null,null,null,null,null,null,null,null,""]
[null,null,null,null,null,null,null,null,null,""]
[null,null,null,null,null,null,null,null,null,""]
[null,null,null,null,null,null,null,null,null,""]
[null,null,null,null,null,null,null,null,null,""]
[null,null,null,null,null,null,null,null,null,""]
[null,null,null,null,null,null,null,null,null,""]
[null,null,null,null,null,null,null,null,null,""]
[null,null,null,null,null,null,null,null,null,""]
[null,null,null,null,null,null,null,null,null,""]
[null,null,null,null,null,null,null,null,null,""]
[null,null,null,null,null,null,null,null,null,""]
[null,null,null,null,null,null,null,null,null,""]
[null,null,null,null,null,null,null,null,null,""]
[null,null,null,null,null,null,null,null,null,""]
[null,null,null,null,null,null,null,null,null,""]
[null,null,null,null,null,null,null,null,null,""]
[null,null,null,null,null,null,null,null,null,""]
[null,null,null,null,null,null,null,null,null,""]
[null,null,null,null,null,null,null,null,null,""]
[null,null,null,null,null,null,null,null,null,""]
[null,null,null,null,null,null,null,null,null,""]
[null,null,null,null,null,null,null,null,null,""]
[null,null,null,null,null,null,null,null,null,""]
[null,null,null,null,null,null,null,null,null,""]
[null,null,null,null,null,null,null,null,null,""]
[null,null,null,null,null,null,null,null,null,""]
[null,null,null,null,null,null,null,null,null,""]
[null,null,null,null,null,null,null,null,null,{"$f":"IF(H5399<>\"\",IF(OR(H5399=\"Bridge\",H5399=\"Mast Arm\",H5399=\"Sign Truss\",H5399=\"Temporary Signal\"),\"Vertical\",\"Horizontal\"),\"\")","v":""}]
[null,null,null,null,null,null,null,null,null,""]
[null,null,null,null,null,null,null,null,null,""]
[null,null,null,null,null,null,null,null,null,""]
[null,null,null,null,null,null,null,null,null,""]
[null,null,null,null,null,null,null,null,null,""]
[null,null,null,null,null,null,null,null,null,""]
[null,null,null,null,null,null,null,null,null,""]
[null,null,null,null,null,null,null,null,null,""]
[null,null,null,null,null,null,null,null,null,""]
[null,null,null,null,null,null,null,null,null,""]
[null,null,null,null,null,null,null,null,null,""]
[null,null,null,null,null,null,null,null,null,""]
[null,null,null,null,null,null,null,null,null,""]
[null,null,null,null,null,null,null,null,null,""]
[null,null,null,null,null,null,null,null,null,""]
[null,null,null,null,null,null,null,null,null,""]
[null,null,null,null,null,null,null,null,null,""]
[null,null,null,null,null,null,null,null,null,""]
[null,null,null,null,null,null,null,null,null,""]
[null,null,null,null,null,null,null,null,null,""]
[null,null,null,null,null,null,null,null,null,""]
[null,null,null,null,null,null,null,null,null,""]
[null,null,null,null,null,null,null,null,null,""]
[null,null,null,null,null,null,null,null,null,""]
[null,null,null,null,null,null,null,null,null,""]
[null,null,null,null,null,null,null,null,null,""]
[null,null,null,null,null,null,null,null,null,""]
[null,null,null,null,null,null,null,null,null,""]
[null,null,null,null,null,null,null,null,null,""]
[null,null,null,null,null,null,null,null,null,""]
[null,null,null,null,null,null,null,null,null,""]
[null,null,null,null,null,null,null,null,null,""]
[null,null,null,null,null,null,null,null,null,""]
[null,null,null,null,null,null,null,null,null,""]
[null,null,null,null,null,null,null,null,null,""]
[null,null,null,null,null,null,null,null,null,""]
[null,null,null,null,null,null,null,null,null,""]
[null,null,null,null,null,null,null,null,null,""]
[null,null,null,null,null,null,null,null,null,""]
[null,null,null,null,null,null,null,null,null,""]
[null,null,null,null,null,null,null,null,null,""]
[null,null,null,null,null,null,null,null,null,""]
[null,null,null,null,null,null,null,null,null,""]
[null,null,null,null,null,null,null,null,null,""]
[null,null,null,null,null,null,null,null,null,""]
[null,null,null,null,null,null,null,null,null,""]
[null,null,null,null,null,null,null,null,null,""]
[null,null,null,null,null,null,null,null,null,""]
[null,null,null,null,null,null,null,null,null,""]
[null,null,null,null,null,null,null,null,null,""]
[null,null,null,null,null,null,null,null,null,""]
[null,null,null,null,null,null,null,null,null,""]
[null,null,null,null,null,null,null,null,null,""]
[null,null,null,null,null,null,null,null,null,""]
[null,null,null,null,null,null,null,null,null,""]
[null,null,null,null,null,null,null,null,null,""]
[null,null,null,null,null,null,null,null,null,""]
[null,null,null,null,null,null,null,null,null,""]
[null,null,null,null,null,null,null,null,null,""]
[null,null,null,null,null,null,null,null,null,""]
[null,null,null,null,null,null,null,null,null,""]
[null,null,null,null,null,null,null,null,null,""]
[null,null,null,null,null,null,null,null,null,""]
[null,null,null,null,null,null,null,null,null,{"$f":"IF(H5463<>\"\",IF(OR(H5463=\"Bridge\",H5463=\"Mast Arm\",H5463=\"Sign Truss\",H5463=\"Temporary Signal\"),\"Vertical\",\"Horizontal\"),\"\")","v":""}]
[null,null,null,null,null,null,null,null,null,""]
[null,null,null,null,null,null,null,null,null,""]
[null,null,null,null,null,null,null,null,null,""]
[null,null,null,null,null,null,null,null,null,""]
[null,null,null,null,null,null,null,null,null,""]
[null,null,null,null,null,null,null,null,null,""]
[null,null,null,null,null,null,null,null,null,""]
[null,null,null,null,null,null,null,null,null,""]
[null,null,null,null,null,null,null,null,null,""]
[null,null,null,null,null,null,null,null,null,""]
[null,null,null,null,null,null,null,null,null,""]
[null,null,null,null,null,null,null,null,null,""]
[null,null,null,null,null,null,null,null,null,""]
[null,null,null,null,null,null,null,null,null,""]
[null,null,null,null,null,null,null,null,null,""]
[null,null,null,null,null,null,null,null,null,""]
[null,null,null,null,null,null,null,null,null,""]
[null,null,null,null,null,null,null,null,null,""]
[null,null,null,null,null,null,null,null,null,""]
[null,null,null,null,null,null,null,null,null,""]
[null,null,null,null,null,null,null,null,null,""]
[null,null,null,null,null,null,null,null,null,""]
[null,null,null,null,null,null,null,null,null,""]
[null,null,null,null,null,null,null,null,null,""]
[null,null,null,null,null,null,null,null,null,""]
[null,null,null,null,null,null,null,null,null,""]
[null,null,null,null,null,null,null,null,null,""]
[null,null,null,null,null,null,null,null,null,""]
[null,null,null,null,null,null,null,null,null,""]
[null,null,null,null,null,null,null,null,null,""]
[null,null,null,null,null,null,null,null,null,""]
[null,null,null,null,null,null,null,null,null,""]
[null,null,null,null,null,null,null,null,null,""]
[null,null,null,null,null,null,null,null,null,""]
[null,null,null,null,null,null,null,null,null,""]
[null,null,null,null,null,null,null,null,null,""]
[null,null,null,null,null,null,null,null,null,""]
[null,null,null,null,null,null,null,null,null,""]
[null,null,null,null,null,null,null,null,null,""]
[null,null,null,null,null,null,null,null,null,""]
[null,null,null,null,null,null,null,null,null,""]
[null,null,null,null,null,null,null,null,null,""]
[null,null,null,null,null,null,null,null,null,""]
[null,null,null,null,null,null,null,null,null,""]
[null,null,null,null,null,null,null,null,null,""]
[null,null,null,null,null,null,null,null,null,""]
[null,null,null,null,null,null,null,null,null,""]
[null,null,null,null,null,null,null,null,null,""]
[null,null,null,null,null,null,null,null,null,""]
[null,null,null,null,null,null,null,null,null,""]
[null,null,null,null,null,null,null,null,null,""]
[null,null,null,null,null,null,null,null,null,""]
[null,null,null,null,null,null,null,null,null,""]
[null,null,null,null,null,null,null,null,null,""]
[null,null,null,null,null,null,null,null,null,""]
[null,null,null,null,null,null,null,null,null,""]
[null,null,null,null,null,null,null,null,null,""]
[null,null,null,null,null,null,null,null,null,""]
[null,null,null,null,null,null,null,null,null,""]
[null,null,null,null,null,null,null,null,null,""]
[null,null,null,null,null,null,null,null,null,""]
[null,null,null,null,null,null,null,null,null,""]
[null,null,null,null,null,null,null,null,null,""]
[null,null,null,null,null,null,null,null,null,{"$f":"IF(H5527<>\"\",IF(OR(H5527=\"Bridge\",H5527=\"Mast Arm\",H5527=\"Sign Truss\",H5527=\"Temporary Signal\"),\"Vertical\",\"Horizontal\"),\"\")","v":""}]
[null,null,null,null,null,null,null,null,null,""]
[null,null,null,null,null,null,null,null,null,""]
[null,null,null,null,null,null,null,null,null,""]
[null,null,null,null,null,null,null,null,null,""]
[null,null,null,null,null,null,null,null,null,""]
[null,null,null,null,null,null,null,null,null,""]
[null,null,null,null,null,null,null,null,null,""]
[null,null,null,null,null,null,null,null,null,""]
[null,null,null,null,null,null,null,null,null,""]
[null,null,null,null,null,null,null,null,null,""]
[null,null,null,null,null,null,null,null,null,""]
[null,null,null,null,null,null,null,null,null,""]
[null,null,null,null,null,null,null,null,null,""]
[null,null,null,null,null,null,null,null,null,""]
[null,null,null,null,null,null,null,null,null,""]
[null,null,null,null,null,null,null,null,null,""]
[null,null,null,null,null,null,null,null,null,""]
[null,null,null,null,null,null,null,null,null,""]
[null,null,null,null,null,null,null,null,null,""]
[null,null,null,null,null,null,null,null,null,""]
[null,null,null,null,null,null,null,null,null,""]
[null,null,null,null,null,null,null,null,null,""]
[null,null,null,null,null,null,null,null,null,""]
[null,null,null,null,null,null,null,null,null,""]
[null,null,null,null,null,null,null,null,null,""]
[null,null,null,null,null,null,null,null,null,""]
[null,null,null,null,null,null,null,null,null,""]
[null,null,null,null,null,null,null,null,null,""]
[null,null,null,null,null,null,null,null,null,""]
[null,null,null,null,null,null,null,null,null,""]
[null,null,null,null,null,null,null,null,null,""]
[null,null,null,null,null,null,null,null,null,""]
[null,null,null,null,null,null,null,null,null,""]
[null,null,null,null,null,null,null,null,null,""]
[null,null,null,null,null,null,null,null,null,""]
[null,null,null,null,null,null,null,null,null,""]
[null,null,null,null,null,null,null,null,null,""]
[null,null,null,null,null,null,null,null,null,""]
[null,null,null,null,null,null,null,null,null,""]
[null,null,null,null,null,null,null,null,null,""]
[null,null,null,null,null,null,null,null,null,""]
[null,null,null,null,null,null,null,null,null,""]
[null,null,null,null,null,null,null,null,null,""]
[null,null,null,null,null,null,null,null,null,""]
[null,null,null,null,null,null,null,null,null,""]
[null,null,null,null,null,null,null,null,null,""]
[null,null,null,null,null,null,null,null,null,""]
[null,null,null,null,null,null,null,null,null,""]
[null,null,null,null,null,null,null,null,null,""]
[null,null,null,null,null,null,null,null,null,""]
[null,null,null,null,null,null,null,null,null,""]
[null,null,null,null,null,null,null,null,null,""]
[null,null,null,null,null,null,null,null,null,""]
[null,null,null,null,null,null,null,null,null,""]
[null,null,null,null,null,null,null,null,null,""]
[null,null,null,null,null,null,null,null,null,""]
[null,null,null,null,null,null,null,null,null,""]
[null,null,null,null,null,null,null,null,null,""]
[null,null,null,null,null,null,null,null,null,""]
[null,null,null,null,null,null,null,null,null,""]
[null,null,null,null,null,null,null,null,null,""]
[null,null,null,null,null,null,null,null,null,""]
[null,null,null,null,null,null,null,null,null,""]
[null,null,null,null,null,null,null,null,null,{"$f":"IF(H5591<>\"\",IF(OR(H5591=\"Bridge\",H5591=\"Mast Arm\",H5591=\"Sign Truss\",H5591=\"Temporary Signal\"),\"Vertical\",\"Horizontal\"),\"\")","v":""}]
[null,null,null,null,null,null,null,null,null,""]
[null,null,null,null,null,null,null,null,null,""]
[null,null,null,null,null,null,null,null,null,""]
[null,null,null,null,null,null,null,null,null,""]
[null,null,null,null,null,null,null,null,null,""]
[null,null,null,null,null,null,null,null,null,""]
[null,null,null,null,null,null,null,null,null,""]
[null,null,null,null,null,null,null,null,null,""]
[null,null,null,null,null,null,null,null,null,""]
[null,null,null,null,null,null,null,null,null,""]
[null,null,null,null,null,null,null,null,null,""]
[null,null,null,null,null,null,null,null,null,""]
[null,null,null,null,null,null,null,null,null,""]
[null,null,null,null,null,null,null,null,null,""]
[null,null,null,null,null,null,null,null,null,""]
[null,null,null,null,null,null,null,null,null,""]
[null,null,null,null,null,null,null,null,null,""]
[null,null,null,null,null,null,null,null,null,""]
[null,null,null,null,null,null,null,null,null,""]
[null,null,null,null,null,null,null,null,null,""]
[null,null,null,null,null,null,null,null,null,""]
[null,null,null,null,null,null,null,null,null,""]
[null,null,null,null,null,null,null,null,null,""]
[null,null,null,null,null,null,null,null,null,""]
[null,null,null,null,null,null,null,null,null,""]
[null,null,null,null,null,null,null,null,null,""]
[null,null,null,null,null,null,null,null,null,""]
[null,null,null,null,null,null,null,null,null,""]
[null,null,null,null,null,null,null,null,null,""]
[null,null,null,null,null,null,null,null,null,""]
[null,null,null,null,null,null,null,null,null,""]
[null,null,null,null,null,null,null,null,null,""]
[null,null,null,null,null,null,null,null,null,""]
[null,null,null,null,null,null,null,null,null,""]
[null,null,null,null,null,null,null,null,null,""]
[null,null,null,null,null,null,null,null,null,""]
[null,null,null,null,null,null,null,null,null,""]
[null,null,null,null,null,null,null,null,null,""]
[null,null,null,null,null,null,null,null,null,""]
[null,null,null,null,null,null,null,null,null,""]
[null,null,null,null,null,null,null,null,null,""]
[null,null,null,null,null,null,null,null,null,""]
[null,null,null,null,null,null,null,null,null,""]
[null,null,null,null,null,null,null,null,null,""]
[null,null,null,null,null,null,null,null,null,""]
[null,null,null,null,null,null,null,null,null,""]
[null,null,null,null,null,null,null,null,null,""]
[null,null,null,null,null,null,null,null,null,""]
[null,null,null,null,null,null,null,null,null,""]
[null,null,null,null,null,null,null,null,null,""]
[null,null,null,null,null,null,null,null,null,""]
[null,null,null,null,null,null,null,null,null,""]
[null,null,null,null,null,null,null,null,null,""]
[null,null,null,null,null,null,null,null,null,""]
[null,null,null,null,null,null,null,null,null,""]
[null,null,null,null,null,null,null,null,null,""]
[null,null,null,null,null,null,null,null,null,""]
[null,null,null,null,null,null,null,null,null,""]
[null,null,null,null,null,null,null,null,null,""]
[null,null,null,null,null,null,null,null,null,""]
[null,null,null,null,null,null,null,null,null,""]
[null,null,null,null,null,null,null,null,null,""]
[null,null,null,null,null,null,null,null,null,""]
[null,null,null,null,null,null,null,null,null,{"$f":"IF(H5655<>\"\",IF(OR(H5655=\"Bridge\",H5655=\"Mast Arm\",H5655=\"Sign Truss\",H5655=\"Temporary Signal\"),\"Vertical\",\"Horizontal\"),\"\")","v":""}]
[null,null,null,null,null,null,null,null,null,""]
[null,null,null,null,null,null,null,null,null,""]
[null,null,null,null,null,null,null,null,null,""]
[null,null,null,null,null,null,null,null,null,""]
[null,null,null,null,null,null,null,null,null,""]
[null,null,null,null,null,null,null,null,null,""]
[null,null,null,null,null,null,null,null,null,""]
[null,null,null,null,null,null,null,null,null,""]
[null,null,null,null,null,null,null,null,null,""]
[null,null,null,null,null,null,null,null,null,""]
[null,null,null,null,null,null,null,null,null,""]
[null,null,null,null,null,null,null,null,null,""]
[null,null,null,null,null,null,null,null,null,""]
[null,null,null,null,null,null,null,null,null,""]
[null,null,null,null,null,null,null,null,null,""]
[null,null,null,null,null,null,null,null,null,""]
[null,null,null,null,null,null,null,null,null,""]
[null,null,null,null,null,null,null,null,null,""]
[null,null,null,null,null,null,null,null,null,""]
[null,null,null,null,null,null,null,null,null,""]
[null,null,null,null,null,null,null,null,null,""]
[null,null,null,null,null,null,null,null,null,""]
[null,null,null,null,null,null,null,null,null,""]
[null,null,null,null,null,null,null,null,null,""]
[null,null,null,null,null,null,null,null,null,""]
[null,null,null,null,null,null,null,null,null,""]
[null,null,null,null,null,null,null,null,null,""]
[null,null,null,null,null,null,null,null,null,""]
[null,null,null,null,null,null,null,null,null,""]
[null,null,null,null,null,null,null,null,null,""]
[null,null,null,null,null,null,null,null,null,""]
[null,null,null,null,null,null,null,null,null,""]
[null,null,null,null,null,null,null,null,null,""]
[null,null,null,null,null,null,null,null,null,""]
[null,null,null,null,null,null,null,null,null,""]
[null,null,null,null,null,null,null,null,null,""]
[null,null,null,null,null,null,null,null,null,""]
[null,null,null,null,null,null,null,null,null,""]
[null,null,null,null,null,null,null,null,null,""]
[null,null,null,null,null,null,null,null,null,""]
[null,null,null,null,null,null,null,null,null,""]
[null,null,null,null,null,null,null,null,null,""]
[null,null,null,null,null,null,null,null,null,""]
[null,null,null,null,null,null,null,null,null,""]
[null,null,null,null,null,null,null,null,null,""]
[null,null,null,null,null,null,null,null,null,""]
[null,null,null,null,null,null,null,null,null,""]
[null,null,null,null,null,null,null,null,null,""]
[null,null,null,null,null,null,null,null,null,""]
[null,null,null,null,null,null,null,null,null,""]
[null,null,null,null,null,null,null,null,null,""]
[null,null,null,null,null,null,null,null,null,""]
[null,null,null,null,null,null,null,null,null,""]
[null,null,null,null,null,null,null,null,null,""]
[null,null,null,null,null,null,null,null,null,""]
[null,null,null,null,null,null,null,null,null,""]
[null,null,null,null,null,null,null,null,null,""]
[null,null,null,null,null,null,null,null,null,""]
[null,null,null,null,null,null,null,null,null,""]
[null,null,null,null,null,null,null,null,null,""]
[null,null,null,null,null,null,null,null,null,""]
[null,null,null,null,null,null,null,null,null,""]
[null,null,null,null,null,null,null,null,null,""]
[null,null,null,null,null,null,null,null,null,{"$f":"IF(H5719<>\"\",IF(OR(H5719=\"Bridge\",H5719=\"Mast Arm\",H5719=\"Sign Truss\",H5719=\"Temporary Signal\"),\"Vertical\",\"Horizontal\"),\"\")","v":""}]
[null,null,null,null,null,null,null,null,null,""]
[null,null,null,null,null,null,null,null,null,""]
[null,null,null,null,null,null,null,null,null,""]
[null,null,null,null,null,null,null,null,null,""]
[null,null,null,null,null,null,null,null,null,""]
[null,null,null,null,null,null,null,null,null,""]
[null,null,null,null,null,null,null,null,null,""]
[null,null,null,null,null,null,null,null,null,""]
[null,null,null,null,null,null,null,null,null,""]
[null,null,null,null,null,null,null,null,null,""]
[null,null,null,null,null,null,null,null,null,""]
[null,null,null,null,null,null,null,null,null,""]
[null,null,null,null,null,null,null,null,null,""]
[null,null,null,null,null,null,null,null,null,""]
[null,null,null,null,null,null,null,null,null,""]
[null,null,null,null,null,null,null,null,null,""]
[null,null,null,null,null,null,null,null,null,""]
[null,null,null,null,null,null,null,null,null,""]
[null,null,null,null,null,null,null,null,null,""]
[null,null,null,null,null,null,null,null,null,""]
[null,null,null,null,null,null,null,null,null,""]
[null,null,null,null,null,null,null,null,null,""]
[null,null,null,null,null,null,null,null,null,""]
[null,null,null,null,null,null,null,null,null,""]
[null,null,null,null,null,null,null,null,null,""]
[null,null,null,null,null,null,null,null,null,""]
[null,null,null,null,null,null,null,null,null,""]
[null,null,null,null,null,null,null,null,null,""]
[null,null,null,null,null,null,null,null,null,""]
[null,null,null,null,null,null,null,null,null,""]
[null,null,null,null,null,null,null,null,null,""]
[null,null,null,null,null,null,null,null,null,""]
[null,null,null,null,null,null,null,null,null,""]
[null,null,null,null,null,null,null,null,null,""]
[null,null,null,null,null,null,null,null,null,""]
[null,null,null,null,null,null,null,null,null,""]
[null,null,null,null,null,null,null,null,null,""]
[null,null,null,null,null,null,null,null,null,""]
[null,null,null,null,null,null,null,null,null,""]
[null,null,null,null,null,null,null,null,null,""]
[null,null,null,null,null,null,null,null,null,""]
[null,null,null,null,null,null,null,null,null,""]
[null,null,null,null,null,null,null,null,null,""]
[null,null,null,null,null,null,null,null,null,""]
[null,null,null,null,null,null,null,null,null,""]
[null,null,null,null,null,null,null,null,null,""]
[null,null,null,null,null,null,null,null,null,""]
[null,null,null,null,null,null,null,null,null,""]
[null,null,null,null,null,null,null,null,null,""]
[null,null,null,null,null,null,null,null,null,""]
[null,null,null,null,null,null,null,null,null,""]
[null,null,null,null,null,null,null,null,null,""]
[null,null,null,null,null,null,null,null,null,""]
[null,null,null,null,null,null,null,null,null,""]
[null,null,null,null,null,null,null,null,null,""]
[null,null,null,null,null,null,null,null,null,""]
[null,null,null,null,null,null,null,null,null,""]
[null,null,null,null,null,null,null,null,null,""]
[null,null,null,null,null,null,null,null,null,""]
[null,null,null,null,null,null,null,null,null,""]
[null,null,null,null,null,null,null,null,null,""]
[null,null,null,null,null,null,null,null,null,""]
[null,null,null,null,null,null,null,null,null,""]
[null,null,null,null,null,null,null,null,null,{"$f":"IF(H5783<>\"\",IF(OR(H5783=\"Bridge\",H5783=\"Mast Arm\",H5783=\"Sign Truss\",H5783=\"Temporary Signal\"),\"Vertical\",\"Horizontal\"),\"\")","v":""}]
[null,null,null,null,null,null,null,null,null,""]
[null,null,null,null,null,null,null,null,null,""]
[null,null,null,null,null,null,null,null,null,""]
[null,null,null,null,null,null,null,null,null,""]
[null,null,null,null,null,null,null,null,null,""]
[null,null,null,null,null,null,null,null,null,""]
[null,null,null,null,null,null,null,null,null,""]
[null,null,null,null,null,null,null,null,null,""]
[null,null,null,null,null,null,null,null,null,""]
[null,null,null,null,null,null,null,null,null,""]
[null,null,null,null,null,null,null,null,null,""]
[null,null,null,null,null,null,null,null,null,""]
[null,null,null,null,null,null,null,null,null,""]
[null,null,null,null,null,null,null,null,null,""]
[null,null,null,null,null,null,null,null,null,""]
[null,null,null,null,null,null,null,null,null,""]
[null,null,null,null,null,null,null,null,null,""]
[null,null,null,null,null,null,null,null,null,""]
[null,null,null,null,null,null,null,null,null,""]
[null,null,null,null,null,null,null,null,null,""]
[null,null,null,null,null,null,null,null,null,""]
[null,null,null,null,null,null,null,null,null,""]
[null,null,null,null,null,null,null,null,null,""]
[null,null,null,null,null,null,null,null,null,""]
[null,null,null,null,null,null,null,null,null,""]
[null,null,null,null,null,null,null,null,null,""]
[null,null,null,null,null,null,null,null,null,""]
[null,null,null,null,null,null,null,null,null,""]
[null,null,null,null,null,null,null,null,null,""]
[null,null,null,null,null,null,null,null,null,""]
[null,null,null,null,null,null,null,null,null,""]
[null,null,null,null,null,null,null,null,null,""]
[null,null,null,null,null,null,null,null,null,""]
[null,null,null,null,null,null,null,null,null,""]
[null,null,null,null,null,null,null,null,null,""]
[null,null,null,null,null,null,null,null,null,""]
[null,null,null,null,null,null,null,null,null,""]
[null,null,null,null,null,null,null,null,null,""]
[null,null,null,null,null,null,null,null,null,""]
[null,null,null,null,null,null,null,null,null,""]
[null,null,null,null,null,null,null,null,null,""]
[null,null,null,null,null,null,null,null,null,""]
[null,null,null,null,null,null,null,null,null,""]
[null,null,null,null,null,null,null,null,null,""]
[null,null,null,null,null,null,null,null,null,""]
[null,null,null,null,null,null,null,null,null,""]
[null,null,null,null,null,null,null,null,null,""]
[null,null,null,null,null,null,null,null,null,""]
[null,null,null,null,null,null,null,null,null,""]
[null,null,null,null,null,null,null,null,null,""]
[null,null,null,null,null,null,null,null,null,""]
[null,null,null,null,null,null,null,null,null,""]
[null,null,null,null,null,null,null,null,null,""]
[null,null,null,null,null,null,null,null,null,""]
[null,null,null,null,null,null,null,null,null,""]
[null,null,null,null,null,null,null,null,null,""]
[null,null,null,null,null,null,null,null,null,""]
[null,null,null,null,null,null,null,null,null,""]
[null,null,null,null,null,null,null,null,null,""]
[null,null,null,null,null,null,null,null,null,""]
[null,null,null,null,null,null,null,null,null,""]
[null,null,null,null,null,null,null,null,null,""]
[null,null,null,null,null,null,null,null,null,""]
[null,null,null,null,null,null,null,null,null,{"$f":"IF(H5847<>\"\",IF(OR(H5847=\"Bridge\",H5847=\"Mast Arm\",H5847=\"Sign Truss\",H5847=\"Temporary Signal\"),\"Vertical\",\"Horizontal\"),\"\")","v":""}]
[null,null,null,null,null,null,null,null,null,""]
[null,null,null,null,null,null,null,null,null,""]
[null,null,null,null,null,null,null,null,null,""]
[null,null,null,null,null,null,null,null,null,""]
[null,null,null,null,null,null,null,null,null,""]
[null,null,null,null,null,null,null,null,null,""]
[null,null,null,null,null,null,null,null,null,""]
[null,null,null,null,null,null,null,null,null,""]
[null,null,null,null,null,null,null,null,null,""]
[null,null,null,null,null,null,null,null,null,""]
[null,null,null,null,null,null,null,null,null,""]
[null,null,null,null,null,null,null,null,null,""]
[null,null,null,null,null,null,null,null,null,""]
[null,null,null,null,null,null,null,null,null,""]
[null,null,null,null,null,null,null,null,null,""]
[null,null,null,null,null,null,null,null,null,""]
[null,null,null,null,null,null,null,null,null,""]
[null,null,null,null,null,null,null,null,null,""]
[null,null,null,null,null,null,null,null,null,""]
[null,null,null,null,null,null,null,null,null,""]
[null,null,null,null,null,null,null,null,null,""]
[null,null,null,null,null,null,null,null,null,""]
[null,null,null,null,null,null,null,null,null,""]
[null,null,null,null,null,null,null,null,null,""]
[null,null,null,null,null,null,null,null,null,""]
[null,null,null,null,null,null,null,null,null,""]
[null,null,null,null,null,null,null,null,null,""]
[null,null,null,null,null,null,null,null,null,""]
[null,null,null,null,null,null,null,null,null,""]
[null,null,null,null,null,null,null,null,null,""]
[null,null,null,null,null,null,null,null,null,""]
[null,null,null,null,null,null,null,null,null,""]
[null,null,null,null,null,null,null,null,null,""]
[null,null,null,null,null,null,null,null,null,""]
[null,null,null,null,null,null,null,null,null,""]
[null,null,null,null,null,null,null,null,null,""]
[null,null,null,null,null,null,null,null,null,""]
[null,null,null,null,null,null,null,null,null,""]
[null,null,null,null,null,null,null,null,null,""]
[null,null,null,null,null,null,null,null,null,""]
[null,null,null,null,null,null,null,null,null,""]
[null,null,null,null,null,null,null,null,null,""]
[null,null,null,null,null,null,null,null,null,""]
[null,null,null,null,null,null,null,null,null,""]
[null,null,null,null,null,null,null,null,null,""]
[null,null,null,null,null,null,null,null,null,""]
[null,null,null,null,null,null,null,null,null,""]
[null,null,null,null,null,null,null,null,null,""]
[null,null,null,null,null,null,null,null,null,""]
[null,null,null,null,null,null,null,null,null,""]
[null,null,null,null,null,null,null,null,null,""]
[null,null,null,null,null,null,null,null,null,""]
[null,null,null,null,null,null,null,null,null,""]
[null,null,null,null,null,null,null,null,null,""]
[null,null,null,null,null,null,null,null,null,""]
[null,null,null,null,null,null,null,null,null,""]
[null,null,null,null,null,null,null,null,null,""]
[null,null,null,null,null,null,null,null,null,""]
[null,null,null,null,null,null,null,null,null,""]
[null,null,null,null,null,null,null,null,null,""]
[null,null,null,null,null,null,null,null,null,""]
[null,null,null,null,null,null,null,null,null,""]
[null,null,null,null,null,null,null,null,null,""]
[null,null,null,null,null,null,null,null,null,{"$f":"IF(H5911<>\"\",IF(OR(H5911=\"Bridge\",H5911=\"Mast Arm\",H5911=\"Sign Truss\",H5911=\"Temporary Signal\"),\"Vertical\",\"Horizontal\"),\"\")","v":""}]
[null,null,null,null,null,null,null,null,null,""]
[null,null,null,null,null,null,null,null,null,""]
[null,null,null,null,null,null,null,null,null,""]
[null,null,null,null,null,null,null,null,null,""]
[null,null,null,null,null,null,null,null,null,""]
[null,null,null,null,null,null,null,null,null,""]
[null,null,null,null,null,null,null,null,null,""]
[null,null,null,null,null,null,null,null,null,""]
[null,null,null,null,null,null,null,null,null,""]
[null,null,null,null,null,null,null,null,null,""]
[null,null,null,null,null,null,null,null,null,""]
[null,null,null,null,null,null,null,null,null,""]
[null,null,null,null,null,null,null,null,null,""]
[null,null,null,null,null,null,null,null,null,""]
[null,null,null,null,null,null,null,null,null,""]
[null,null,null,null,null,null,null,null,null,""]
[null,null,null,null,null,null,null,null,null,""]
[null,null,null,null,null,null,null,null,null,""]
[null,null,null,null,null,null,null,null,null,""]
[null,null,null,null,null,null,null,null,null,""]
[null,null,null,null,null,null,null,null,null,""]
[null,null,null,null,null,null,null,null,null,""]
[null,null,null,null,null,null,null,null,null,""]
[null,null,null,null,null,null,null,null,null,""]
[null,null,null,null,null,null,null,null,null,""]
[null,null,null,null,null,null,null,null,null,""]
[null,null,null,null,null,null,null,null,null,""]
[null,null,null,null,null,null,null,null,null,""]
[null,null,null,null,null,null,null,null,null,""]
[null,null,null,null,null,null,null,null,null,""]
[null,null,null,null,null,null,null,null,null,""]
[null,null,null,null,null,null,null,null,null,""]
[null,null,null,null,null,null,null,null,null,""]
[null,null,null,null,null,null,null,null,null,""]
[null,null,null,null,null,null,null,null,null,""]
[null,null,null,null,null,null,null,null,null,""]
[null,null,null,null,null,null,null,null,null,""]
[null,null,null,null,null,null,null,null,null,""]
[null,null,null,null,null,null,null,null,null,""]
[null,null,null,null,null,null,null,null,null,""]
[null,null,null,null,null,null,null,null,null,""]
[null,null,null,null,null,null,null,null,null,""]
[null,null,null,null,null,null,null,null,null,""]
[null,null,null,null,null,null,null,null,null,""]
[null,null,null,null,null,null,null,null,null,""]
[null,null,null,null,null,null,null,null,null,""]
[null,null,null,null,null,null,null,null,null,""]
[null,null,null,null,null,null,null,null,null,""]
[null,null,null,null,null,null,null,null,null,""]
[null,null,null,null,null,null,null,null,null,""]
[null,null,null,null,null,null,null,null,null,""]
[null,null,null,null,null,null,null,null,null,""]
[null,null,null,null,null,null,null,null,null,""]
[null,null,null,null,null,null,null,null,null,""]
[null,null,null,null,null,null,null,null,null,""]
[null,null,null,null,null,null,null,null,null,""]
[null,null,null,null,null,null,null,null,null,""]
[null,null,null,null,null,null,null,null,null,""]
[null,null,null,null,null,null,null,null,null,""]
[null,null,null,null,null,null,null,null,null,""]
[null,null,null,null,null,null,null,null,null,""]
[null,null,null,null,null,null,null,null,null,""]
[null,null,null,null,null,null,null,null,null,""]
[null,null,null,null,null,null,null,null,null,{"$f":"IF(H5975<>\"\",IF(OR(H5975=\"Bridge\",H5975=\"Mast Arm\",H5975=\"Sign Truss\",H5975=\"Temporary Signal\"),\"Vertical\",\"Horizontal\"),\"\")","v":""}]
[null,null,null,null,null,null,null,null,null,""]
[null,null,null,null,null,null,null,null,null,""]
[null,null,null,null,null,null,null,null,null,""]
[null,null,null,null,null,null,null,null,null,""]
[null,null,null,null,null,null,null,null,null,""]
[null,null,null,null,null,null,null,null,null,""]
[null,null,null,null,null,null,null,null,null,""]
[null,null,null,null,null,null,null,null,null,""]
[null,null,null,null,null,null,null,null,null,""]
[null,null,null,null,null,null,null,null,null,""]
[null,null,null,null,null,null,null,null,null,""]
[null,null,null,null,null,null,null,null,null,""]
[null,null,null,null,null,null,null,null,null,""]
[null,null,null,null,null,null,null,null,null,""]
[null,null,null,null,null,null,null,null,null,""]
[null,null,null,null,null,null,null,null,null,""]
[null,null,null,null,null,null,null,null,null,""]
[null,null,null,null,null,null,null,null,null,""]
[null,null,null,null,null,null,null,null,null,""]
[null,null,null,null,null,null,null,null,null,""]
[null,null,null,null,null,null,null,null,null,""]
[null,null,null,null,null,null,null,null,null,""]
[null,null,null,null,null,null,null,null,null,""]
[null,null,null,null,null,null,null,null,null,""]
[null,null,null,null,null,null,null,null,null,""]

{"sheet":"DE108_26A","index":5,"n_rows":55,"n_cols":5,"rows_kept":55,"cut":false,"hidden":false,"merged":[[14,2,15,2],[16,4,17,4]]}
["TabTitle",{"$f":"C15","v":"STAGING NOTES"}]
["Number of Tab Columns",1]
["DE Starter Row Number",18]
["TabSheet Starter Row Number",5]
["TabSheet Header Row Count",4]
["Top Header Cell","E15"]
["Bottom Header Cell","E18"]
["DESheet Row Count",38]
["Fixed Empty Rows",25]
["Usable Empty Rows",0]
["Total Rows Placed",63,"xlLeft(1)",null,{"$f":"C11","v":"xlLeft(1)"}]
["Total Rows Needed",{"$f":"SUM(B8:B10)","v":63},"General",null,{"$f":"C12","v":"General"}]
["Last Tab DE Starter Row",18,{"$f":"CELL(\"width\",C13)","v":159},null,{"$f":"CELL(\"width\",E13)","v":0}]
["Last Tab TabSheet Starter Row",5,"A",null,{"$f":"LOWER(C14)","v":"a"}]
["Last Copy Starter Row",1,"STAGING NOTES",null,"108-26A"]
["Tab Loop Number",2,null,null,{"$f":"B17","v":"2008-08-01"}]
["Revision Date","2008-08-01",{"$f":"\"This Data Entry Sheet fills Tab \"&E15&\" effective \"&TEXT(B17,\"mm-dd-yy\")","v":"This Data Entry Sheet fills Tab 108-26A effective 08-01-08"},null,{"$f":"C15","v":"STAGING NOTES"}]
["Tabulation Width",2,"STAGE 1:"]
["Horizontal Grid Lines","No","Grade and pave crossover 2"]
[]
[]
[null,null,"STAGE 2:"]
[null,null,"Traffic:"]
[null,null,"US 30 on existing WB lanes"]
[null,null,"US 218 on detour"]
[null,null,"24th Avenue closed"]
[null,null,"23rd Avenue open to the north, closed to the south"]
[]
[null,null,"Construction:"]
[null,null,"Grade and pave new EB lanes from Sta. 1380+00 to Sta. 1516+70"]
[null,null,"Grade and surface 23rd Avenue south of US 30"]
[null,null,"Grade and pave proposed crossover 1"]
[]
[]
[null,null,"STAGE 3: "]
[null,null,"Traffic:"]
[null,null,"US 30 new existing EB lanes"]
[null,null,"US 218 on detour"]
[null,null,"24th Avenue closed"]
[null,null,"23rd Avenue open to the south, closed to the north"]
[]
[]
[null,null,"Construction:"]
[null,null,"Grade and pave new WB lanes from Sta. 1389+00 to Sta. 1516+70"]
[null,null,"Grade and surface 23rd Avenue north of US 30"]
[null,null,"Finish grade and pave Ramps A - D."]
[null,null,"Grade and pave proposed crossover 3"]
[]
[]
[null,null,"STAGE 4:"]
[null,null,"Traffic:"]
[null,null,"Traffic in normal lanes"]
[]
[null,null,"Construction:"]
[null,null,"Complete"]

{"sheet":"DE111_01","index":6,"n_rows":29,"n_cols":7,"rows_kept":29,"cut":false,"hidden":false,"merged":[[24,6,25,6],[14,2,16,3],[14,5,14,6],[15,5,15,6],[16,5,18,6],[17,2,21,3],[19,5,23,6],[22,2,22,3],[23,2,24,2],[23,3,24,3],[24,5,25,5]]}
["TabTitle",{"$f":"C15","v":"COORDINATED OPERATIONS"}]
["Number of Tab Columns",2]
["DE Starter Row Number",26]
["TabSheet Starter Row Number",13]
["TabSheet Header Row Count",12]
["Top Header Cell","F15"]
["Bottom Header Cell","G26"]
["DESheet Row Count",4]
["Fixed Empty Rows",0]
["Usable Empty Rows",15]
["Total Rows Placed",19,"xlLeft(1)","xlLeft(1)",null,{"$f":"C11","v":"xlLeft(1)"},{"$f":"D11","v":"xlLeft(1)"}]
["Total Rows Needed",{"$f":"SUM(B8:B10)","v":19},"General","General",null,{"$f":"C12","v":"General"},{"$f":"D12","v":"General"}]
["Last Tab DE Starter Row",26,{"$f":"CELL(\"width\",C13)","v":35},{"$f":"CELL(\"width\",D13)","v":37},null,{"$f":"CELL(\"width\",F13)","v":0},{"$f":"CELL(\"width\",G13)","v":0}]
["Last Tab Tabsheet Starter Row",13,"A","B",null,{"$f":"LOWER(C14)","v":"a"},{"$f":"LOWER(D14)","v":"b"}]
["Last Copy Starter Row",1,"COORDINATED OPERATIONS",null,null,"111-01"]
["Tab Loop Number",2,null,null,null,{"$f":"B17","v":"2012-04-17"}]
["Revision Date","2012-04-17",null,null,null,{"$f":"C15","v":"COORDINATED OPERATIONS"}]
["Tabulation Width",1,"Other work in progress during the same period of time will include the construction of the projects listed. Coordinate operations with those of other contractors working within the same area. "]
["Horizontal Grid Lines","Yes"]
[null,null,null,null,null,{"$f":"C18","v":"Other work in progress during the same period of time will include the construction of the projects listed. Coordinate operations with those of other contractors working within the same area. "}]
[]
[]
[null,null,{"$f":"\"This Data Entry Sheet fills Tab \"&F15&\" effective \"&TEXT(B17,\"mm-dd-yy\")","v":"This Data Entry Sheet fills Tab 111-01 effective 04-17-12"}]
[null,null,"Project","Type of Work"]
[null,null,null,null,null,{"$f":"C24","v":"Project"},{"$f":"D24","v":"Type of Work"}]
[]
[null,null,"NHSX-030-6(189)--3H-86","Grading"]
[null,null,"MP-030-6(709)234--76-06","PCC Patching"]
[null,null,"NHSN-000-S(943)--2R-00","Traffic Signs"]

{"sheet":"108_23A","index":7,"n_rows":51,"n_cols":1,"rows_kept":51,"cut":false,"hidden":false,"merged":[[2,0,3,0]]}
["108-23A"]
["2008-08-01"]
["TRAFFIC CONTROL PLAN"]
[]
[{"$f":"IF(OFFSET(DE108_23A!$C$18,ROWS($C$18:C18)-1,COLUMNS($C$18:C18)-1)<>\"\",OFFSET(DE108_23A!$C$18,ROWS($C$18:C18)-1,COLUMNS($C$18:C18)-1),\"\")","v":"1. Traffic on U.S. Highway 30 shall be maintained at all times except as noted in Note 3"}]
[{"$f":"IF(OFFSET(DE108_23A!$C$18,ROWS($C$18:C19)-1,COLUMNS($C$18:C19)-1)<>\"\",OFFSET(DE108_23A!$C$18,ROWS($C$18:C19)-1,COLUMNS($C$18:C19)-1),\"\")","v":""}]
[{"$f":"IF(OFFSET(DE108_23A!$C$18,ROWS($C$18:C20)-1,COLUMNS($C$18:C20)-1)<>\"\",OFFSET(DE108_23A!$C$18,ROWS($C$18:C20)-1,COLUMNS($C$18:C20)-1),\"\")","v":"2. Traffic on U.S. Highway 218 shall be maintained at all times via off-site detour"}]
[{"$f":"IF(OFFSET(DE108_23A!$C$18,ROWS($C$18:C21)-1,COLUMNS($C$18:C21)-1)<>\"\",OFFSET(DE108_23A!$C$18,ROWS($C$18:C21)-1,COLUMNS($C$18:C21)-1),\"\")","v":""}]
[{"$f":"IF(OFFSET(DE108_23A!$C$18,ROWS($C$18:C22)-1,COLUMNS($C$18:C22)-1)<>\"\",OFFSET(DE108_23A!$C$18,ROWS($C$18:C22)-1,COLUMNS($C$18:C22)-1),\"\")","v":"3. Temporary nighttime road closures (TC-251/TC-451) will only be allowed for setting beams and overhead signs/trusses"}]
[{"$f":"IF(OFFSET(DE108_23A!$C$18,ROWS($C$18:C23)-1,COLUMNS($C$18:C23)-1)<>\"\",OFFSET(DE108_23A!$C$18,ROWS($C$18:C23)-1,COLUMNS($C$18:C23)-1),\"\")","v":""}]
[{"$f":"IF(OFFSET(DE108_23A!$C$18,ROWS($C$18:C24)-1,COLUMNS($C$18:C24)-1)<>\"\",OFFSET(DE108_23A!$C$18,ROWS($C$18:C24)-1,COLUMNS($C$18:C24)-1),\"\")","v":"4. Detour and detour signing shall be furnished, maintained, and removed by the Contractor"}]
[{"$f":"IF(OFFSET(DE108_23A!$C$18,ROWS($C$18:C25)-1,COLUMNS($C$18:C25)-1)<>\"\",OFFSET(DE108_23A!$C$18,ROWS($C$18:C25)-1,COLUMNS($C$18:C25)-1),\"\")","v":""}]
[{"$f":"IF(OFFSET(DE108_23A!$C$18,ROWS($C$18:C26)-1,COLUMNS($C$18:C26)-1)<>\"\",OFFSET(DE108_23A!$C$18,ROWS($C$18:C26)-1,COLUMNS($C$18:C26)-1),\"\")","v":""}]
[{"$f":"IF(OFFSET(DE108_23A!$C$18,ROWS($C$18:C27)-1,COLUMNS($C$18:C27)-1)<>\"\",OFFSET(DE108_23A!$C$18,ROWS($C$18:C27)-1,COLUMNS($C$18:C27)-1),\"\")","v":""}]
[{"$f":"IF(OFFSET(DE108_23A!$C$18,ROWS($C$18:C28)-1,COLUMNS($C$18:C28)-1)<>\"\",OFFSET(DE108_23A!$C$18,ROWS($C$18:C28)-1,COLUMNS($C$18:C28)-1),\"\")","v":""}]
[{"$f":"IF(OFFSET(DE108_23A!$C$18,ROWS($C$18:C29)-1,COLUMNS($C$18:C29)-1)<>\"\",OFFSET(DE108_23A!$C$18,ROWS($C$18:C29)-1,COLUMNS($C$18:C29)-1),\"\")","v":""}]
[{"$f":"IF(OFFSET(DE108_23A!$C$18,ROWS($C$18:C30)-1,COLUMNS($C$18:C30)-1)<>\"\",OFFSET(DE108_23A!$C$18,ROWS($C$18:C30)-1,COLUMNS($C$18:C30)-1),\"\")","v":""}]
[{"$f":"IF(OFFSET(DE108_23A!$C$18,ROWS($C$18:C31)-1,COLUMNS($C$18:C31)-1)<>\"\",OFFSET(DE108_23A!$C$18,ROWS($C$18:C31)-1,COLUMNS($C$18:C31)-1),\"\")","v":""}]
[{"$f":"IF(OFFSET(DE108_23A!$C$18,ROWS($C$18:C32)-1,COLUMNS($C$18:C32)-1)<>\"\",OFFSET(DE108_23A!$C$18,ROWS($C$18:C32)-1,COLUMNS($C$18:C32)-1),\"\")","v":""}]
[{"$f":"IF(OFFSET(DE108_23A!$C$18,ROWS($C$18:C33)-1,COLUMNS($C$18:C33)-1)<>\"\",OFFSET(DE108_23A!$C$18,ROWS($C$18:C33)-1,COLUMNS($C$18:C33)-1),\"\")","v":""}]
[{"$f":"IF(OFFSET(DE108_23A!$C$18,ROWS($C$18:C34)-1,COLUMNS($C$18:C34)-1)<>\"\",OFFSET(DE108_23A!$C$18,ROWS($C$18:C34)-1,COLUMNS($C$18:C34)-1),\"\")","v":""}]
[{"$f":"IF(OFFSET(DE108_23A!$C$18,ROWS($C$18:C35)-1,COLUMNS($C$18:C35)-1)<>\"\",OFFSET(DE108_23A!$C$18,ROWS($C$18:C35)-1,COLUMNS($C$18:C35)-1),\"\")","v":""}]
[{"$f":"IF(OFFSET(DE108_23A!$C$18,ROWS($C$18:C36)-1,COLUMNS($C$18:C36)-1)<>\"\",OFFSET(DE108_23A!$C$18,ROWS($C$18:C36)-1,COLUMNS($C$18:C36)-1),\"\")","v":""}]
[{"$f":"IF(OFFSET(DE108_23A!$C$18,ROWS($C$18:C37)-1,COLUMNS($C$18:C37)-1)<>\"\",OFFSET(DE108_23A!$C$18,ROWS($C$18:C37)-1,COLUMNS($C$18:C37)-1),\"\")","v":""}]
[{"$f":"IF(OFFSET(DE108_23A!$C$18,ROWS($C$18:C38)-1,COLUMNS($C$18:C38)-1)<>\"\",OFFSET(DE108_23A!$C$18,ROWS($C$18:C38)-1,COLUMNS($C$18:C38)-1),\"\")","v":""}]
[{"$f":"IF(OFFSET(DE108_23A!$C$18,ROWS($C$18:C39)-1,COLUMNS($C$18:C39)-1)<>\"\",OFFSET(DE108_23A!$C$18,ROWS($C$18:C39)-1,COLUMNS($C$18:C39)-1),\"\")","v":""}]
[{"$f":"IF(OFFSET(DE108_23A!$C$18,ROWS($C$18:C40)-1,COLUMNS($C$18:C40)-1)<>\"\",OFFSET(DE108_23A!$C$18,ROWS($C$18:C40)-1,COLUMNS($C$18:C40)-1),\"\")","v":""}]
[{"$f":"IF(OFFSET(DE108_23A!$C$18,ROWS($C$18:C41)-1,COLUMNS($C$18:C41)-1)<>\"\",OFFSET(DE108_23A!$C$18,ROWS($C$18:C41)-1,COLUMNS($C$18:C41)-1),\"\")","v":""}]
[{"$f":"IF(OFFSET(DE108_23A!$C$18,ROWS($C$18:C42)-1,COLUMNS($C$18:C42)-1)<>\"\",OFFSET(DE108_23A!$C$18,ROWS($C$18:C42)-1,COLUMNS($C$18:C42)-1),\"\")","v":""}]
[{"$f":"IF(OFFSET(DE108_23A!$C$18,ROWS($C$18:C43)-1,COLUMNS($C$18:C43)-1)<>\"\",OFFSET(DE108_23A!$C$18,ROWS($C$18:C43)-1,COLUMNS($C$18:C43)-1),\"\")","v":""}]
[{"$f":"IF(OFFSET(DE108_23A!$C$18,ROWS($C$18:C44)-1,COLUMNS($C$18:C44)-1)<>\"\",OFFSET(DE108_23A!$C$18,ROWS($C$18:C44)-1,COLUMNS($C$18:C44)-1),\"\")","v":""}]
[{"$f":"IF(OFFSET(DE108_23A!$C$18,ROWS($C$18:C45)-1,COLUMNS($C$18:C45)-1)<>\"\",OFFSET(DE108_23A!$C$18,ROWS($C$18:C45)-1,COLUMNS($C$18:C45)-1),\"\")","v":""}]
[{"$f":"IF(OFFSET(DE108_23A!$C$18,ROWS($C$18:C46)-1,COLUMNS($C$18:C46)-1)<>\"\",OFFSET(DE108_23A!$C$18,ROWS($C$18:C46)-1,COLUMNS($C$18:C46)-1),\"\")","v":""}]
[{"$f":"IF(OFFSET(DE108_23A!$C$18,ROWS($C$18:C47)-1,COLUMNS($C$18:C47)-1)<>\"\",OFFSET(DE108_23A!$C$18,ROWS($C$18:C47)-1,COLUMNS($C$18:C47)-1),\"\")","v":""}]
[{"$f":"IF(OFFSET(DE108_23A!$C$18,ROWS($C$18:C48)-1,COLUMNS($C$18:C48)-1)<>\"\",OFFSET(DE108_23A!$C$18,ROWS($C$18:C48)-1,COLUMNS($C$18:C48)-1),\"\")","v":""}]
[{"$f":"IF(OFFSET(DE108_23A!$C$18,ROWS($C$18:C49)-1,COLUMNS($C$18:C49)-1)<>\"\",OFFSET(DE108_23A!$C$18,ROWS($C$18:C49)-1,COLUMNS($C$18:C49)-1),\"\")","v":""}]
[{"$f":"IF(OFFSET(DE108_23A!$C$18,ROWS($C$18:C50)-1,COLUMNS($C$18:C50)-1)<>\"\",OFFSET(DE108_23A!$C$18,ROWS($C$18:C50)-1,COLUMNS($C$18:C50)-1),\"\")","v":""}]
[{"$f":"IF(OFFSET(DE108_23A!$C$18,ROWS($C$18:C51)-1,COLUMNS($C$18:C51)-1)<>\"\",OFFSET(DE108_23A!$C$18,ROWS($C$18:C51)-1,COLUMNS($C$18:C51)-1),\"\")","v":""}]
[{"$f":"IF(OFFSET(DE108_23A!$C$18,ROWS($C$18:C52)-1,COLUMNS($C$18:C52)-1)<>\"\",OFFSET(DE108_23A!$C$18,ROWS($C$18:C52)-1,COLUMNS($C$18:C52)-1),\"\")","v":""}]
[{"$f":"IF(OFFSET(DE108_23A!$C$18,ROWS($C$18:C53)-1,COLUMNS($C$18:C53)-1)<>\"\",OFFSET(DE108_23A!$C$18,ROWS($C$18:C53)-1,COLUMNS($C$18:C53)-1),\"\")","v":""}]
[{"$f":"IF(OFFSET(DE108_23A!$C$18,ROWS($C$18:C54)-1,COLUMNS($C$18:C54)-1)<>\"\",OFFSET(DE108_23A!$C$18,ROWS($C$18:C54)-1,COLUMNS($C$18:C54)-1),\"\")","v":""}]
[{"$f":"IF(OFFSET(DE108_23A!$C$18,ROWS($C$18:C55)-1,COLUMNS($C$18:C55)-1)<>\"\",OFFSET(DE108_23A!$C$18,ROWS($C$18:C55)-1,COLUMNS($C$18:C55)-1),\"\")","v":""}]
[{"$f":"IF(OFFSET(DE108_23A!$C$18,ROWS($C$18:C56)-1,COLUMNS($C$18:C56)-1)<>\"\",OFFSET(DE108_23A!$C$18,ROWS($C$18:C56)-1,COLUMNS($C$18:C56)-1),\"\")","v":""}]
[{"$f":"IF(OFFSET(DE108_23A!$C$18,ROWS($C$18:C57)-1,COLUMNS($C$18:C57)-1)<>\"\",OFFSET(DE108_23A!$C$18,ROWS($C$18:C57)-1,COLUMNS($C$18:C57)-1),\"\")","v":""}]
[{"$f":"IF(OFFSET(DE108_23A!$C$18,ROWS($C$18:C58)-1,COLUMNS($C$18:C58)-1)<>\"\",OFFSET(DE108_23A!$C$18,ROWS($C$18:C58)-1,COLUMNS($C$18:C58)-1),\"\")","v":""}]
[{"$f":"IF(OFFSET(DE108_23A!$C$18,ROWS($C$18:C59)-1,COLUMNS($C$18:C59)-1)<>\"\",OFFSET(DE108_23A!$C$18,ROWS($C$18:C59)-1,COLUMNS($C$18:C59)-1),\"\")","v":""}]
[{"$f":"IF(OFFSET(DE108_23A!$C$18,ROWS($C$18:C60)-1,COLUMNS($C$18:C60)-1)<>\"\",OFFSET(DE108_23A!$C$18,ROWS($C$18:C60)-1,COLUMNS($C$18:C60)-1),\"\")","v":""}]
[{"$f":"IF(OFFSET(DE108_23A!$C$18,ROWS($C$18:C61)-1,COLUMNS($C$18:C61)-1)<>\"\",OFFSET(DE108_23A!$C$18,ROWS($C$18:C61)-1,COLUMNS($C$18:C61)-1),\"\")","v":""}]
[{"$f":"IF(OFFSET(DE108_23A!$C$18,ROWS($C$18:C62)-1,COLUMNS($C$18:C62)-1)<>\"\",OFFSET(DE108_23A!$C$18,ROWS($C$18:C62)-1,COLUMNS($C$18:C62)-1),\"\")","v":""}]
[{"$f":"IF(OFFSET(DE108_23A!$C$18,ROWS($C$18:C63)-1,COLUMNS($C$18:C63)-1)<>\"\",OFFSET(DE108_23A!$C$18,ROWS($C$18:C63)-1,COLUMNS($C$18:C63)-1),\"\")","v":""}]
[{"$f":"IF(OFFSET(DE108_23A!$C$18,ROWS($C$18:C64)-1,COLUMNS($C$18:C64)-1)<>\"\",OFFSET(DE108_23A!$C$18,ROWS($C$18:C64)-1,COLUMNS($C$18:C64)-1),\"\")","v":""}]

{"sheet":"108_23B","index":8,"n_rows":15,"n_cols":49,"rows_kept":15,"cut":false,"hidden":false,"merged":[[4,0,4,48],[14,0,14,48],[5,1,5,24],[5,26,5,48],[0,0,0,48],[1,0,1,48],[2,0,2,18],[2,19,3,48],[3,0,3,7],[3,8,3,18]]}
["108-23B"]
["2015-04-21"]
["* This is to only be used in conjunction with Tabulation 108-23A",null,null,null,null,null,null,null,null,null,null,null,null,null,null,null,null,null,null,"TRAFFIC CONTROL CLOSURE TABLE(S)"]
["Shaded area indicates non-working times"]
[{"$f":"IF(OFFSET(DE108_23B!$C$19,ROWS($C$19:C19)-1,COLUMNS($C$19:C19)-1)<>\"\",OFFSET(DE108_23B!$C$19,ROWS($C$19:C19)-1,COLUMNS($C$19:C19)-1),\"\")","v":""}]
[{"$f":"IF(OFFSET(DE108_23B!$C$19,ROWS($C$19:C20)-1,COLUMNS($C$19:C20)-1)<>\"\",OFFSET(DE108_23B!$C$19,ROWS($C$19:C20)-1,COLUMNS($C$19:C20)-1),\"\")","v":""},{"$f":"IF(OFFSET(DE108_23B!$D$19,ROWS($D$19:D20)-1,COLUMNS($D$19:D20)-1)<>\"\",OFFSET(DE108_23B!$D$19,ROWS($D$19:D20)-1,COLUMNS($D$19:D20)-1),\"\")","v":"AM"},null,null,null,null,null,null,null,null,null,null,null,null,null,null,null,null,null,null,null,null,null,null,null,{"$f":"IF(OFFSET(DE108_23B!$AB$19,ROWS($AB$19:AB20)-1,COLUMNS($AB$19:AB20)-1)<>\"\",OFFSET(DE108_23B!$AB$19,ROWS($AB$19:AB20)-1,COLUMNS($AB$19:AB20)-1),\"\")","v":"Noon"},{"$f":"IF(OFFSET(DE108_23B!$AC$19,ROWS($AC$19:AC20)-1,COLUMNS($AC$19:AC20)-1)<>\"\",OFFSET(DE108_23B!$AC$19,ROWS($AC$19:AC20)-1,COLUMNS($AC$19:AC20)-1),\"\")","v":"PM"}]
[{"$f":"IF(OFFSET(DE108_23B!$C$19,ROWS($C$19:C21)-1,COLUMNS($C$19:C21)-1)<>\"\",OFFSET(DE108_23B!$C$19,ROWS($C$19:C21)-1,COLUMNS($C$19:C21)-1),\"\")","v":""},{"$f":"IF(OFFSET(DE108_23B!$D$19,ROWS($D$19:D21)-1,COLUMNS($D$19:D21)-1)<>\"\",OFFSET(DE108_23B!$D$19,ROWS($D$19:D21)-1,COLUMNS($D$19:D21)-1),\"\")","v":"12:00:00"},{"$f":"IF(OFFSET(DE108_23B!$E$19,ROWS($E$19:E21)-1,COLUMNS($E$19:E21)-1)<>\"\",OFFSET(DE108_23B!$E$19,ROWS($E$19:E21)-1,COLUMNS($E$19:E21)-1),\"\")","v":"12:30:00"},{"$f":"IF(OFFSET(DE108_23B!$F$19,ROWS($F$19:F21)-1,COLUMNS($F$19:F21)-1)<>\"\",OFFSET(DE108_23B!$F$19,ROWS($F$19:F21)-1,COLUMNS($F$19:F21)-1),\"\")","v":"01:00:00"},{"$f":"IF(OFFSET(DE108_23B!$G$19,ROWS($G$19:G21)-1,COLUMNS($G$19:G21)-1)<>\"\",OFFSET(DE108_23B!$G$19,ROWS($G$19:G21)-1,COLUMNS($G$19:G21)-1),\"\")","v":"01:30:00"},{"$f":"IF(OFFSET(DE108_23B!$H$19,ROWS($H$19:H21)-1,COLUMNS($H$19:H21)-1)<>\"\",OFFSET(DE108_23B!$H$19,ROWS($H$19:H21)-1,COLUMNS($H$19:H21)-1),\"\")","v":"02:00:00"},{"$f":"IF(OFFSET(DE108_23B!$I$19,ROWS($I$19:I21)-1,COLUMNS($I$19:I21)-1)<>\"\",OFFSET(DE108_23B!$I$19,ROWS($I$19:I21)-1,COLUMNS($I$19:I21)-1),\"\")","v":"02:30:00"},{"$f":"IF(OFFSET(DE108_23B!$J$19,ROWS($J$19:J21)-1,COLUMNS($J$19:J21)-1)<>\"\",OFFSET(DE108_23B!$J$19,ROWS($J$19:J21)-1,COLUMNS($J$19:J21)-1),\"\")","v":"03:00:00"},{"$f":"IF(OFFSET(DE108_23B!$K$19,ROWS($K$19:K21)-1,COLUMNS($K$19:K21)-1)<>\"\",OFFSET(DE108_23B!$K$19,ROWS($K$19:K21)-1,COLUMNS($K$19:K21)-1),\"\")","v":"03:30:00"},{"$f":"IF(OFFSET(DE108_23B!$L$19,ROWS($L$19:L21)-1,COLUMNS($L$19:L21)-1)<>\"\",OFFSET(DE108_23B!$L$19,ROWS($L$19:L21)-1,COLUMNS($L$19:L21)-1),\"\")","v":"04:00:00"},{"$f":"IF(OFFSET(DE108_23B!$M$19,ROWS($M$19:M21)-1,COLUMNS($M$19:M21)-1)<>\"\",OFFSET(DE108_23B!$M$19,ROWS($M$19:M21)-1,COLUMNS($M$19:M21)-1),\"\")","v":"04:30:00"},{"$f":"IF(OFFSET(DE108_23B!$N$19,ROWS($N$19:N21)-1,COLUMNS($N$19:N21)-1)<>\"\",OFFSET(DE108_23B!$N$19,ROWS($N$19:N21)-1,COLUMNS($N$19:N21)-1),\"\")","v":"05:00:00"},{"$f":"IF(OFFSET(DE108_23B!$O$19,ROWS($O$19:O21)-1,COLUMNS($O$19:O21)-1)<>\"\",OFFSET(DE108_23B!$O$19,ROWS($O$19:O21)-1,COLUMNS($O$19:O21)-1),\"\")","v":"05:30:00"},{"$f":"IF(OFFSET(DE108_23B!$P$19,ROWS($P$19:P21)-1,COLUMNS($P$19:P21)-1)<>\"\",OFFSET(DE108_23B!$P$19,ROWS($P$19:P21)-1,COLUMNS($P$19:P21)-1),\"\")","v":"06:00:00"},{"$f":"IF(OFFSET(DE108_23B!$Q$19,ROWS($Q$19:Q21)-1,COLUMNS($Q$19:Q21)-1)<>\"\",OFFSET(DE108_23B!$Q$19,ROWS($Q$19:Q21)-1,COLUMNS($Q$19:Q21)-1),\"\")","v":"06:30:00"},{"$f":"IF(OFFSET(DE108_23B!$R$19,ROWS($R$19:R21)-1,COLUMNS($R$19:R21)-1)<>\"\",OFFSET(DE108_23B!$R$19,ROWS($R$19:R21)-1,COLUMNS($R$19:R21)-1),\"\")","v":"07:00:00"},{"$f":"IF(OFFSET(DE108_23B!$S$19,ROWS($S$19:S21)-1,COLUMNS($S$19:S21)-1)<>\"\",OFFSET(DE108_23B!$S$19,ROWS($S$19:S21)-1,COLUMNS($S$19:S21)-1),\"\")","v":"07:30:00"},{"$f":"IF(OFFSET(DE108_23B!$T$19,ROWS($T$19:T21)-1,COLUMNS($T$19:T21)-1)<>\"\",OFFSET(DE108_23B!$T$19,ROWS($T$19:T21)-1,COLUMNS($T$19:T21)-1),\"\")","v":"08:00:00"},{"$f":"IF(OFFSET(DE108_23B!$U$19,ROWS($U$19:U21)-1,COLUMNS($U$19:U21)-1)<>\"\",OFFSET(DE108_23B!$U$19,ROWS($U$19:U21)-1,COLUMNS($U$19:U21)-1),\"\")","v":"08:30:00"},{"$f":"IF(OFFSET(DE108_23B!$V$19,ROWS($V$19:V21)-1,COLUMNS($V$19:V21)-1)<>\"\",OFFSET(DE108_23B!$V$19,ROWS($V$19:V21)-1,COLUMNS($V$19:V21)-1),\"\")","v":"09:00:00"},{"$f":"IF(OFFSET(DE108_23B!$W$19,ROWS($W$19:W21)-1,COLUMNS($W$19:W21)-1)<>\"\",OFFSET(DE108_23B!$W$19,ROWS($W$19:W21)-1,COLUMNS($W$19:W21)-1),\"\")","v":"09:30:00"},{"$f":"IF(OFFSET(DE108_23B!$X$19,ROWS($X$19:X21)-1,COLUMNS($X$19:X21)-1)<>\"\",OFFSET(DE108_23B!$X$19,ROWS($X$19:X21)-1,COLUMNS($X$19:X21)-1),\"\")","v":"10:00:00"},{"$f":"IF(OFFSET(DE108_23B!$Y$19,ROWS($Y$19:Y21)-1,COLUMNS($Y$19:Y21)-1)<>\"\",OFFSET(DE108_23B!$Y$19,ROWS($Y$19:Y21)-1,COLUMNS($Y$19:Y21)-1),\"\")","v":"10:30:00"},{"$f":"IF(OFFSET(DE108_23B!$Z$19,ROWS($Z$19:Z21)-1,COLUMNS($Z$19:Z21)-1)<>\"\",OFFSET(DE108_23B!$Z$19,ROWS($Z$19:Z21)-1,COLUMNS($Z$19:Z21)-1),\"\")","v":"11:00:00"},{"$f":"IF(OFFSET(DE108_23B!$AA$19,ROWS($AA$19:AA21)-1,COLUMNS($AA$19:AA21)-1)<>\"\",OFFSET(DE108_23B!$AA$19,ROWS($AA$19:AA21)-1,COLUMNS($AA$19:AA21)-1),\"\")","v":"11:30:00"},{"$f":"IF(OFFSET(DE108_23B!$AB$19,ROWS($AB$19:AB21)-1,COLUMNS($AB$19:AB21)-1)<>\"\",OFFSET(DE108_23B!$AB$19,ROWS($AB$19:AB21)-1,COLUMNS($AB$19:AB21)-1),\"\")","v":"12:00:00"},{"$f":"IF(OFFSET(DE108_23B!$AC$19,ROWS($AC$19:AC21)-1,COLUMNS($AC$19:AC21)-1)<>\"\",OFFSET(DE108_23B!$AC$19,ROWS($AC$19:AC21)-1,COLUMNS($AC$19:AC21)-1),\"\")","v":"12:30:00"},{"$f":"IF(OFFSET(DE108_23B!$AD$19,ROWS($AD$19:AD21)-1,COLUMNS($AD$19:AD21)-1)<>\"\",OFFSET(DE108_23B!$AD$19,ROWS($AD$19:AD21)-1,COLUMNS($AD$19:AD21)-1),\"\")","v":"01:00:00"},{"$f":"IF(OFFSET(DE108_23B!$AE$19,ROWS($AE$19:AE21)-1,COLUMNS($AE$19:AE21)-1)<>\"\",OFFSET(DE108_23B!$AE$19,ROWS($AE$19:AE21)-1,COLUMNS($AE$19:AE21)-1),\"\")","v":"01:30:00"},{"$f":"IF(OFFSET(DE108_23B!$AF$19,ROWS($AF$19:AF21)-1,COLUMNS($AF$19:AF21)-1)<>\"\",OFFSET(DE108_23B!$AF$19,ROWS($AF$19:AF21)-1,COLUMNS($AF$19:AF21)-1),\"\")","v":"02:00:00"},{"$f":"IF(OFFSET(DE108_23B!$AG$19,ROWS($AG$19:AG21)-1,COLUMNS($AG$19:AG21)-1)<>\"\",OFFSET(DE108_23B!$AG$19,ROWS($AG$19:AG21)-1,COLUMNS($AG$19:AG21)-1),\"\")","v":"02:30:00"},{"$f":"IF(OFFSET(DE108_23B!$AH$19,ROWS($AH$19:AH21)-1,COLUMNS($AH$19:AH21)-1)<>\"\",OFFSET(DE108_23B!$AH$19,ROWS($AH$19:AH21)-1,COLUMNS($AH$19:AH21)-1),\"\")","v":"03:00:00"},{"$f":"IF(OFFSET(DE108_23B!$AI$19,ROWS($AI$19:AI21)-1,COLUMNS($AI$19:AI21)-1)<>\"\",OFFSET(DE108_23B!$AI$19,ROWS($AI$19:AI21)-1,COLUMNS($AI$19:AI21)-1),\"\")","v":"03:30:00"},{"$f":"IF(OFFSET(DE108_23B!$AJ$19,ROWS($AJ$19:AJ21)-1,COLUMNS($AJ$19:AJ21)-1)<>\"\",OFFSET(DE108_23B!$AJ$19,ROWS($AJ$19:AJ21)-1,COLUMNS($AJ$19:AJ21)-1),\"\")","v":"04:00:00"},{"$f":"IF(OFFSET(DE108_23B!$AK$19,ROWS($AK$19:AK21)-1,COLUMNS($AK$19:AK21)-1)<>\"\",OFFSET(DE108_23B!$AK$19,ROWS($AK$19:AK21)-1,COLUMNS($AK$19:AK21)-1),\"\")","v":"04:30:00"},{"$f":"IF(OFFSET(DE108_23B!$AL$19,ROWS($AL$19:AL21)-1,COLUMNS($AL$19:AL21)-1)<>\"\",OFFSET(DE108_23B!$AL$19,ROWS($AL$19:AL21)-1,COLUMNS($AL$19:AL21)-1),\"\")","v":"05:00:00"},{"$f":"IF(OFFSET(DE108_23B!$AM$19,ROWS($AM$19:AM21)-1,COLUMNS($AM$19:AM21)-1)<>\"\",OFFSET(DE108_23B!$AM$19,ROWS($AM$19:AM21)-1,COLUMNS($AM$19:AM21)-1),\"\")","v":"05:30:00"},{"$f":"IF(OFFSET(DE108_23B!$AN$19,ROWS($AN$19:AN21)-1,COLUMNS($AN$19:AN21)-1)<>\"\",OFFSET(DE108_23B!$AN$19,ROWS($AN$19:AN21)-1,COLUMNS($AN$19:AN21)-1),\"\")","v":"06:00:00"},{"$f":"IF(OFFSET(DE108_23B!$AO$19,ROWS($AO$19:AO21)-1,COLUMNS($AO$19:AO21)-1)<>\"\",OFFSET(DE108_23B!$AO$19,ROWS($AO$19:AO21)-1,COLUMNS($AO$19:AO21)-1),\"\")","v":"06:30:00"},{"$f":"IF(OFFSET(DE108_23B!$AP$19,ROWS($AP$19:AP21)-1,COLUMNS($AP$19:AP21)-1)<>\"\",OFFSET(DE108_23B!$AP$19,ROWS($AP$19:AP21)-1,COLUMNS($AP$19:AP21)-1),\"\")","v":"07:00:00"},{"$f":"IF(OFFSET(DE108_23B!$AQ$19,ROWS($AQ$19:AQ21)-1,COLUMNS($AQ$19:AQ21)-1)<>\"\",OFFSET(DE108_23B!$AQ$19,ROWS($AQ$19:AQ21)-1,COLUMNS($AQ$19:AQ21)-1),\"\")","v":"07:30:00"},{"$f":"IF(OFFSET(DE108_23B!$AR$19,ROWS($AR$19:AR21)-1,COLUMNS($AR$19:AR21)-1)<>\"\",OFFSET(DE108_23B!$AR$19,ROWS($AR$19:AR21)-1,COLUMNS($AR$19:AR21)-1),\"\")","v":"08:00:00"},{"$f":"IF(OFFSET(DE108_23B!$AS$19,ROWS($AS$19:AS21)-1,COLUMNS($AS$19:AS21)-1)<>\"\",OFFSET(DE108_23B!$AS$19,ROWS($AS$19:AS21)-1,COLUMNS($AS$19:AS21)-1),\"\")","v":"08:30:00"},{"$f":"IF(OFFSET(DE108_23B!$AT$19,ROWS($AT$19:AT21)-1,COLUMNS($AT$19:AT21)-1)<>\"\",OFFSET(DE108_23B!$AT$19,ROWS($AT$19:AT21)-1,COLUMNS($AT$19:AT21)-1),\"\")","v":"09:00:00"},{"$f":"IF(OFFSET(DE108_23B!$AU$19,ROWS($AU$19:AU21)-1,COLUMNS($AU$19:AU21)-1)<>\"\",OFFSET(DE108_23B!$AU$19,ROWS($AU$19:AU21)-1,COLUMNS($AU$19:AU21)-1),\"\")","v":"09:30:00"},{"$f":"IF(OFFSET(DE108_23B!$AV$19,ROWS($AV$19:AV21)-1,COLUMNS($AV$19:AV21)-1)<>\"\",OFFSET(DE108_23B!$AV$19,ROWS($AV$19:AV21)-1,COLUMNS($AV$19:AV21)-1),\"\")","v":"10:00:00"},{"$f":"IF(OFFSET(DE108_23B!$AW$19,ROWS($AW$19:AW21)-1,COLUMNS($AW$19:AW21)-1)<>\"\",OFFSET(DE108_23B!$AW$19,ROWS($AW$19:AW21)-1,COLUMNS($AW$19:AW21)-1),\"\")","v":"10:30:00"},{"$f":"IF(OFFSET(DE108_23B!$AX$19,ROWS($AX$19:AX21)-1,COLUMNS($AX$19:AX21)-1)<>\"\",OFFSET(DE108_23B!$AX$19,ROWS($AX$19:AX21)-1,COLUMNS($AX$19:AX21)-1),\"\")","v":"11:00:00"},{"$f":"IF(OFFSET(DE108_23B!$AY$19,ROWS($AY$19:AY21)-1,COLUMNS($AY$19:AY21)-1)<>\"\",OFFSET(DE108_23B!$AY$19,ROWS($AY$19:AY21)-1,COLUMNS($AY$19:AY21)-1),\"\")","v":"11:30:00"}]
[{"$f":"IF(OFFSET(DE108_23B!$C$19,ROWS($C$19:C22)-1,COLUMNS($C$19:C22)-1)<>\"\",OFFSET(DE108_23B!$C$19,ROWS($C$19:C22)-1,COLUMNS($C$19:C22)-1),\"\")","v":"SUN"},{"$f":"IF(OFFSET(DE108_23B!$D$19,ROWS($D$19:D22)-1,COLUMNS($D$19:D22)-1)<>\"\",OFFSET(DE108_23B!$D$19,ROWS($D$19:D22)-1,COLUMNS($D$19:D22)-1),\"\")","v":""},{"$f":"IF(OFFSET(DE108_23B!$E$19,ROWS($E$19:E22)-1,COLUMNS($E$19:E22)-1)<>\"\",OFFSET(DE108_23B!$E$19,ROWS($E$19:E22)-1,COLUMNS($E$19:E22)-1),\"\")","v":""},{"$f":"IF(OFFSET(DE108_23B!$F$19,ROWS($F$19:F22)-1,COLUMNS($F$19:F22)-1)<>\"\",OFFSET(DE108_23B!$F$19,ROWS($F$19:F22)-1,COLUMNS($F$19:F22)-1),\"\")","v":""},{"$f":"IF(OFFSET(DE108_23B!$G$19,ROWS($G$19:G22)-1,COLUMNS($G$19:G22)-1)<>\"\",OFFSET(DE108_23B!$G$19,ROWS($G$19:G22)-1,COLUMNS($G$19:G22)-1),\"\")","v":""},{"$f":"IF(OFFSET(DE108_23B!$H$19,ROWS($H$19:H22)-1,COLUMNS($H$19:H22)-1)<>\"\",OFFSET(DE108_23B!$H$19,ROWS($H$19:H22)-1,COLUMNS($H$19:H22)-1),\"\")","v":""},{"$f":"IF(OFFSET(DE108_23B!$I$19,ROWS($I$19:I22)-1,COLUMNS($I$19:I22)-1)<>\"\",OFFSET(DE108_23B!$I$19,ROWS($I$19:I22)-1,COLUMNS($I$19:I22)-1),\"\")","v":""},{"$f":"IF(OFFSET(DE108_23B!$J$19,ROWS($J$19:J22)-1,COLUMNS($J$19:J22)-1)<>\"\",OFFSET(DE108_23B!$J$19,ROWS($J$19:J22)-1,COLUMNS($J$19:J22)-1),\"\")","v":""},{"$f":"IF(OFFSET(DE108_23B!$K$19,ROWS($K$19:K22)-1,COLUMNS($K$19:K22)-1)<>\"\",OFFSET(DE108_23B!$K$19,ROWS($K$19:K22)-1,COLUMNS($K$19:K22)-1),\"\")","v":""},{"$f":"IF(OFFSET(DE108_23B!$L$19,ROWS($L$19:L22)-1,COLUMNS($L$19:L22)-1)<>\"\",OFFSET(DE108_23B!$L$19,ROWS($L$19:L22)-1,COLUMNS($L$19:L22)-1),\"\")","v":""},{"$f":"IF(OFFSET(DE108_23B!$M$19,ROWS($M$19:M22)-1,COLUMNS($M$19:M22)-1)<>\"\",OFFSET(DE108_23B!$M$19,ROWS($M$19:M22)-1,COLUMNS($M$19:M22)-1),\"\")","v":""},{"$f":"IF(OFFSET(DE108_23B!$N$19,ROWS($N$19:N22)-1,COLUMNS($N$19:N22)-1)<>\"\",OFFSET(DE108_23B!$N$19,ROWS($N$19:N22)-1,COLUMNS($N$19:N22)-1),\"\")","v":""},{"$f":"IF(OFFSET(DE108_23B!$O$19,ROWS($O$19:O22)-1,COLUMNS($O$19:O22)-1)<>\"\",OFFSET(DE108_23B!$O$19,ROWS($O$19:O22)-1,COLUMNS($O$19:O22)-1),\"\")","v":""},{"$f":"IF(OFFSET(DE108_23B!$P$19,ROWS($P$19:P22)-1,COLUMNS($P$19:P22)-1)<>\"\",OFFSET(DE108_23B!$P$19,ROWS($P$19:P22)-1,COLUMNS($P$19:P22)-1),\"\")","v":""},{"$f":"IF(OFFSET(DE108_23B!$Q$19,ROWS($Q$19:Q22)-1,COLUMNS($Q$19:Q22)-1)<>\"\",OFFSET(DE108_23B!$Q$19,ROWS($Q$19:Q22)-1,COLUMNS($Q$19:Q22)-1),\"\")","v":""},{"$f":"IF(OFFSET(DE108_23B!$R$19,ROWS($R$19:R22)-1,COLUMNS($R$19:R22)-1)<>\"\",OFFSET(DE108_23B!$R$19,ROWS($R$19:R22)-1,COLUMNS($R$19:R22)-1),\"\")","v":""},{"$f":"IF(OFFSET(DE108_23B!$S$19,ROWS($S$19:S22)-1,COLUMNS($S$19:S22)-1)<>\"\",OFFSET(DE108_23B!$S$19,ROWS($S$19:S22)-1,COLUMNS($S$19:S22)-1),\"\")","v":""},{"$f":"IF(OFFSET(DE108_23B!$T$19,ROWS($T$19:T22)-1,COLUMNS($T$19:T22)-1)<>\"\",OFFSET(DE108_23B!$T$19,ROWS($T$19:T22)-1,COLUMNS($T$19:T22)-1),\"\")","v":""},{"$f":"IF(OFFSET(DE108_23B!$U$19,ROWS($U$19:U22)-1,COLUMNS($U$19:U22)-1)<>\"\",OFFSET(DE108_23B!$U$19,ROWS($U$19:U22)-1,COLUMNS($U$19:U22)-1),\"\")","v":""},{"$f":"IF(OFFSET(DE108_23B!$V$19,ROWS($V$19:V22)-1,COLUMNS($V$19:V22)-1)<>\"\",OFFSET(DE108_23B!$V$19,ROWS($V$19:V22)-1,COLUMNS($V$19:V22)-1),\"\")","v":""},{"$f":"IF(OFFSET(DE108_23B!$W$19,ROWS($W$19:W22)-1,COLUMNS($W$19:W22)-1)<>\"\",OFFSET(DE108_23B!$W$19,ROWS($W$19:W22)-1,COLUMNS($W$19:W22)-1),\"\")","v":""},{"$f":"IF(OFFSET(DE108_23B!$X$19,ROWS($X$19:X22)-1,COLUMNS($X$19:X22)-1)<>\"\",OFFSET(DE108_23B!$X$19,ROWS($X$19:X22)-1,COLUMNS($X$19:X22)-1),\"\")","v":""},{"$f":"IF(OFFSET(DE108_23B!$Y$19,ROWS($Y$19:Y22)-1,COLUMNS($Y$19:Y22)-1)<>\"\",OFFSET(DE108_23B!$Y$19,ROWS($Y$19:Y22)-1,COLUMNS($Y$19:Y22)-1),\"\")","v":""},{"$f":"IF(OFFSET(DE108_23B!$Z$19,ROWS($Z$19:Z22)-1,COLUMNS($Z$19:Z22)-1)<>\"\",OFFSET(DE108_23B!$Z$19,ROWS($Z$19:Z22)-1,COLUMNS($Z$19:Z22)-1),\"\")","v":""},{"$f":"IF(OFFSET(DE108_23B!$AA$19,ROWS($AA$19:AA22)-1,COLUMNS($AA$19:AA22)-1)<>\"\",OFFSET(DE108_23B!$AA$19,ROWS($AA$19:AA22)-1,COLUMNS($AA$19:AA22)-1),\"\")","v":""},{"$f":"IF(OFFSET(DE108_23B!$AB$19,ROWS($AB$19:AB22)-1,COLUMNS($AB$19:AB22)-1)<>\"\",OFFSET(DE108_23B!$AB$19,ROWS($AB$19:AB22)-1,COLUMNS($AB$19:AB22)-1),\"\")","v":""},{"$f":"IF(OFFSET(DE108_23B!$AC$19,ROWS($AC$19:AC22)-1,COLUMNS($AC$19:AC22)-1)<>\"\",OFFSET(DE108_23B!$AC$19,ROWS($AC$19:AC22)-1,COLUMNS($AC$19:AC22)-1),\"\")","v":""},{"$f":"IF(OFFSET(DE108_23B!$AD$19,ROWS($AD$19:AD22)-1,COLUMNS($AD$19:AD22)-1)<>\"\",OFFSET(DE108_23B!$AD$19,ROWS($AD$19:AD22)-1,COLUMNS($AD$19:AD22)-1),\"\")","v":""},{"$f":"IF(OFFSET(DE108_23B!$AE$19,ROWS($AE$19:AE22)-1,COLUMNS($AE$19:AE22)-1)<>\"\",OFFSET(DE108_23B!$AE$19,ROWS($AE$19:AE22)-1,COLUMNS($AE$19:AE22)-1),\"\")","v":""},{"$f":"IF(OFFSET(DE108_23B!$AF$19,ROWS($AF$19:AF22)-1,COLUMNS($AF$19:AF22)-1)<>\"\",OFFSET(DE108_23B!$AF$19,ROWS($AF$19:AF22)-1,COLUMNS($AF$19:AF22)-1),\"\")","v":""},{"$f":"IF(OFFSET(DE108_23B!$AG$19,ROWS($AG$19:AG22)-1,COLUMNS($AG$19:AG22)-1)<>\"\",OFFSET(DE108_23B!$AG$19,ROWS($AG$19:AG22)-1,COLUMNS($AG$19:AG22)-1),\"\")","v":""},{"$f":"IF(OFFSET(DE108_23B!$AH$19,ROWS($AH$19:AH22)-1,COLUMNS($AH$19:AH22)-1)<>\"\",OFFSET(DE108_23B!$AH$19,ROWS($AH$19:AH22)-1,COLUMNS($AH$19:AH22)-1),\"\")","v":""},{"$f":"IF(OFFSET(DE108_23B!$AI$19,ROWS($AI$19:AI22)-1,COLUMNS($AI$19:AI22)-1)<>\"\",OFFSET(DE108_23B!$AI$19,ROWS($AI$19:AI22)-1,COLUMNS($AI$19:AI22)-1),\"\")","v":""},{"$f":"IF(OFFSET(DE108_23B!$AJ$19,ROWS($AJ$19:AJ22)-1,COLUMNS($AJ$19:AJ22)-1)<>\"\",OFFSET(DE108_23B!$AJ$19,ROWS($AJ$19:AJ22)-1,COLUMNS($AJ$19:AJ22)-1),\"\")","v":""},{"$f":"IF(OFFSET(DE108_23B!$AK$19,ROWS($AK$19:AK22)-1,COLUMNS($AK$19:AK22)-1)<>\"\",OFFSET(DE108_23B!$AK$19,ROWS($AK$19:AK22)-1,COLUMNS($AK$19:AK22)-1),\"\")","v":""},{"$f":"IF(OFFSET(DE108_23B!$AL$19,ROWS($AL$19:AL22)-1,COLUMNS($AL$19:AL22)-1)<>\"\",OFFSET(DE108_23B!$AL$19,ROWS($AL$19:AL22)-1,COLUMNS($AL$19:AL22)-1),\"\")","v":""},{"$f":"IF(OFFSET(DE108_23B!$AM$19,ROWS($AM$19:AM22)-1,COLUMNS($AM$19:AM22)-1)<>\"\",OFFSET(DE108_23B!$AM$19,ROWS($AM$19:AM22)-1,COLUMNS($AM$19:AM22)-1),\"\")","v":""},{"$f":"IF(OFFSET(DE108_23B!$AN$19,ROWS($AN$19:AN22)-1,COLUMNS($AN$19:AN22)-1)<>\"\",OFFSET(DE108_23B!$AN$19,ROWS($AN$19:AN22)-1,COLUMNS($AN$19:AN22)-1),\"\")","v":""},{"$f":"IF(OFFSET(DE108_23B!$AO$19,ROWS($AO$19:AO22)-1,COLUMNS($AO$19:AO22)-1)<>\"\",OFFSET(DE108_23B!$AO$19,ROWS($AO$19:AO22)-1,COLUMNS($AO$19:AO22)-1),\"\")","v":""},{"$f":"IF(OFFSET(DE108_23B!$AP$19,ROWS($AP$19:AP22)-1,COLUMNS($AP$19:AP22)-1)<>\"\",OFFSET(DE108_23B!$AP$19,ROWS($AP$19:AP22)-1,COLUMNS($AP$19:AP22)-1),\"\")","v":""},{"$f":"IF(OFFSET(DE108_23B!$AQ$19,ROWS($AQ$19:AQ22)-1,COLUMNS($AQ$19:AQ22)-1)<>\"\",OFFSET(DE108_23B!$AQ$19,ROWS($AQ$19:AQ22)-1,COLUMNS($AQ$19:AQ22)-1),\"\")","v":""},{"$f":"IF(OFFSET(DE108_23B!$AR$19,ROWS($AR$19:AR22)-1,COLUMNS($AR$19:AR22)-1)<>\"\",OFFSET(DE108_23B!$AR$19,ROWS($AR$19:AR22)-1,COLUMNS($AR$19:AR22)-1),\"\")","v":""},{"$f":"IF(OFFSET(DE108_23B!$AS$19,ROWS($AS$19:AS22)-1,COLUMNS($AS$19:AS22)-1)<>\"\",OFFSET(DE108_23B!$AS$19,ROWS($AS$19:AS22)-1,COLUMNS($AS$19:AS22)-1),\"\")","v":""},{"$f":"IF(OFFSET(DE108_23B!$AT$19,ROWS($AT$19:AT22)-1,COLUMNS($AT$19:AT22)-1)<>\"\",OFFSET(DE108_23B!$AT$19,ROWS($AT$19:AT22)-1,COLUMNS($AT$19:AT22)-1),\"\")","v":""},{"$f":"IF(OFFSET(DE108_23B!$AU$19,ROWS($AU$19:AU22)-1,COLUMNS($AU$19:AU22)-1)<>\"\",OFFSET(DE108_23B!$AU$19,ROWS($AU$19:AU22)-1,COLUMNS($AU$19:AU22)-1),\"\")","v":""},{"$f":"IF(OFFSET(DE108_23B!$AV$19,ROWS($AV$19:AV22)-1,COLUMNS($AV$19:AV22)-1)<>\"\",OFFSET(DE108_23B!$AV$19,ROWS($AV$19:AV22)-1,COLUMNS($AV$19:AV22)-1),\"\")","v":""},{"$f":"IF(OFFSET(DE108_23B!$AW$19,ROWS($AW$19:AW22)-1,COLUMNS($AW$19:AW22)-1)<>\"\",OFFSET(DE108_23B!$AW$19,ROWS($AW$19:AW22)-1,COLUMNS($AW$19:AW22)-1),\"\")","v":""},{"$f":"IF(OFFSET(DE108_23B!$AX$19,ROWS($AX$19:AX22)-1,COLUMNS($AX$19:AX22)-1)<>\"\",OFFSET(DE108_23B!$AX$19,ROWS($AX$19:AX22)-1,COLUMNS($AX$19:AX22)-1),\"\")","v":""},{"$f":"IF(OFFSET(DE108_23B!$AY$19,ROWS($AY$19:AY22)-1,COLUMNS($AY$19:AY22)-1)<>\"\",OFFSET(DE108_23B!$AY$19,ROWS($AY$19:AY22)-1,COLUMNS($AY$19:AY22)-1),\"\")","v":""}]
[{"$f":"IF(OFFSET(DE108_23B!$C$19,ROWS($C$19:C23)-1,COLUMNS($C$19:C23)-1)<>\"\",OFFSET(DE108_23B!$C$19,ROWS($C$19:C23)-1,COLUMNS($C$19:C23)-1),\"\")","v":"MON"},{"$f":"IF(OFFSET(DE108_23B!$D$19,ROWS($D$19:D23)-1,COLUMNS($D$19:D23)-1)<>\"\",OFFSET(DE108_23B!$D$19,ROWS($D$19:D23)-1,COLUMNS($D$19:D23)-1),\"\")","v":""},{"$f":"IF(OFFSET(DE108_23B!$E$19,ROWS($E$19:E23)-1,COLUMNS($E$19:E23)-1)<>\"\",OFFSET(DE108_23B!$E$19,ROWS($E$19:E23)-1,COLUMNS($E$19:E23)-1),\"\")","v":""},{"$f":"IF(OFFSET(DE108_23B!$F$19,ROWS($F$19:F23)-1,COLUMNS($F$19:F23)-1)<>\"\",OFFSET(DE108_23B!$F$19,ROWS($F$19:F23)-1,COLUMNS($F$19:F23)-1),\"\")","v":""},{"$f":"IF(OFFSET(DE108_23B!$G$19,ROWS($G$19:G23)-1,COLUMNS($G$19:G23)-1)<>\"\",OFFSET(DE108_23B!$G$19,ROWS($G$19:G23)-1,COLUMNS($G$19:G23)-1),\"\")","v":""},{"$f":"IF(OFFSET(DE108_23B!$H$19,ROWS($H$19:H23)-1,COLUMNS($H$19:H23)-1)<>\"\",OFFSET(DE108_23B!$H$19,ROWS($H$19:H23)-1,COLUMNS($H$19:H23)-1),\"\")","v":""},{"$f":"IF(OFFSET(DE108_23B!$I$19,ROWS($I$19:I23)-1,COLUMNS($I$19:I23)-1)<>\"\",OFFSET(DE108_23B!$I$19,ROWS($I$19:I23)-1,COLUMNS($I$19:I23)-1),\"\")","v":""},{"$f":"IF(OFFSET(DE108_23B!$J$19,ROWS($J$19:J23)-1,COLUMNS($J$19:J23)-1)<>\"\",OFFSET(DE108_23B!$J$19,ROWS($J$19:J23)-1,COLUMNS($J$19:J23)-1),\"\")","v":""},{"$f":"IF(OFFSET(DE108_23B!$K$19,ROWS($K$19:K23)-1,COLUMNS($K$19:K23)-1)<>\"\",OFFSET(DE108_23B!$K$19,ROWS($K$19:K23)-1,COLUMNS($K$19:K23)-1),\"\")","v":""},{"$f":"IF(OFFSET(DE108_23B!$L$19,ROWS($L$19:L23)-1,COLUMNS($L$19:L23)-1)<>\"\",OFFSET(DE108_23B!$L$19,ROWS($L$19:L23)-1,COLUMNS($L$19:L23)-1),\"\")","v":""},{"$f":"IF(OFFSET(DE108_23B!$M$19,ROWS($M$19:M23)-1,COLUMNS($M$19:M23)-1)<>\"\",OFFSET(DE108_23B!$M$19,ROWS($M$19:M23)-1,COLUMNS($M$19:M23)-1),\"\")","v":""},{"$f":"IF(OFFSET(DE108_23B!$N$19,ROWS($N$19:N23)-1,COLUMNS($N$19:N23)-1)<>\"\",OFFSET(DE108_23B!$N$19,ROWS($N$19:N23)-1,COLUMNS($N$19:N23)-1),\"\")","v":""},{"$f":"IF(OFFSET(DE108_23B!$O$19,ROWS($O$19:O23)-1,COLUMNS($O$19:O23)-1)<>\"\",OFFSET(DE108_23B!$O$19,ROWS($O$19:O23)-1,COLUMNS($O$19:O23)-1),\"\")","v":""},{"$f":"IF(OFFSET(DE108_23B!$P$19,ROWS($P$19:P23)-1,COLUMNS($P$19:P23)-1)<>\"\",OFFSET(DE108_23B!$P$19,ROWS($P$19:P23)-1,COLUMNS($P$19:P23)-1),\"\")","v":""},{"$f":"IF(OFFSET(DE108_23B!$Q$19,ROWS($Q$19:Q23)-1,COLUMNS($Q$19:Q23)-1)<>\"\",OFFSET(DE108_23B!$Q$19,ROWS($Q$19:Q23)-1,COLUMNS($Q$19:Q23)-1),\"\")","v":""},{"$f":"IF(OFFSET(DE108_23B!$R$19,ROWS($R$19:R23)-1,COLUMNS($R$19:R23)-1)<>\"\",OFFSET(DE108_23B!$R$19,ROWS($R$19:R23)-1,COLUMNS($R$19:R23)-1),\"\")","v":""},{"$f":"IF(OFFSET(DE108_23B!$S$19,ROWS($S$19:S23)-1,COLUMNS($S$19:S23)-1)<>\"\",OFFSET(DE108_23B!$S$19,ROWS($S$19:S23)-1,COLUMNS($S$19:S23)-1),\"\")","v":""},{"$f":"IF(OFFSET(DE108_23B!$T$19,ROWS($T$19:T23)-1,COLUMNS($T$19:T23)-1)<>\"\",OFFSET(DE108_23B!$T$19,ROWS($T$19:T23)-1,COLUMNS($T$19:T23)-1),\"\")","v":""},{"$f":"IF(OFFSET(DE108_23B!$U$19,ROWS($U$19:U23)-1,COLUMNS($U$19:U23)-1)<>\"\",OFFSET(DE108_23B!$U$19,ROWS($U$19:U23)-1,COLUMNS($U$19:U23)-1),\"\")","v":""},{"$f":"IF(OFFSET(DE108_23B!$V$19,ROWS($V$19:V23)-1,COLUMNS($V$19:V23)-1)<>\"\",OFFSET(DE108_23B!$V$19,ROWS($V$19:V23)-1,COLUMNS($V$19:V23)-1),\"\")","v":""},{"$f":"IF(OFFSET(DE108_23B!$W$19,ROWS($W$19:W23)-1,COLUMNS($W$19:W23)-1)<>\"\",OFFSET(DE108_23B!$W$19,ROWS($W$19:W23)-1,COLUMNS($W$19:W23)-1),\"\")","v":""},{"$f":"IF(OFFSET(DE108_23B!$X$19,ROWS($X$19:X23)-1,COLUMNS($X$19:X23)-1)<>\"\",OFFSET(DE108_23B!$X$19,ROWS($X$19:X23)-1,COLUMNS($X$19:X23)-1),\"\")","v":""},{"$f":"IF(OFFSET(DE108_23B!$Y$19,ROWS($Y$19:Y23)-1,COLUMNS($Y$19:Y23)-1)<>\"\",OFFSET(DE108_23B!$Y$19,ROWS($Y$19:Y23)-1,COLUMNS($Y$19:Y23)-1),\"\")","v":""},{"$f":"IF(OFFSET(DE108_23B!$Z$19,ROWS($Z$19:Z23)-1,COLUMNS($Z$19:Z23)-1)<>\"\",OFFSET(DE108_23B!$Z$19,ROWS($Z$19:Z23)-1,COLUMNS($Z$19:Z23)-1),\"\")","v":""},{"$f":"IF(OFFSET(DE108_23B!$AA$19,ROWS($AA$19:AA23)-1,COLUMNS($AA$19:AA23)-1)<>\"\",OFFSET(DE108_23B!$AA$19,ROWS($AA$19:AA23)-1,COLUMNS($AA$19:AA23)-1),\"\")","v":""},{"$f":"IF(OFFSET(DE108_23B!$AB$19,ROWS($AB$19:AB23)-1,COLUMNS($AB$19:AB23)-1)<>\"\",OFFSET(DE108_23B!$AB$19,ROWS($AB$19:AB23)-1,COLUMNS($AB$19:AB23)-1),\"\")","v":""},{"$f":"IF(OFFSET(DE108_23B!$AC$19,ROWS($AC$19:AC23)-1,COLUMNS($AC$19:AC23)-1)<>\"\",OFFSET(DE108_23B!$AC$19,ROWS($AC$19:AC23)-1,COLUMNS($AC$19:AC23)-1),\"\")","v":""},{"$f":"IF(OFFSET(DE108_23B!$AD$19,ROWS($AD$19:AD23)-1,COLUMNS($AD$19:AD23)-1)<>\"\",OFFSET(DE108_23B!$AD$19,ROWS($AD$19:AD23)-1,COLUMNS($AD$19:AD23)-1),\"\")","v":""},{"$f":"IF(OFFSET(DE108_23B!$AE$19,ROWS($AE$19:AE23)-1,COLUMNS($AE$19:AE23)-1)<>\"\",OFFSET(DE108_23B!$AE$19,ROWS($AE$19:AE23)-1,COLUMNS($AE$19:AE23)-1),\"\")","v":""},{"$f":"IF(OFFSET(DE108_23B!$AF$19,ROWS($AF$19:AF23)-1,COLUMNS($AF$19:AF23)-1)<>\"\",OFFSET(DE108_23B!$AF$19,ROWS($AF$19:AF23)-1,COLUMNS($AF$19:AF23)-1),\"\")","v":""},{"$f":"IF(OFFSET(DE108_23B!$AG$19,ROWS($AG$19:AG23)-1,COLUMNS($AG$19:AG23)-1)<>\"\",OFFSET(DE108_23B!$AG$19,ROWS($AG$19:AG23)-1,COLUMNS($AG$19:AG23)-1),\"\")","v":""},{"$f":"IF(OFFSET(DE108_23B!$AH$19,ROWS($AH$19:AH23)-1,COLUMNS($AH$19:AH23)-1)<>\"\",OFFSET(DE108_23B!$AH$19,ROWS($AH$19:AH23)-1,COLUMNS($AH$19:AH23)-1),\"\")","v":""},{"$f":"IF(OFFSET(DE108_23B!$AI$19,ROWS($AI$19:AI23)-1,COLUMNS($AI$19:AI23)-1)<>\"\",OFFSET(DE108_23B!$AI$19,ROWS($AI$19:AI23)-1,COLUMNS($AI$19:AI23)-1),\"\")","v":""},{"$f":"IF(OFFSET(DE108_23B!$AJ$19,ROWS($AJ$19:AJ23)-1,COLUMNS($AJ$19:AJ23)-1)<>\"\",OFFSET(DE108_23B!$AJ$19,ROWS($AJ$19:AJ23)-1,COLUMNS($AJ$19:AJ23)-1),\"\")","v":""},{"$f":"IF(OFFSET(DE108_23B!$AK$19,ROWS($AK$19:AK23)-1,COLUMNS($AK$19:AK23)-1)<>\"\",OFFSET(DE108_23B!$AK$19,ROWS($AK$19:AK23)-1,COLUMNS($AK$19:AK23)-1),\"\")","v":""},{"$f":"IF(OFFSET(DE108_23B!$AL$19,ROWS($AL$19:AL23)-1,COLUMNS($AL$19:AL23)-1)<>\"\",OFFSET(DE108_23B!$AL$19,ROWS($AL$19:AL23)-1,COLUMNS($AL$19:AL23)-1),\"\")","v":""},{"$f":"IF(OFFSET(DE108_23B!$AM$19,ROWS($AM$19:AM23)-1,COLUMNS($AM$19:AM23)-1)<>\"\",OFFSET(DE108_23B!$AM$19,ROWS($AM$19:AM23)-1,COLUMNS($AM$19:AM23)-1),\"\")","v":""},{"$f":"IF(OFFSET(DE108_23B!$AN$19,ROWS($AN$19:AN23)-1,COLUMNS($AN$19:AN23)-1)<>\"\",OFFSET(DE108_23B!$AN$19,ROWS($AN$19:AN23)-1,COLUMNS($AN$19:AN23)-1),\"\")","v":""},{"$f":"IF(OFFSET(DE108_23B!$AO$19,ROWS($AO$19:AO23)-1,COLUMNS($AO$19:AO23)-1)<>\"\",OFFSET(DE108_23B!$AO$19,ROWS($AO$19:AO23)-1,COLUMNS($AO$19:AO23)-1),\"\")","v":""},{"$f":"IF(OFFSET(DE108_23B!$AP$19,ROWS($AP$19:AP23)-1,COLUMNS($AP$19:AP23)-1)<>\"\",OFFSET(DE108_23B!$AP$19,ROWS($AP$19:AP23)-1,COLUMNS($AP$19:AP23)-1),\"\")","v":""},{"$f":"IF(OFFSET(DE108_23B!$AQ$19,ROWS($AQ$19:AQ23)-1,COLUMNS($AQ$19:AQ23)-1)<>\"\",OFFSET(DE108_23B!$AQ$19,ROWS($AQ$19:AQ23)-1,COLUMNS($AQ$19:AQ23)-1),\"\")","v":""},{"$f":"IF(OFFSET(DE108_23B!$AR$19,ROWS($AR$19:AR23)-1,COLUMNS($AR$19:AR23)-1)<>\"\",OFFSET(DE108_23B!$AR$19,ROWS($AR$19:AR23)-1,COLUMNS($AR$19:AR23)-1),\"\")","v":""},{"$f":"IF(OFFSET(DE108_23B!$AS$19,ROWS($AS$19:AS23)-1,COLUMNS($AS$19:AS23)-1)<>\"\",OFFSET(DE108_23B!$AS$19,ROWS($AS$19:AS23)-1,COLUMNS($AS$19:AS23)-1),\"\")","v":""},{"$f":"IF(OFFSET(DE108_23B!$AT$19,ROWS($AT$19:AT23)-1,COLUMNS($AT$19:AT23)-1)<>\"\",OFFSET(DE108_23B!$AT$19,ROWS($AT$19:AT23)-1,COLUMNS($AT$19:AT23)-1),\"\")","v":""},{"$f":"IF(OFFSET(DE108_23B!$AU$19,ROWS($AU$19:AU23)-1,COLUMNS($AU$19:AU23)-1)<>\"\",OFFSET(DE108_23B!$AU$19,ROWS($AU$19:AU23)-1,COLUMNS($AU$19:AU23)-1),\"\")","v":""},{"$f":"IF(OFFSET(DE108_23B!$AV$19,ROWS($AV$19:AV23)-1,COLUMNS($AV$19:AV23)-1)<>\"\",OFFSET(DE108_23B!$AV$19,ROWS($AV$19:AV23)-1,COLUMNS($AV$19:AV23)-1),\"\")","v":""},{"$f":"IF(OFFSET(DE108_23B!$AW$19,ROWS($AW$19:AW23)-1,COLUMNS($AW$19:AW23)-1)<>\"\",OFFSET(DE108_23B!$AW$19,ROWS($AW$19:AW23)-1,COLUMNS($AW$19:AW23)-1),\"\")","v":""},{"$f":"IF(OFFSET(DE108_23B!$AX$19,ROWS($AX$19:AX23)-1,COLUMNS($AX$19:AX23)-1)<>\"\",OFFSET(DE108_23B!$AX$19,ROWS($AX$19:AX23)-1,COLUMNS($AX$19:AX23)-1),\"\")","v":""},{"$f":"IF(OFFSET(DE108_23B!$AY$19,ROWS($AY$19:AY23)-1,COLUMNS($AY$19:AY23)-1)<>\"\",OFFSET(DE108_23B!$AY$19,ROWS($AY$19:AY23)-1,COLUMNS($AY$19:AY23)-1),\"\")","v":""}]
[{"$f":"IF(OFFSET(DE108_23B!$C$19,ROWS($C$19:C24)-1,COLUMNS($C$19:C24)-1)<>\"\",OFFSET(DE108_23B!$C$19,ROWS($C$19:C24)-1,COLUMNS($C$19:C24)-1),\"\")","v":"TUE"},{"$f":"IF(OFFSET(DE108_23B!$D$19,ROWS($D$19:D24)-1,COLUMNS($D$19:D24)-1)<>\"\",OFFSET(DE108_23B!$D$19,ROWS($D$19:D24)-1,COLUMNS($D$19:D24)-1),\"\")","v":""},{"$f":"IF(OFFSET(DE108_23B!$E$19,ROWS($E$19:E24)-1,COLUMNS($E$19:E24)-1)<>\"\",OFFSET(DE108_23B!$E$19,ROWS($E$19:E24)-1,COLUMNS($E$19:E24)-1),\"\")","v":""},{"$f":"IF(OFFSET(DE108_23B!$F$19,ROWS($F$19:F24)-1,COLUMNS($F$19:F24)-1)<>\"\",OFFSET(DE108_23B!$F$19,ROWS($F$19:F24)-1,COLUMNS($F$19:F24)-1),\"\")","v":""},{"$f":"IF(OFFSET(DE108_23B!$G$19,ROWS($G$19:G24)-1,COLUMNS($G$19:G24)-1)<>\"\",OFFSET(DE108_23B!$G$19,ROWS($G$19:G24)-1,COLUMNS($G$19:G24)-1),\"\")","v":""},{"$f":"IF(OFFSET(DE108_23B!$H$19,ROWS($H$19:H24)-1,COLUMNS($H$19:H24)-1)<>\"\",OFFSET(DE108_23B!$H$19,ROWS($H$19:H24)-1,COLUMNS($H$19:H24)-1),\"\")","v":""},{"$f":"IF(OFFSET(DE108_23B!$I$19,ROWS($I$19:I24)-1,COLUMNS($I$19:I24)-1)<>\"\",OFFSET(DE108_23B!$I$19,ROWS($I$19:I24)-1,COLUMNS($I$19:I24)-1),\"\")","v":""},{"$f":"IF(OFFSET(DE108_23B!$J$19,ROWS($J$19:J24)-1,COLUMNS($J$19:J24)-1)<>\"\",OFFSET(DE108_23B!$J$19,ROWS($J$19:J24)-1,COLUMNS($J$19:J24)-1),\"\")","v":""},{"$f":"IF(OFFSET(DE108_23B!$K$19,ROWS($K$19:K24)-1,COLUMNS($K$19:K24)-1)<>\"\",OFFSET(DE108_23B!$K$19,ROWS($K$19:K24)-1,COLUMNS($K$19:K24)-1),\"\")","v":""},{"$f":"IF(OFFSET(DE108_23B!$L$19,ROWS($L$19:L24)-1,COLUMNS($L$19:L24)-1)<>\"\",OFFSET(DE108_23B!$L$19,ROWS($L$19:L24)-1,COLUMNS($L$19:L24)-1),\"\")","v":""},{"$f":"IF(OFFSET(DE108_23B!$M$19,ROWS($M$19:M24)-1,COLUMNS($M$19:M24)-1)<>\"\",OFFSET(DE108_23B!$M$19,ROWS($M$19:M24)-1,COLUMNS($M$19:M24)-1),\"\")","v":""},{"$f":"IF(OFFSET(DE108_23B!$N$19,ROWS($N$19:N24)-1,COLUMNS($N$19:N24)-1)<>\"\",OFFSET(DE108_23B!$N$19,ROWS($N$19:N24)-1,COLUMNS($N$19:N24)-1),\"\")","v":""},{"$f":"IF(OFFSET(DE108_23B!$O$19,ROWS($O$19:O24)-1,COLUMNS($O$19:O24)-1)<>\"\",OFFSET(DE108_23B!$O$19,ROWS($O$19:O24)-1,COLUMNS($O$19:O24)-1),\"\")","v":""},{"$f":"IF(OFFSET(DE108_23B!$P$19,ROWS($P$19:P24)-1,COLUMNS($P$19:P24)-1)<>\"\",OFFSET(DE108_23B!$P$19,ROWS($P$19:P24)-1,COLUMNS($P$19:P24)-1),\"\")","v":""},{"$f":"IF(OFFSET(DE108_23B!$Q$19,ROWS($Q$19:Q24)-1,COLUMNS($Q$19:Q24)-1)<>\"\",OFFSET(DE108_23B!$Q$19,ROWS($Q$19:Q24)-1,COLUMNS($Q$19:Q24)-1),\"\")","v":""},{"$f":"IF(OFFSET(DE108_23B!$R$19,ROWS($R$19:R24)-1,COLUMNS($R$19:R24)-1)<>\"\",OFFSET(DE108_23B!$R$19,ROWS($R$19:R24)-1,COLUMNS($R$19:R24)-1),\"\")","v":""},{"$f":"IF(OFFSET(DE108_23B!$S$19,ROWS($S$19:S24)-1,COLUMNS($S$19:S24)-1)<>\"\",OFFSET(DE108_23B!$S$19,ROWS($S$19:S24)-1,COLUMNS($S$19:S24)-1),\"\")","v":""},{"$f":"IF(OFFSET(DE108_23B!$T$19,ROWS($T$19:T24)-1,COLUMNS($T$19:T24)-1)<>\"\",OFFSET(DE108_23B!$T$19,ROWS($T$19:T24)-1,COLUMNS($T$19:T24)-1),\"\")","v":""},{"$f":"IF(OFFSET(DE108_23B!$U$19,ROWS($U$19:U24)-1,COLUMNS($U$19:U24)-1)<>\"\",OFFSET(DE108_23B!$U$19,ROWS($U$19:U24)-1,COLUMNS($U$19:U24)-1),\"\")","v":""},{"$f":"IF(OFFSET(DE108_23B!$V$19,ROWS($V$19:V24)-1,COLUMNS($V$19:V24)-1)<>\"\",OFFSET(DE108_23B!$V$19,ROWS($V$19:V24)-1,COLUMNS($V$19:V24)-1),\"\")","v":""},{"$f":"IF(OFFSET(DE108_23B!$W$19,ROWS($W$19:W24)-1,COLUMNS($W$19:W24)-1)<>\"\",OFFSET(DE108_23B!$W$19,ROWS($W$19:W24)-1,COLUMNS($W$19:W24)-1),\"\")","v":""},{"$f":"IF(OFFSET(DE108_23B!$X$19,ROWS($X$19:X24)-1,COLUMNS($X$19:X24)-1)<>\"\",OFFSET(DE108_23B!$X$19,ROWS($X$19:X24)-1,COLUMNS($X$19:X24)-1),\"\")","v":""},{"$f":"IF(OFFSET(DE108_23B!$Y$19,ROWS($Y$19:Y24)-1,COLUMNS($Y$19:Y24)-1)<>\"\",OFFSET(DE108_23B!$Y$19,ROWS($Y$19:Y24)-1,COLUMNS($Y$19:Y24)-1),\"\")","v":""},{"$f":"IF(OFFSET(DE108_23B!$Z$19,ROWS($Z$19:Z24)-1,COLUMNS($Z$19:Z24)-1)<>\"\",OFFSET(DE108_23B!$Z$19,ROWS($Z$19:Z24)-1,COLUMNS($Z$19:Z24)-1),\"\")","v":""},{"$f":"IF(OFFSET(DE108_23B!$AA$19,ROWS($AA$19:AA24)-1,COLUMNS($AA$19:AA24)-1)<>\"\",OFFSET(DE108_23B!$AA$19,ROWS($AA$19:AA24)-1,COLUMNS($AA$19:AA24)-1),\"\")","v":""},{"$f":"IF(OFFSET(DE108_23B!$AB$19,ROWS($AB$19:AB24)-1,COLUMNS($AB$19:AB24)-1)<>\"\",OFFSET(DE108_23B!$AB$19,ROWS($AB$19:AB24)-1,COLUMNS($AB$19:AB24)-1),\"\")","v":""},{"$f":"IF(OFFSET(DE108_23B!$AC$19,ROWS($AC$19:AC24)-1,COLUMNS($AC$19:AC24)-1)<>\"\",OFFSET(DE108_23B!$AC$19,ROWS($AC$19:AC24)-1,COLUMNS($AC$19:AC24)-1),\"\")","v":""},{"$f":"IF(OFFSET(DE108_23B!$AD$19,ROWS($AD$19:AD24)-1,COLUMNS($AD$19:AD24)-1)<>\"\",OFFSET(DE108_23B!$AD$19,ROWS($AD$19:AD24)-1,COLUMNS($AD$19:AD24)-1),\"\")","v":""},{"$f":"IF(OFFSET(DE108_23B!$AE$19,ROWS($AE$19:AE24)-1,COLUMNS($AE$19:AE24)-1)<>\"\",OFFSET(DE108_23B!$AE$19,ROWS($AE$19:AE24)-1,COLUMNS($AE$19:AE24)-1),\"\")","v":""},{"$f":"IF(OFFSET(DE108_23B!$AF$19,ROWS($AF$19:AF24)-1,COLUMNS($AF$19:AF24)-1)<>\"\",OFFSET(DE108_23B!$AF$19,ROWS($AF$19:AF24)-1,COLUMNS($AF$19:AF24)-1),\"\")","v":""},{"$f":"IF(OFFSET(DE108_23B!$AG$19,ROWS($AG$19:AG24)-1,COLUMNS($AG$19:AG24)-1)<>\"\",OFFSET(DE108_23B!$AG$19,ROWS($AG$19:AG24)-1,COLUMNS($AG$19:AG24)-1),\"\")","v":""},{"$f":"IF(OFFSET(DE108_23B!$AH$19,ROWS($AH$19:AH24)-1,COLUMNS($AH$19:AH24)-1)<>\"\",OFFSET(DE108_23B!$AH$19,ROWS($AH$19:AH24)-1,COLUMNS($AH$19:AH24)-1),\"\")","v":""},{"$f":"IF(OFFSET(DE108_23B!$AI$19,ROWS($AI$19:AI24)-1,COLUMNS($AI$19:AI24)-1)<>\"\",OFFSET(DE108_23B!$AI$19,ROWS($AI$19:AI24)-1,COLUMNS($AI$19:AI24)-1),\"\")","v":""},{"$f":"IF(OFFSET(DE108_23B!$AJ$19,ROWS($AJ$19:AJ24)-1,COLUMNS($AJ$19:AJ24)-1)<>\"\",OFFSET(DE108_23B!$AJ$19,ROWS($AJ$19:AJ24)-1,COLUMNS($AJ$19:AJ24)-1),\"\")","v":""},{"$f":"IF(OFFSET(DE108_23B!$AK$19,ROWS($AK$19:AK24)-1,COLUMNS($AK$19:AK24)-1)<>\"\",OFFSET(DE108_23B!$AK$19,ROWS($AK$19:AK24)-1,COLUMNS($AK$19:AK24)-1),\"\")","v":""},{"$f":"IF(OFFSET(DE108_23B!$AL$19,ROWS($AL$19:AL24)-1,COLUMNS($AL$19:AL24)-1)<>\"\",OFFSET(DE108_23B!$AL$19,ROWS($AL$19:AL24)-1,COLUMNS($AL$19:AL24)-1),\"\")","v":""},{"$f":"IF(OFFSET(DE108_23B!$AM$19,ROWS($AM$19:AM24)-1,COLUMNS($AM$19:AM24)-1)<>\"\",OFFSET(DE108_23B!$AM$19,ROWS($AM$19:AM24)-1,COLUMNS($AM$19:AM24)-1),\"\")","v":""},{"$f":"IF(OFFSET(DE108_23B!$AN$19,ROWS($AN$19:AN24)-1,COLUMNS($AN$19:AN24)-1)<>\"\",OFFSET(DE108_23B!$AN$19,ROWS($AN$19:AN24)-1,COLUMNS($AN$19:AN24)-1),\"\")","v":""},{"$f":"IF(OFFSET(DE108_23B!$AO$19,ROWS($AO$19:AO24)-1,COLUMNS($AO$19:AO24)-1)<>\"\",OFFSET(DE108_23B!$AO$19,ROWS($AO$19:AO24)-1,COLUMNS($AO$19:AO24)-1),\"\")","v":""},{"$f":"IF(OFFSET(DE108_23B!$AP$19,ROWS($AP$19:AP24)-1,COLUMNS($AP$19:AP24)-1)<>\"\",OFFSET(DE108_23B!$AP$19,ROWS($AP$19:AP24)-1,COLUMNS($AP$19:AP24)-1),\"\")","v":""},{"$f":"IF(OFFSET(DE108_23B!$AQ$19,ROWS($AQ$19:AQ24)-1,COLUMNS($AQ$19:AQ24)-1)<>\"\",OFFSET(DE108_23B!$AQ$19,ROWS($AQ$19:AQ24)-1,COLUMNS($AQ$19:AQ24)-1),\"\")","v":""},{"$f":"IF(OFFSET(DE108_23B!$AR$19,ROWS($AR$19:AR24)-1,COLUMNS($AR$19:AR24)-1)<>\"\",OFFSET(DE108_23B!$AR$19,ROWS($AR$19:AR24)-1,COLUMNS($AR$19:AR24)-1),\"\")","v":""},{"$f":"IF(OFFSET(DE108_23B!$AS$19,ROWS($AS$19:AS24)-1,COLUMNS($AS$19:AS24)-1)<>\"\",OFFSET(DE108_23B!$AS$19,ROWS($AS$19:AS24)-1,COLUMNS($AS$19:AS24)-1),\"\")","v":""},{"$f":"IF(OFFSET(DE108_23B!$AT$19,ROWS($AT$19:AT24)-1,COLUMNS($AT$19:AT24)-1)<>\"\",OFFSET(DE108_23B!$AT$19,ROWS($AT$19:AT24)-1,COLUMNS($AT$19:AT24)-1),\"\")","v":""},{"$f":"IF(OFFSET(DE108_23B!$AU$19,ROWS($AU$19:AU24)-1,COLUMNS($AU$19:AU24)-1)<>\"\",OFFSET(DE108_23B!$AU$19,ROWS($AU$19:AU24)-1,COLUMNS($AU$19:AU24)-1),\"\")","v":""},{"$f":"IF(OFFSET(DE108_23B!$AV$19,ROWS($AV$19:AV24)-1,COLUMNS($AV$19:AV24)-1)<>\"\",OFFSET(DE108_23B!$AV$19,ROWS($AV$19:AV24)-1,COLUMNS($AV$19:AV24)-1),\"\")","v":""},{"$f":"IF(OFFSET(DE108_23B!$AW$19,ROWS($AW$19:AW24)-1,COLUMNS($AW$19:AW24)-1)<>\"\",OFFSET(DE108_23B!$AW$19,ROWS($AW$19:AW24)-1,COLUMNS($AW$19:AW24)-1),\"\")","v":""},{"$f":"IF(OFFSET(DE108_23B!$AX$19,ROWS($AX$19:AX24)-1,COLUMNS($AX$19:AX24)-1)<>\"\",OFFSET(DE108_23B!$AX$19,ROWS($AX$19:AX24)-1,COLUMNS($AX$19:AX24)-1),\"\")","v":""},{"$f":"IF(OFFSET(DE108_23B!$AY$19,ROWS($AY$19:AY24)-1,COLUMNS($AY$19:AY24)-1)<>\"\",OFFSET(DE108_23B!$AY$19,ROWS($AY$19:AY24)-1,COLUMNS($AY$19:AY24)-1),\"\")","v":""}]
[{"$f":"IF(OFFSET(DE108_23B!$C$19,ROWS($C$19:C25)-1,COLUMNS($C$19:C25)-1)<>\"\",OFFSET(DE108_23B!$C$19,ROWS($C$19:C25)-1,COLUMNS($C$19:C25)-1),\"\")","v":"WED"},{"$f":"IF(OFFSET(DE108_23B!$D$19,ROWS($D$19:D25)-1,COLUMNS($D$19:D25)-1)<>\"\",OFFSET(DE108_23B!$D$19,ROWS($D$19:D25)-1,COLUMNS($D$19:D25)-1),\"\")","v":""},{"$f":"IF(OFFSET(DE108_23B!$E$19,ROWS($E$19:E25)-1,COLUMNS($E$19:E25)-1)<>\"\",OFFSET(DE108_23B!$E$19,ROWS($E$19:E25)-1,COLUMNS($E$19:E25)-1),\"\")","v":""},{"$f":"IF(OFFSET(DE108_23B!$F$19,ROWS($F$19:F25)-1,COLUMNS($F$19:F25)-1)<>\"\",OFFSET(DE108_23B!$F$19,ROWS($F$19:F25)-1,COLUMNS($F$19:F25)-1),\"\")","v":""},{"$f":"IF(OFFSET(DE108_23B!$G$19,ROWS($G$19:G25)-1,COLUMNS($G$19:G25)-1)<>\"\",OFFSET(DE108_23B!$G$19,ROWS($G$19:G25)-1,COLUMNS($G$19:G25)-1),\"\")","v":""},{"$f":"IF(OFFSET(DE108_23B!$H$19,ROWS($H$19:H25)-1,COLUMNS($H$19:H25)-1)<>\"\",OFFSET(DE108_23B!$H$19,ROWS($H$19:H25)-1,COLUMNS($H$19:H25)-1),\"\")","v":""},{"$f":"IF(OFFSET(DE108_23B!$I$19,ROWS($I$19:I25)-1,COLUMNS($I$19:I25)-1)<>\"\",OFFSET(DE108_23B!$I$19,ROWS($I$19:I25)-1,COLUMNS($I$19:I25)-1),\"\")","v":""},{"$f":"IF(OFFSET(DE108_23B!$J$19,ROWS($J$19:J25)-1,COLUMNS($J$19:J25)-1)<>\"\",OFFSET(DE108_23B!$J$19,ROWS($J$19:J25)-1,COLUMNS($J$19:J25)-1),\"\")","v":""},{"$f":"IF(OFFSET(DE108_23B!$K$19,ROWS($K$19:K25)-1,COLUMNS($K$19:K25)-1)<>\"\",OFFSET(DE108_23B!$K$19,ROWS($K$19:K25)-1,COLUMNS($K$19:K25)-1),\"\")","v":""},{"$f":"IF(OFFSET(DE108_23B!$L$19,ROWS($L$19:L25)-1,COLUMNS($L$19:L25)-1)<>\"\",OFFSET(DE108_23B!$L$19,ROWS($L$19:L25)-1,COLUMNS($L$19:L25)-1),\"\")","v":""},{"$f":"IF(OFFSET(DE108_23B!$M$19,ROWS($M$19:M25)-1,COLUMNS($M$19:M25)-1)<>\"\",OFFSET(DE108_23B!$M$19,ROWS($M$19:M25)-1,COLUMNS($M$19:M25)-1),\"\")","v":""},{"$f":"IF(OFFSET(DE108_23B!$N$19,ROWS($N$19:N25)-1,COLUMNS($N$19:N25)-1)<>\"\",OFFSET(DE108_23B!$N$19,ROWS($N$19:N25)-1,COLUMNS($N$19:N25)-1),\"\")","v":""},{"$f":"IF(OFFSET(DE108_23B!$O$19,ROWS($O$19:O25)-1,COLUMNS($O$19:O25)-1)<>\"\",OFFSET(DE108_23B!$O$19,ROWS($O$19:O25)-1,COLUMNS($O$19:O25)-1),\"\")","v":""},{"$f":"IF(OFFSET(DE108_23B!$P$19,ROWS($P$19:P25)-1,COLUMNS($P$19:P25)-1)<>\"\",OFFSET(DE108_23B!$P$19,ROWS($P$19:P25)-1,COLUMNS($P$19:P25)-1),\"\")","v":""},{"$f":"IF(OFFSET(DE108_23B!$Q$19,ROWS($Q$19:Q25)-1,COLUMNS($Q$19:Q25)-1)<>\"\",OFFSET(DE108_23B!$Q$19,ROWS($Q$19:Q25)-1,COLUMNS($Q$19:Q25)-1),\"\")","v":""},{"$f":"IF(OFFSET(DE108_23B!$R$19,ROWS($R$19:R25)-1,COLUMNS($R$19:R25)-1)<>\"\",OFFSET(DE108_23B!$R$19,ROWS($R$19:R25)-1,COLUMNS($R$19:R25)-1),\"\")","v":""},{"$f":"IF(OFFSET(DE108_23B!$S$19,ROWS($S$19:S25)-1,COLUMNS($S$19:S25)-1)<>\"\",OFFSET(DE108_23B!$S$19,ROWS($S$19:S25)-1,COLUMNS($S$19:S25)-1),\"\")","v":""},{"$f":"IF(OFFSET(DE108_23B!$T$19,ROWS($T$19:T25)-1,COLUMNS($T$19:T25)-1)<>\"\",OFFSET(DE108_23B!$T$19,ROWS($T$19:T25)-1,COLUMNS($T$19:T25)-1),\"\")","v":""},{"$f":"IF(OFFSET(DE108_23B!$U$19,ROWS($U$19:U25)-1,COLUMNS($U$19:U25)-1)<>\"\",OFFSET(DE108_23B!$U$19,ROWS($U$19:U25)-1,COLUMNS($U$19:U25)-1),\"\")","v":""},{"$f":"IF(OFFSET(DE108_23B!$V$19,ROWS($V$19:V25)-1,COLUMNS($V$19:V25)-1)<>\"\",OFFSET(DE108_23B!$V$19,ROWS($V$19:V25)-1,COLUMNS($V$19:V25)-1),\"\")","v":""},{"$f":"IF(OFFSET(DE108_23B!$W$19,ROWS($W$19:W25)-1,COLUMNS($W$19:W25)-1)<>\"\",OFFSET(DE108_23B!$W$19,ROWS($W$19:W25)-1,COLUMNS($W$19:W25)-1),\"\")","v":""},{"$f":"IF(OFFSET(DE108_23B!$X$19,ROWS($X$19:X25)-1,COLUMNS($X$19:X25)-1)<>\"\",OFFSET(DE108_23B!$X$19,ROWS($X$19:X25)-1,COLUMNS($X$19:X25)-1),\"\")","v":""},{"$f":"IF(OFFSET(DE108_23B!$Y$19,ROWS($Y$19:Y25)-1,COLUMNS($Y$19:Y25)-1)<>\"\",OFFSET(DE108_23B!$Y$19,ROWS($Y$19:Y25)-1,COLUMNS($Y$19:Y25)-1),\"\")","v":""},{"$f":"IF(OFFSET(DE108_23B!$Z$19,ROWS($Z$19:Z25)-1,COLUMNS($Z$19:Z25)-1)<>\"\",OFFSET(DE108_23B!$Z$19,ROWS($Z$19:Z25)-1,COLUMNS($Z$19:Z25)-1),\"\")","v":""},{"$f":"IF(OFFSET(DE108_23B!$AA$19,ROWS($AA$19:AA25)-1,COLUMNS($AA$19:AA25)-1)<>\"\",OFFSET(DE108_23B!$AA$19,ROWS($AA$19:AA25)-1,COLUMNS($AA$19:AA25)-1),\"\")","v":""},{"$f":"IF(OFFSET(DE108_23B!$AB$19,ROWS($AB$19:AB25)-1,COLUMNS($AB$19:AB25)-1)<>\"\",OFFSET(DE108_23B!$AB$19,ROWS($AB$19:AB25)-1,COLUMNS($AB$19:AB25)-1),\"\")","v":""},{"$f":"IF(OFFSET(DE108_23B!$AC$19,ROWS($AC$19:AC25)-1,COLUMNS($AC$19:AC25)-1)<>\"\",OFFSET(DE108_23B!$AC$19,ROWS($AC$19:AC25)-1,COLUMNS($AC$19:AC25)-1),\"\")","v":""},{"$f":"IF(OFFSET(DE108_23B!$AD$19,ROWS($AD$19:AD25)-1,COLUMNS($AD$19:AD25)-1)<>\"\",OFFSET(DE108_23B!$AD$19,ROWS($AD$19:AD25)-1,COLUMNS($AD$19:AD25)-1),\"\")","v":""},{"$f":"IF(OFFSET(DE108_23B!$AE$19,ROWS($AE$19:AE25)-1,COLUMNS($AE$19:AE25)-1)<>\"\",OFFSET(DE108_23B!$AE$19,ROWS($AE$19:AE25)-1,COLUMNS($AE$19:AE25)-1),\"\")","v":""},{"$f":"IF(OFFSET(DE108_23B!$AF$19,ROWS($AF$19:AF25)-1,COLUMNS($AF$19:AF25)-1)<>\"\",OFFSET(DE108_23B!$AF$19,ROWS($AF$19:AF25)-1,COLUMNS($AF$19:AF25)-1),\"\")","v":""},{"$f":"IF(OFFSET(DE108_23B!$AG$19,ROWS($AG$19:AG25)-1,COLUMNS($AG$19:AG25)-1)<>\"\",OFFSET(DE108_23B!$AG$19,ROWS($AG$19:AG25)-1,COLUMNS($AG$19:AG25)-1),\"\")","v":""},{"$f":"IF(OFFSET(DE108_23B!$AH$19,ROWS($AH$19:AH25)-1,COLUMNS($AH$19:AH25)-1)<>\"\",OFFSET(DE108_23B!$AH$19,ROWS($AH$19:AH25)-1,COLUMNS($AH$19:AH25)-1),\"\")","v":""},{"$f":"IF(OFFSET(DE108_23B!$AI$19,ROWS($AI$19:AI25)-1,COLUMNS($AI$19:AI25)-1)<>\"\",OFFSET(DE108_23B!$AI$19,ROWS($AI$19:AI25)-1,COLUMNS($AI$19:AI25)-1),\"\")","v":""},{"$f":"IF(OFFSET(DE108_23B!$AJ$19,ROWS($AJ$19:AJ25)-1,COLUMNS($AJ$19:AJ25)-1)<>\"\",OFFSET(DE108_23B!$AJ$19,ROWS($AJ$19:AJ25)-1,COLUMNS($AJ$19:AJ25)-1),\"\")","v":""},{"$f":"IF(OFFSET(DE108_23B!$AK$19,ROWS($AK$19:AK25)-1,COLUMNS($AK$19:AK25)-1)<>\"\",OFFSET(DE108_23B!$AK$19,ROWS($AK$19:AK25)-1,COLUMNS($AK$19:AK25)-1),\"\")","v":""},{"$f":"IF(OFFSET(DE108_23B!$AL$19,ROWS($AL$19:AL25)-1,COLUMNS($AL$19:AL25)-1)<>\"\",OFFSET(DE108_23B!$AL$19,ROWS($AL$19:AL25)-1,COLUMNS($AL$19:AL25)-1),\"\")","v":""},{"$f":"IF(OFFSET(DE108_23B!$AM$19,ROWS($AM$19:AM25)-1,COLUMNS($AM$19:AM25)-1)<>\"\",OFFSET(DE108_23B!$AM$19,ROWS($AM$19:AM25)-1,COLUMNS($AM$19:AM25)-1),\"\")","v":""},{"$f":"IF(OFFSET(DE108_23B!$AN$19,ROWS($AN$19:AN25)-1,COLUMNS($AN$19:AN25)-1)<>\"\",OFFSET(DE108_23B!$AN$19,ROWS($AN$19:AN25)-1,COLUMNS($AN$19:AN25)-1),\"\")","v":""},{"$f":"IF(OFFSET(DE108_23B!$AO$19,ROWS($AO$19:AO25)-1,COLUMNS($AO$19:AO25)-1)<>\"\",OFFSET(DE108_23B!$AO$19,ROWS($AO$19:AO25)-1,COLUMNS($AO$19:AO25)-1),\"\")","v":""},{"$f":"IF(OFFSET(DE108_23B!$AP$19,ROWS($AP$19:AP25)-1,COLUMNS($AP$19:AP25)-1)<>\"\",OFFSET(DE108_23B!$AP$19,ROWS($AP$19:AP25)-1,COLUMNS($AP$19:AP25)-1),\"\")","v":""},{"$f":"IF(OFFSET(DE108_23B!$AQ$19,ROWS($AQ$19:AQ25)-1,COLUMNS($AQ$19:AQ25)-1)<>\"\",OFFSET(DE108_23B!$AQ$19,ROWS($AQ$19:AQ25)-1,COLUMNS($AQ$19:AQ25)-1),\"\")","v":""},{"$f":"IF(OFFSET(DE108_23B!$AR$19,ROWS($AR$19:AR25)-1,COLUMNS($AR$19:AR25)-1)<>\"\",OFFSET(DE108_23B!$AR$19,ROWS($AR$19:AR25)-1,COLUMNS($AR$19:AR25)-1),\"\")","v":""},{"$f":"IF(OFFSET(DE108_23B!$AS$19,ROWS($AS$19:AS25)-1,COLUMNS($AS$19:AS25)-1)<>\"\",OFFSET(DE108_23B!$AS$19,ROWS($AS$19:AS25)-1,COLUMNS($AS$19:AS25)-1),\"\")","v":""},{"$f":"IF(OFFSET(DE108_23B!$AT$19,ROWS($AT$19:AT25)-1,COLUMNS($AT$19:AT25)-1)<>\"\",OFFSET(DE108_23B!$AT$19,ROWS($AT$19:AT25)-1,COLUMNS($AT$19:AT25)-1),\"\")","v":""},{"$f":"IF(OFFSET(DE108_23B!$AU$19,ROWS($AU$19:AU25)-1,COLUMNS($AU$19:AU25)-1)<>\"\",OFFSET(DE108_23B!$AU$19,ROWS($AU$19:AU25)-1,COLUMNS($AU$19:AU25)-1),\"\")","v":""},{"$f":"IF(OFFSET(DE108_23B!$AV$19,ROWS($AV$19:AV25)-1,COLUMNS($AV$19:AV25)-1)<>\"\",OFFSET(DE108_23B!$AV$19,ROWS($AV$19:AV25)-1,COLUMNS($AV$19:AV25)-1),\"\")","v":""},{"$f":"IF(OFFSET(DE108_23B!$AW$19,ROWS($AW$19:AW25)-1,COLUMNS($AW$19:AW25)-1)<>\"\",OFFSET(DE108_23B!$AW$19,ROWS($AW$19:AW25)-1,COLUMNS($AW$19:AW25)-1),\"\")","v":""},{"$f":"IF(OFFSET(DE108_23B!$AX$19,ROWS($AX$19:AX25)-1,COLUMNS($AX$19:AX25)-1)<>\"\",OFFSET(DE108_23B!$AX$19,ROWS($AX$19:AX25)-1,COLUMNS($AX$19:AX25)-1),\"\")","v":""},{"$f":"IF(OFFSET(DE108_23B!$AY$19,ROWS($AY$19:AY25)-1,COLUMNS($AY$19:AY25)-1)<>\"\",OFFSET(DE108_23B!$AY$19,ROWS($AY$19:AY25)-1,COLUMNS($AY$19:AY25)-1),\"\")","v":""}]
[{"$f":"IF(OFFSET(DE108_23B!$C$19,ROWS($C$19:C26)-1,COLUMNS($C$19:C26)-1)<>\"\",OFFSET(DE108_23B!$C$19,ROWS($C$19:C26)-1,COLUMNS($C$19:C26)-1),\"\")","v":"THU"},{"$f":"IF(OFFSET(DE108_23B!$D$19,ROWS($D$19:D26)-1,COLUMNS($D$19:D26)-1)<>\"\",OFFSET(DE108_23B!$D$19,ROWS($D$19:D26)-1,COLUMNS($D$19:D26)-1),\"\")","v":""},{"$f":"IF(OFFSET(DE108_23B!$E$19,ROWS($E$19:E26)-1,COLUMNS($E$19:E26)-1)<>\"\",OFFSET(DE108_23B!$E$19,ROWS($E$19:E26)-1,COLUMNS($E$19:E26)-1),\"\")","v":""},{"$f":"IF(OFFSET(DE108_23B!$F$19,ROWS($F$19:F26)-1,COLUMNS($F$19:F26)-1)<>\"\",OFFSET(DE108_23B!$F$19,ROWS($F$19:F26)-1,COLUMNS($F$19:F26)-1),\"\")","v":""},{"$f":"IF(OFFSET(DE108_23B!$G$19,ROWS($G$19:G26)-1,COLUMNS($G$19:G26)-1)<>\"\",OFFSET(DE108_23B!$G$19,ROWS($G$19:G26)-1,COLUMNS($G$19:G26)-1),\"\")","v":""},{"$f":"IF(OFFSET(DE108_23B!$H$19,ROWS($H$19:H26)-1,COLUMNS($H$19:H26)-1)<>\"\",OFFSET(DE108_23B!$H$19,ROWS($H$19:H26)-1,COLUMNS($H$19:H26)-1),\"\")","v":""},{"$f":"IF(OFFSET(DE108_23B!$I$19,ROWS($I$19:I26)-1,COLUMNS($I$19:I26)-1)<>\"\",OFFSET(DE108_23B!$I$19,ROWS($I$19:I26)-1,COLUMNS($I$19:I26)-1),\"\")","v":""},{"$f":"IF(OFFSET(DE108_23B!$J$19,ROWS($J$19:J26)-1,COLUMNS($J$19:J26)-1)<>\"\",OFFSET(DE108_23B!$J$19,ROWS($J$19:J26)-1,COLUMNS($J$19:J26)-1),\"\")","v":""},{"$f":"IF(OFFSET(DE108_23B!$K$19,ROWS($K$19:K26)-1,COLUMNS($K$19:K26)-1)<>\"\",OFFSET(DE108_23B!$K$19,ROWS($K$19:K26)-1,COLUMNS($K$19:K26)-1),\"\")","v":""},{"$f":"IF(OFFSET(DE108_23B!$L$19,ROWS($L$19:L26)-1,COLUMNS($L$19:L26)-1)<>\"\",OFFSET(DE108_23B!$L$19,ROWS($L$19:L26)-1,COLUMNS($L$19:L26)-1),\"\")","v":""},{"$f":"IF(OFFSET(DE108_23B!$M$19,ROWS($M$19:M26)-1,COLUMNS($M$19:M26)-1)<>\"\",OFFSET(DE108_23B!$M$19,ROWS($M$19:M26)-1,COLUMNS($M$19:M26)-1),\"\")","v":""},{"$f":"IF(OFFSET(DE108_23B!$N$19,ROWS($N$19:N26)-1,COLUMNS($N$19:N26)-1)<>\"\",OFFSET(DE108_23B!$N$19,ROWS($N$19:N26)-1,COLUMNS($N$19:N26)-1),\"\")","v":""},{"$f":"IF(OFFSET(DE108_23B!$O$19,ROWS($O$19:O26)-1,COLUMNS($O$19:O26)-1)<>\"\",OFFSET(DE108_23B!$O$19,ROWS($O$19:O26)-1,COLUMNS($O$19:O26)-1),\"\")","v":""},{"$f":"IF(OFFSET(DE108_23B!$P$19,ROWS($P$19:P26)-1,COLUMNS($P$19:P26)-1)<>\"\",OFFSET(DE108_23B!$P$19,ROWS($P$19:P26)-1,COLUMNS($P$19:P26)-1),\"\")","v":""},{"$f":"IF(OFFSET(DE108_23B!$Q$19,ROWS($Q$19:Q26)-1,COLUMNS($Q$19:Q26)-1)<>\"\",OFFSET(DE108_23B!$Q$19,ROWS($Q$19:Q26)-1,COLUMNS($Q$19:Q26)-1),\"\")","v":""},{"$f":"IF(OFFSET(DE108_23B!$R$19,ROWS($R$19:R26)-1,COLUMNS($R$19:R26)-1)<>\"\",OFFSET(DE108_23B!$R$19,ROWS($R$19:R26)-1,COLUMNS($R$19:R26)-1),\"\")","v":""},{"$f":"IF(OFFSET(DE108_23B!$S$19,ROWS($S$19:S26)-1,COLUMNS($S$19:S26)-1)<>\"\",OFFSET(DE108_23B!$S$19,ROWS($S$19:S26)-1,COLUMNS($S$19:S26)-1),\"\")","v":""},{"$f":"IF(OFFSET(DE108_23B!$T$19,ROWS($T$19:T26)-1,COLUMNS($T$19:T26)-1)<>\"\",OFFSET(DE108_23B!$T$19,ROWS($T$19:T26)-1,COLUMNS($T$19:T26)-1),\"\")","v":""},{"$f":"IF(OFFSET(DE108_23B!$U$19,ROWS($U$19:U26)-1,COLUMNS($U$19:U26)-1)<>\"\",OFFSET(DE108_23B!$U$19,ROWS($U$19:U26)-1,COLUMNS($U$19:U26)-1),\"\")","v":""},{"$f":"IF(OFFSET(DE108_23B!$V$19,ROWS($V$19:V26)-1,COLUMNS($V$19:V26)-1)<>\"\",OFFSET(DE108_23B!$V$19,ROWS($V$19:V26)-1,COLUMNS($V$19:V26)-1),\"\")","v":""},{"$f":"IF(OFFSET(DE108_23B!$W$19,ROWS($W$19:W26)-1,COLUMNS($W$19:W26)-1)<>\"\",OFFSET(DE108_23B!$W$19,ROWS($W$19:W26)-1,COLUMNS($W$19:W26)-1),\"\")","v":""},{"$f":"IF(OFFSET(DE108_23B!$X$19,ROWS($X$19:X26)-1,COLUMNS($X$19:X26)-1)<>\"\",OFFSET(DE108_23B!$X$19,ROWS($X$19:X26)-1,COLUMNS($X$19:X26)-1),\"\")","v":""},{"$f":"IF(OFFSET(DE108_23B!$Y$19,ROWS($Y$19:Y26)-1,COLUMNS($Y$19:Y26)-1)<>\"\",OFFSET(DE108_23B!$Y$19,ROWS($Y$19:Y26)-1,COLUMNS($Y$19:Y26)-1),\"\")","v":""},{"$f":"IF(OFFSET(DE108_23B!$Z$19,ROWS($Z$19:Z26)-1,COLUMNS($Z$19:Z26)-1)<>\"\",OFFSET(DE108_23B!$Z$19,ROWS($Z$19:Z26)-1,COLUMNS($Z$19:Z26)-1),\"\")","v":""},{"$f":"IF(OFFSET(DE108_23B!$AA$19,ROWS($AA$19:AA26)-1,COLUMNS($AA$19:AA26)-1)<>\"\",OFFSET(DE108_23B!$AA$19,ROWS($AA$19:AA26)-1,COLUMNS($AA$19:AA26)-1),\"\")","v":""},{"$f":"IF(OFFSET(DE108_23B!$AB$19,ROWS($AB$19:AB26)-1,COLUMNS($AB$19:AB26)-1)<>\"\",OFFSET(DE108_23B!$AB$19,ROWS($AB$19:AB26)-1,COLUMNS($AB$19:AB26)-1),\"\")","v":""},{"$f":"IF(OFFSET(DE108_23B!$AC$19,ROWS($AC$19:AC26)-1,COLUMNS($AC$19:AC26)-1)<>\"\",OFFSET(DE108_23B!$AC$19,ROWS($AC$19:AC26)-1,COLUMNS($AC$19:AC26)-1),\"\")","v":""},{"$f":"IF(OFFSET(DE108_23B!$AD$19,ROWS($AD$19:AD26)-1,COLUMNS($AD$19:AD26)-1)<>\"\",OFFSET(DE108_23B!$AD$19,ROWS($AD$19:AD26)-1,COLUMNS($AD$19:AD26)-1),\"\")","v":""},{"$f":"IF(OFFSET(DE108_23B!$AE$19,ROWS($AE$19:AE26)-1,COLUMNS($AE$19:AE26)-1)<>\"\",OFFSET(DE108_23B!$AE$19,ROWS($AE$19:AE26)-1,COLUMNS($AE$19:AE26)-1),\"\")","v":""},{"$f":"IF(OFFSET(DE108_23B!$AF$19,ROWS($AF$19:AF26)-1,COLUMNS($AF$19:AF26)-1)<>\"\",OFFSET(DE108_23B!$AF$19,ROWS($AF$19:AF26)-1,COLUMNS($AF$19:AF26)-1),\"\")","v":""},{"$f":"IF(OFFSET(DE108_23B!$AG$19,ROWS($AG$19:AG26)-1,COLUMNS($AG$19:AG26)-1)<>\"\",OFFSET(DE108_23B!$AG$19,ROWS($AG$19:AG26)-1,COLUMNS($AG$19:AG26)-1),\"\")","v":""},{"$f":"IF(OFFSET(DE108_23B!$AH$19,ROWS($AH$19:AH26)-1,COLUMNS($AH$19:AH26)-1)<>\"\",OFFSET(DE108_23B!$AH$19,ROWS($AH$19:AH26)-1,COLUMNS($AH$19:AH26)-1),\"\")","v":""},{"$f":"IF(OFFSET(DE108_23B!$AI$19,ROWS($AI$19:AI26)-1,COLUMNS($AI$19:AI26)-1)<>\"\",OFFSET(DE108_23B!$AI$19,ROWS($AI$19:AI26)-1,COLUMNS($AI$19:AI26)-1),\"\")","v":""},{"$f":"IF(OFFSET(DE108_23B!$AJ$19,ROWS($AJ$19:AJ26)-1,COLUMNS($AJ$19:AJ26)-1)<>\"\",OFFSET(DE108_23B!$AJ$19,ROWS($AJ$19:AJ26)-1,COLUMNS($AJ$19:AJ26)-1),\"\")","v":""},{"$f":"IF(OFFSET(DE108_23B!$AK$19,ROWS($AK$19:AK26)-1,COLUMNS($AK$19:AK26)-1)<>\"\",OFFSET(DE108_23B!$AK$19,ROWS($AK$19:AK26)-1,COLUMNS($AK$19:AK26)-1),\"\")","v":""},{"$f":"IF(OFFSET(DE108_23B!$AL$19,ROWS($AL$19:AL26)-1,COLUMNS($AL$19:AL26)-1)<>\"\",OFFSET(DE108_23B!$AL$19,ROWS($AL$19:AL26)-1,COLUMNS($AL$19:AL26)-1),\"\")","v":""},{"$f":"IF(OFFSET(DE108_23B!$AM$19,ROWS($AM$19:AM26)-1,COLUMNS($AM$19:AM26)-1)<>\"\",OFFSET(DE108_23B!$AM$19,ROWS($AM$19:AM26)-1,COLUMNS($AM$19:AM26)-1),\"\")","v":""},{"$f":"IF(OFFSET(DE108_23B!$AN$19,ROWS($AN$19:AN26)-1,COLUMNS($AN$19:AN26)-1)<>\"\",OFFSET(DE108_23B!$AN$19,ROWS($AN$19:AN26)-1,COLUMNS($AN$19:AN26)-1),\"\")","v":""},{"$f":"IF(OFFSET(DE108_23B!$AO$19,ROWS($AO$19:AO26)-1,COLUMNS($AO$19:AO26)-1)<>\"\",OFFSET(DE108_23B!$AO$19,ROWS($AO$19:AO26)-1,COLUMNS($AO$19:AO26)-1),\"\")","v":""},{"$f":"IF(OFFSET(DE108_23B!$AP$19,ROWS($AP$19:AP26)-1,COLUMNS($AP$19:AP26)-1)<>\"\",OFFSET(DE108_23B!$AP$19,ROWS($AP$19:AP26)-1,COLUMNS($AP$19:AP26)-1),\"\")","v":""},{"$f":"IF(OFFSET(DE108_23B!$AQ$19,ROWS($AQ$19:AQ26)-1,COLUMNS($AQ$19:AQ26)-1)<>\"\",OFFSET(DE108_23B!$AQ$19,ROWS($AQ$19:AQ26)-1,COLUMNS($AQ$19:AQ26)-1),\"\")","v":""},{"$f":"IF(OFFSET(DE108_23B!$AR$19,ROWS($AR$19:AR26)-1,COLUMNS($AR$19:AR26)-1)<>\"\",OFFSET(DE108_23B!$AR$19,ROWS($AR$19:AR26)-1,COLUMNS($AR$19:AR26)-1),\"\")","v":""},{"$f":"IF(OFFSET(DE108_23B!$AS$19,ROWS($AS$19:AS26)-1,COLUMNS($AS$19:AS26)-1)<>\"\",OFFSET(DE108_23B!$AS$19,ROWS($AS$19:AS26)-1,COLUMNS($AS$19:AS26)-1),\"\")","v":""},{"$f":"IF(OFFSET(DE108_23B!$AT$19,ROWS($AT$19:AT26)-1,COLUMNS($AT$19:AT26)-1)<>\"\",OFFSET(DE108_23B!$AT$19,ROWS($AT$19:AT26)-1,COLUMNS($AT$19:AT26)-1),\"\")","v":""},{"$f":"IF(OFFSET(DE108_23B!$AU$19,ROWS($AU$19:AU26)-1,COLUMNS($AU$19:AU26)-1)<>\"\",OFFSET(DE108_23B!$AU$19,ROWS($AU$19:AU26)-1,COLUMNS($AU$19:AU26)-1),\"\")","v":""},{"$f":"IF(OFFSET(DE108_23B!$AV$19,ROWS($AV$19:AV26)-1,COLUMNS($AV$19:AV26)-1)<>\"\",OFFSET(DE108_23B!$AV$19,ROWS($AV$19:AV26)-1,COLUMNS($AV$19:AV26)-1),\"\")","v":""},{"$f":"IF(OFFSET(DE108_23B!$AW$19,ROWS($AW$19:AW26)-1,COLUMNS($AW$19:AW26)-1)<>\"\",OFFSET(DE108_23B!$AW$19,ROWS($AW$19:AW26)-1,COLUMNS($AW$19:AW26)-1),\"\")","v":""},{"$f":"IF(OFFSET(DE108_23B!$AX$19,ROWS($AX$19:AX26)-1,COLUMNS($AX$19:AX26)-1)<>\"\",OFFSET(DE108_23B!$AX$19,ROWS($AX$19:AX26)-1,COLUMNS($AX$19:AX26)-1),\"\")","v":""},{"$f":"IF(OFFSET(DE108_23B!$AY$19,ROWS($AY$19:AY26)-1,COLUMNS($AY$19:AY26)-1)<>\"\",OFFSET(DE108_23B!$AY$19,ROWS($AY$19:AY26)-1,COLUMNS($AY$19:AY26)-1),\"\")","v":""}]
[{"$f":"IF(OFFSET(DE108_23B!$C$19,ROWS($C$19:C27)-1,COLUMNS($C$19:C27)-1)<>\"\",OFFSET(DE108_23B!$C$19,ROWS($C$19:C27)-1,COLUMNS($C$19:C27)-1),\"\")","v":"FRI"},{"$f":"IF(OFFSET(DE108_23B!$D$19,ROWS($D$19:D27)-1,COLUMNS($D$19:D27)-1)<>\"\",OFFSET(DE108_23B!$D$19,ROWS($D$19:D27)-1,COLUMNS($D$19:D27)-1),\"\")","v":""},{"$f":"IF(OFFSET(DE108_23B!$E$19,ROWS($E$19:E27)-1,COLUMNS($E$19:E27)-1)<>\"\",OFFSET(DE108_23B!$E$19,ROWS($E$19:E27)-1,COLUMNS($E$19:E27)-1),\"\")","v":""},{"$f":"IF(OFFSET(DE108_23B!$F$19,ROWS($F$19:F27)-1,COLUMNS($F$19:F27)-1)<>\"\",OFFSET(DE108_23B!$F$19,ROWS($F$19:F27)-1,COLUMNS($F$19:F27)-1),\"\")","v":""},{"$f":"IF(OFFSET(DE108_23B!$G$19,ROWS($G$19:G27)-1,COLUMNS($G$19:G27)-1)<>\"\",OFFSET(DE108_23B!$G$19,ROWS($G$19:G27)-1,COLUMNS($G$19:G27)-1),\"\")","v":""},{"$f":"IF(OFFSET(DE108_23B!$H$19,ROWS($H$19:H27)-1,COLUMNS($H$19:H27)-1)<>\"\",OFFSET(DE108_23B!$H$19,ROWS($H$19:H27)-1,COLUMNS($H$19:H27)-1),\"\")","v":""},{"$f":"IF(OFFSET(DE108_23B!$I$19,ROWS($I$19:I27)-1,COLUMNS($I$19:I27)-1)<>\"\",OFFSET(DE108_23B!$I$19,ROWS($I$19:I27)-1,COLUMNS($I$19:I27)-1),\"\")","v":""},{"$f":"IF(OFFSET(DE108_23B!$J$19,ROWS($J$19:J27)-1,COLUMNS($J$19:J27)-1)<>\"\",OFFSET(DE108_23B!$J$19,ROWS($J$19:J27)-1,COLUMNS($J$19:J27)-1),\"\")","v":""},{"$f":"IF(OFFSET(DE108_23B!$K$19,ROWS($K$19:K27)-1,COLUMNS($K$19:K27)-1)<>\"\",OFFSET(DE108_23B!$K$19,ROWS($K$19:K27)-1,COLUMNS($K$19:K27)-1),\"\")","v":""},{"$f":"IF(OFFSET(DE108_23B!$L$19,ROWS($L$19:L27)-1,COLUMNS($L$19:L27)-1)<>\"\",OFFSET(DE108_23B!$L$19,ROWS($L$19:L27)-1,COLUMNS($L$19:L27)-1),\"\")","v":""},{"$f":"IF(OFFSET(DE108_23B!$M$19,ROWS($M$19:M27)-1,COLUMNS($M$19:M27)-1)<>\"\",OFFSET(DE108_23B!$M$19,ROWS($M$19:M27)-1,COLUMNS($M$19:M27)-1),\"\")","v":""},{"$f":"IF(OFFSET(DE108_23B!$N$19,ROWS($N$19:N27)-1,COLUMNS($N$19:N27)-1)<>\"\",OFFSET(DE108_23B!$N$19,ROWS($N$19:N27)-1,COLUMNS($N$19:N27)-1),\"\")","v":""},{"$f":"IF(OFFSET(DE108_23B!$O$19,ROWS($O$19:O27)-1,COLUMNS($O$19:O27)-1)<>\"\",OFFSET(DE108_23B!$O$19,ROWS($O$19:O27)-1,COLUMNS($O$19:O27)-1),\"\")","v":""},{"$f":"IF(OFFSET(DE108_23B!$P$19,ROWS($P$19:P27)-1,COLUMNS($P$19:P27)-1)<>\"\",OFFSET(DE108_23B!$P$19,ROWS($P$19:P27)-1,COLUMNS($P$19:P27)-1),\"\")","v":""},{"$f":"IF(OFFSET(DE108_23B!$Q$19,ROWS($Q$19:Q27)-1,COLUMNS($Q$19:Q27)-1)<>\"\",OFFSET(DE108_23B!$Q$19,ROWS($Q$19:Q27)-1,COLUMNS($Q$19:Q27)-1),\"\")","v":""},{"$f":"IF(OFFSET(DE108_23B!$R$19,ROWS($R$19:R27)-1,COLUMNS($R$19:R27)-1)<>\"\",OFFSET(DE108_23B!$R$19,ROWS($R$19:R27)-1,COLUMNS($R$19:R27)-1),\"\")","v":""},{"$f":"IF(OFFSET(DE108_23B!$S$19,ROWS($S$19:S27)-1,COLUMNS($S$19:S27)-1)<>\"\",OFFSET(DE108_23B!$S$19,ROWS($S$19:S27)-1,COLUMNS($S$19:S27)-1),\"\")","v":""},{"$f":"IF(OFFSET(DE108_23B!$T$19,ROWS($T$19:T27)-1,COLUMNS($T$19:T27)-1)<>\"\",OFFSET(DE108_23B!$T$19,ROWS($T$19:T27)-1,COLUMNS($T$19:T27)-1),\"\")","v":""},{"$f":"IF(OFFSET(DE108_23B!$U$19,ROWS($U$19:U27)-1,COLUMNS($U$19:U27)-1)<>\"\",OFFSET(DE108_23B!$U$19,ROWS($U$19:U27)-1,COLUMNS($U$19:U27)-1),\"\")","v":""},{"$f":"IF(OFFSET(DE108_23B!$V$19,ROWS($V$19:V27)-1,COLUMNS($V$19:V27)-1)<>\"\",OFFSET(DE108_23B!$V$19,ROWS($V$19:V27)-1,COLUMNS($V$19:V27)-1),\"\")","v":""},{"$f":"IF(OFFSET(DE108_23B!$W$19,ROWS($W$19:W27)-1,COLUMNS($W$19:W27)-1)<>\"\",OFFSET(DE108_23B!$W$19,ROWS($W$19:W27)-1,COLUMNS($W$19:W27)-1),\"\")","v":""},{"$f":"IF(OFFSET(DE108_23B!$X$19,ROWS($X$19:X27)-1,COLUMNS($X$19:X27)-1)<>\"\",OFFSET(DE108_23B!$X$19,ROWS($X$19:X27)-1,COLUMNS($X$19:X27)-1),\"\")","v":""},{"$f":"IF(OFFSET(DE108_23B!$Y$19,ROWS($Y$19:Y27)-1,COLUMNS($Y$19:Y27)-1)<>\"\",OFFSET(DE108_23B!$Y$19,ROWS($Y$19:Y27)-1,COLUMNS($Y$19:Y27)-1),\"\")","v":""},{"$f":"IF(OFFSET(DE108_23B!$Z$19,ROWS($Z$19:Z27)-1,COLUMNS($Z$19:Z27)-1)<>\"\",OFFSET(DE108_23B!$Z$19,ROWS($Z$19:Z27)-1,COLUMNS($Z$19:Z27)-1),\"\")","v":""},{"$f":"IF(OFFSET(DE108_23B!$AA$19,ROWS($AA$19:AA27)-1,COLUMNS($AA$19:AA27)-1)<>\"\",OFFSET(DE108_23B!$AA$19,ROWS($AA$19:AA27)-1,COLUMNS($AA$19:AA27)-1),\"\")","v":""},{"$f":"IF(OFFSET(DE108_23B!$AB$19,ROWS($AB$19:AB27)-1,COLUMNS($AB$19:AB27)-1)<>\"\",OFFSET(DE108_23B!$AB$19,ROWS($AB$19:AB27)-1,COLUMNS($AB$19:AB27)-1),\"\")","v":""},{"$f":"IF(OFFSET(DE108_23B!$AC$19,ROWS($AC$19:AC27)-1,COLUMNS($AC$19:AC27)-1)<>\"\",OFFSET(DE108_23B!$AC$19,ROWS($AC$19:AC27)-1,COLUMNS($AC$19:AC27)-1),\"\")","v":""},{"$f":"IF(OFFSET(DE108_23B!$AD$19,ROWS($AD$19:AD27)-1,COLUMNS($AD$19:AD27)-1)<>\"\",OFFSET(DE108_23B!$AD$19,ROWS($AD$19:AD27)-1,COLUMNS($AD$19:AD27)-1),\"\")","v":""},{"$f":"IF(OFFSET(DE108_23B!$AE$19,ROWS($AE$19:AE27)-1,COLUMNS($AE$19:AE27)-1)<>\"\",OFFSET(DE108_23B!$AE$19,ROWS($AE$19:AE27)-1,COLUMNS($AE$19:AE27)-1),\"\")","v":""},{"$f":"IF(OFFSET(DE108_23B!$AF$19,ROWS($AF$19:AF27)-1,COLUMNS($AF$19:AF27)-1)<>\"\",OFFSET(DE108_23B!$AF$19,ROWS($AF$19:AF27)-1,COLUMNS($AF$19:AF27)-1),\"\")","v":""},{"$f":"IF(OFFSET(DE108_23B!$AG$19,ROWS($AG$19:AG27)-1,COLUMNS($AG$19:AG27)-1)<>\"\",OFFSET(DE108_23B!$AG$19,ROWS($AG$19:AG27)-1,COLUMNS($AG$19:AG27)-1),\"\")","v":""},{"$f":"IF(OFFSET(DE108_23B!$AH$19,ROWS($AH$19:AH27)-1,COLUMNS($AH$19:AH27)-1)<>\"\",OFFSET(DE108_23B!$AH$19,ROWS($AH$19:AH27)-1,COLUMNS($AH$19:AH27)-1),\"\")","v":""},{"$f":"IF(OFFSET(DE108_23B!$AI$19,ROWS($AI$19:AI27)-1,COLUMNS($AI$19:AI27)-1)<>\"\",OFFSET(DE108_23B!$AI$19,ROWS($AI$19:AI27)-1,COLUMNS($AI$19:AI27)-1),\"\")","v":""},{"$f":"IF(OFFSET(DE108_23B!$AJ$19,ROWS($AJ$19:AJ27)-1,COLUMNS($AJ$19:AJ27)-1)<>\"\",OFFSET(DE108_23B!$AJ$19,ROWS($AJ$19:AJ27)-1,COLUMNS($AJ$19:AJ27)-1),\"\")","v":""},{"$f":"IF(OFFSET(DE108_23B!$AK$19,ROWS($AK$19:AK27)-1,COLUMNS($AK$19:AK27)-1)<>\"\",OFFSET(DE108_23B!$AK$19,ROWS($AK$19:AK27)-1,COLUMNS($AK$19:AK27)-1),\"\")","v":""},{"$f":"IF(OFFSET(DE108_23B!$AL$19,ROWS($AL$19:AL27)-1,COLUMNS($AL$19:AL27)-1)<>\"\",OFFSET(DE108_23B!$AL$19,ROWS($AL$19:AL27)-1,COLUMNS($AL$19:AL27)-1),\"\")","v":""},{"$f":"IF(OFFSET(DE108_23B!$AM$19,ROWS($AM$19:AM27)-1,COLUMNS($AM$19:AM27)-1)<>\"\",OFFSET(DE108_23B!$AM$19,ROWS($AM$19:AM27)-1,COLUMNS($AM$19:AM27)-1),\"\")","v":""},{"$f":"IF(OFFSET(DE108_23B!$AN$19,ROWS($AN$19:AN27)-1,COLUMNS($AN$19:AN27)-1)<>\"\",OFFSET(DE108_23B!$AN$19,ROWS($AN$19:AN27)-1,COLUMNS($AN$19:AN27)-1),\"\")","v":""},{"$f":"IF(OFFSET(DE108_23B!$AO$19,ROWS($AO$19:AO27)-1,COLUMNS($AO$19:AO27)-1)<>\"\",OFFSET(DE108_23B!$AO$19,ROWS($AO$19:AO27)-1,COLUMNS($AO$19:AO27)-1),\"\")","v":""},{"$f":"IF(OFFSET(DE108_23B!$AP$19,ROWS($AP$19:AP27)-1,COLUMNS($AP$19:AP27)-1)<>\"\",OFFSET(DE108_23B!$AP$19,ROWS($AP$19:AP27)-1,COLUMNS($AP$19:AP27)-1),\"\")","v":""},{"$f":"IF(OFFSET(DE108_23B!$AQ$19,ROWS($AQ$19:AQ27)-1,COLUMNS($AQ$19:AQ27)-1)<>\"\",OFFSET(DE108_23B!$AQ$19,ROWS($AQ$19:AQ27)-1,COLUMNS($AQ$19:AQ27)-1),\"\")","v":""},{"$f":"IF(OFFSET(DE108_23B!$AR$19,ROWS($AR$19:AR27)-1,COLUMNS($AR$19:AR27)-1)<>\"\",OFFSET(DE108_23B!$AR$19,ROWS($AR$19:AR27)-1,COLUMNS($AR$19:AR27)-1),\"\")","v":""},{"$f":"IF(OFFSET(DE108_23B!$AS$19,ROWS($AS$19:AS27)-1,COLUMNS($AS$19:AS27)-1)<>\"\",OFFSET(DE108_23B!$AS$19,ROWS($AS$19:AS27)-1,COLUMNS($AS$19:AS27)-1),\"\")","v":""},{"$f":"IF(OFFSET(DE108_23B!$AT$19,ROWS($AT$19:AT27)-1,COLUMNS($AT$19:AT27)-1)<>\"\",OFFSET(DE108_23B!$AT$19,ROWS($AT$19:AT27)-1,COLUMNS($AT$19:AT27)-1),\"\")","v":""},{"$f":"IF(OFFSET(DE108_23B!$AU$19,ROWS($AU$19:AU27)-1,COLUMNS($AU$19:AU27)-1)<>\"\",OFFSET(DE108_23B!$AU$19,ROWS($AU$19:AU27)-1,COLUMNS($AU$19:AU27)-1),\"\")","v":""},{"$f":"IF(OFFSET(DE108_23B!$AV$19,ROWS($AV$19:AV27)-1,COLUMNS($AV$19:AV27)-1)<>\"\",OFFSET(DE108_23B!$AV$19,ROWS($AV$19:AV27)-1,COLUMNS($AV$19:AV27)-1),\"\")","v":""},{"$f":"IF(OFFSET(DE108_23B!$AW$19,ROWS($AW$19:AW27)-1,COLUMNS($AW$19:AW27)-1)<>\"\",OFFSET(DE108_23B!$AW$19,ROWS($AW$19:AW27)-1,COLUMNS($AW$19:AW27)-1),\"\")","v":""},{"$f":"IF(OFFSET(DE108_23B!$AX$19,ROWS($AX$19:AX27)-1,COLUMNS($AX$19:AX27)-1)<>\"\",OFFSET(DE108_23B!$AX$19,ROWS($AX$19:AX27)-1,COLUMNS($AX$19:AX27)-1),\"\")","v":""},{"$f":"IF(OFFSET(DE108_23B!$AY$19,ROWS($AY$19:AY27)-1,COLUMNS($AY$19:AY27)-1)<>\"\",OFFSET(DE108_23B!$AY$19,ROWS($AY$19:AY27)-1,COLUMNS($AY$19:AY27)-1),\"\")","v":""}]
[{"$f":"IF(OFFSET(DE108_23B!$C$19,ROWS($C$19:C28)-1,COLUMNS($C$19:C28)-1)<>\"\",OFFSET(DE108_23B!$C$19,ROWS($C$19:C28)-1,COLUMNS($C$19:C28)-1),\"\")","v":"SAT"},{"$f":"IF(OFFSET(DE108_23B!$D$19,ROWS($D$19:D28)-1,COLUMNS($D$19:D28)-1)<>\"\",OFFSET(DE108_23B!$D$19,ROWS($D$19:D28)-1,COLUMNS($D$19:D28)-1),\"\")","v":""},{"$f":"IF(OFFSET(DE108_23B!$E$19,ROWS($E$19:E28)-1,COLUMNS($E$19:E28)-1)<>\"\",OFFSET(DE108_23B!$E$19,ROWS($E$19:E28)-1,COLUMNS($E$19:E28)-1),\"\")","v":""},{"$f":"IF(OFFSET(DE108_23B!$F$19,ROWS($F$19:F28)-1,COLUMNS($F$19:F28)-1)<>\"\",OFFSET(DE108_23B!$F$19,ROWS($F$19:F28)-1,COLUMNS($F$19:F28)-1),\"\")","v":""},{"$f":"IF(OFFSET(DE108_23B!$G$19,ROWS($G$19:G28)-1,COLUMNS($G$19:G28)-1)<>\"\",OFFSET(DE108_23B!$G$19,ROWS($G$19:G28)-1,COLUMNS($G$19:G28)-1),\"\")","v":""},{"$f":"IF(OFFSET(DE108_23B!$H$19,ROWS($H$19:H28)-1,COLUMNS($H$19:H28)-1)<>\"\",OFFSET(DE108_23B!$H$19,ROWS($H$19:H28)-1,COLUMNS($H$19:H28)-1),\"\")","v":""},{"$f":"IF(OFFSET(DE108_23B!$I$19,ROWS($I$19:I28)-1,COLUMNS($I$19:I28)-1)<>\"\",OFFSET(DE108_23B!$I$19,ROWS($I$19:I28)-1,COLUMNS($I$19:I28)-1),\"\")","v":""},{"$f":"IF(OFFSET(DE108_23B!$J$19,ROWS($J$19:J28)-1,COLUMNS($J$19:J28)-1)<>\"\",OFFSET(DE108_23B!$J$19,ROWS($J$19:J28)-1,COLUMNS($J$19:J28)-1),\"\")","v":""},{"$f":"IF(OFFSET(DE108_23B!$K$19,ROWS($K$19:K28)-1,COLUMNS($K$19:K28)-1)<>\"\",OFFSET(DE108_23B!$K$19,ROWS($K$19:K28)-1,COLUMNS($K$19:K28)-1),\"\")","v":""},{"$f":"IF(OFFSET(DE108_23B!$L$19,ROWS($L$19:L28)-1,COLUMNS($L$19:L28)-1)<>\"\",OFFSET(DE108_23B!$L$19,ROWS($L$19:L28)-1,COLUMNS($L$19:L28)-1),\"\")","v":""},{"$f":"IF(OFFSET(DE108_23B!$M$19,ROWS($M$19:M28)-1,COLUMNS($M$19:M28)-1)<>\"\",OFFSET(DE108_23B!$M$19,ROWS($M$19:M28)-1,COLUMNS($M$19:M28)-1),\"\")","v":""},{"$f":"IF(OFFSET(DE108_23B!$N$19,ROWS($N$19:N28)-1,COLUMNS($N$19:N28)-1)<>\"\",OFFSET(DE108_23B!$N$19,ROWS($N$19:N28)-1,COLUMNS($N$19:N28)-1),\"\")","v":""},{"$f":"IF(OFFSET(DE108_23B!$O$19,ROWS($O$19:O28)-1,COLUMNS($O$19:O28)-1)<>\"\",OFFSET(DE108_23B!$O$19,ROWS($O$19:O28)-1,COLUMNS($O$19:O28)-1),\"\")","v":""},{"$f":"IF(OFFSET(DE108_23B!$P$19,ROWS($P$19:P28)-1,COLUMNS($P$19:P28)-1)<>\"\",OFFSET(DE108_23B!$P$19,ROWS($P$19:P28)-1,COLUMNS($P$19:P28)-1),\"\")","v":""},{"$f":"IF(OFFSET(DE108_23B!$Q$19,ROWS($Q$19:Q28)-1,COLUMNS($Q$19:Q28)-1)<>\"\",OFFSET(DE108_23B!$Q$19,ROWS($Q$19:Q28)-1,COLUMNS($Q$19:Q28)-1),\"\")","v":""},{"$f":"IF(OFFSET(DE108_23B!$R$19,ROWS($R$19:R28)-1,COLUMNS($R$19:R28)-1)<>\"\",OFFSET(DE108_23B!$R$19,ROWS($R$19:R28)-1,COLUMNS($R$19:R28)-1),\"\")","v":""},{"$f":"IF(OFFSET(DE108_23B!$S$19,ROWS($S$19:S28)-1,COLUMNS($S$19:S28)-1)<>\"\",OFFSET(DE108_23B!$S$19,ROWS($S$19:S28)-1,COLUMNS($S$19:S28)-1),\"\")","v":""},{"$f":"IF(OFFSET(DE108_23B!$T$19,ROWS($T$19:T28)-1,COLUMNS($T$19:T28)-1)<>\"\",OFFSET(DE108_23B!$T$19,ROWS($T$19:T28)-1,COLUMNS($T$19:T28)-1),\"\")","v":""},{"$f":"IF(OFFSET(DE108_23B!$U$19,ROWS($U$19:U28)-1,COLUMNS($U$19:U28)-1)<>\"\",OFFSET(DE108_23B!$U$19,ROWS($U$19:U28)-1,COLUMNS($U$19:U28)-1),\"\")","v":""},{"$f":"IF(OFFSET(DE108_23B!$V$19,ROWS($V$19:V28)-1,COLUMNS($V$19:V28)-1)<>\"\",OFFSET(DE108_23B!$V$19,ROWS($V$19:V28)-1,COLUMNS($V$19:V28)-1),\"\")","v":""},{"$f":"IF(OFFSET(DE108_23B!$W$19,ROWS($W$19:W28)-1,COLUMNS($W$19:W28)-1)<>\"\",OFFSET(DE108_23B!$W$19,ROWS($W$19:W28)-1,COLUMNS($W$19:W28)-1),\"\")","v":""},{"$f":"IF(OFFSET(DE108_23B!$X$19,ROWS($X$19:X28)-1,COLUMNS($X$19:X28)-1)<>\"\",OFFSET(DE108_23B!$X$19,ROWS($X$19:X28)-1,COLUMNS($X$19:X28)-1),\"\")","v":""},{"$f":"IF(OFFSET(DE108_23B!$Y$19,ROWS($Y$19:Y28)-1,COLUMNS($Y$19:Y28)-1)<>\"\",OFFSET(DE108_23B!$Y$19,ROWS($Y$19:Y28)-1,COLUMNS($Y$19:Y28)-1),\"\")","v":""},{"$f":"IF(OFFSET(DE108_23B!$Z$19,ROWS($Z$19:Z28)-1,COLUMNS($Z$19:Z28)-1)<>\"\",OFFSET(DE108_23B!$Z$19,ROWS($Z$19:Z28)-1,COLUMNS($Z$19:Z28)-1),\"\")","v":""},{"$f":"IF(OFFSET(DE108_23B!$AA$19,ROWS($AA$19:AA28)-1,COLUMNS($AA$19:AA28)-1)<>\"\",OFFSET(DE108_23B!$AA$19,ROWS($AA$19:AA28)-1,COLUMNS($AA$19:AA28)-1),\"\")","v":""},{"$f":"IF(OFFSET(DE108_23B!$AB$19,ROWS($AB$19:AB28)-1,COLUMNS($AB$19:AB28)-1)<>\"\",OFFSET(DE108_23B!$AB$19,ROWS($AB$19:AB28)-1,COLUMNS($AB$19:AB28)-1),\"\")","v":""},{"$f":"IF(OFFSET(DE108_23B!$AC$19,ROWS($AC$19:AC28)-1,COLUMNS($AC$19:AC28)-1)<>\"\",OFFSET(DE108_23B!$AC$19,ROWS($AC$19:AC28)-1,COLUMNS($AC$19:AC28)-1),\"\")","v":""},{"$f":"IF(OFFSET(DE108_23B!$AD$19,ROWS($AD$19:AD28)-1,COLUMNS($AD$19:AD28)-1)<>\"\",OFFSET(DE108_23B!$AD$19,ROWS($AD$19:AD28)-1,COLUMNS($AD$19:AD28)-1),\"\")","v":""},{"$f":"IF(OFFSET(DE108_23B!$AE$19,ROWS($AE$19:AE28)-1,COLUMNS($AE$19:AE28)-1)<>\"\",OFFSET(DE108_23B!$AE$19,ROWS($AE$19:AE28)-1,COLUMNS($AE$19:AE28)-1),\"\")","v":""},{"$f":"IF(OFFSET(DE108_23B!$AF$19,ROWS($AF$19:AF28)-1,COLUMNS($AF$19:AF28)-1)<>\"\",OFFSET(DE108_23B!$AF$19,ROWS($AF$19:AF28)-1,COLUMNS($AF$19:AF28)-1),\"\")","v":""},{"$f":"IF(OFFSET(DE108_23B!$AG$19,ROWS($AG$19:AG28)-1,COLUMNS($AG$19:AG28)-1)<>\"\",OFFSET(DE108_23B!$AG$19,ROWS($AG$19:AG28)-1,COLUMNS($AG$19:AG28)-1),\"\")","v":""},{"$f":"IF(OFFSET(DE108_23B!$AH$19,ROWS($AH$19:AH28)-1,COLUMNS($AH$19:AH28)-1)<>\"\",OFFSET(DE108_23B!$AH$19,ROWS($AH$19:AH28)-1,COLUMNS($AH$19:AH28)-1),\"\")","v":""},{"$f":"IF(OFFSET(DE108_23B!$AI$19,ROWS($AI$19:AI28)-1,COLUMNS($AI$19:AI28)-1)<>\"\",OFFSET(DE108_23B!$AI$19,ROWS($AI$19:AI28)-1,COLUMNS($AI$19:AI28)-1),\"\")","v":""},{"$f":"IF(OFFSET(DE108_23B!$AJ$19,ROWS($AJ$19:AJ28)-1,COLUMNS($AJ$19:AJ28)-1)<>\"\",OFFSET(DE108_23B!$AJ$19,ROWS($AJ$19:AJ28)-1,COLUMNS($AJ$19:AJ28)-1),\"\")","v":""},{"$f":"IF(OFFSET(DE108_23B!$AK$19,ROWS($AK$19:AK28)-1,COLUMNS($AK$19:AK28)-1)<>\"\",OFFSET(DE108_23B!$AK$19,ROWS($AK$19:AK28)-1,COLUMNS($AK$19:AK28)-1),\"\")","v":""},{"$f":"IF(OFFSET(DE108_23B!$AL$19,ROWS($AL$19:AL28)-1,COLUMNS($AL$19:AL28)-1)<>\"\",OFFSET(DE108_23B!$AL$19,ROWS($AL$19:AL28)-1,COLUMNS($AL$19:AL28)-1),\"\")","v":""},{"$f":"IF(OFFSET(DE108_23B!$AM$19,ROWS($AM$19:AM28)-1,COLUMNS($AM$19:AM28)-1)<>\"\",OFFSET(DE108_23B!$AM$19,ROWS($AM$19:AM28)-1,COLUMNS($AM$19:AM28)-1),\"\")","v":""},{"$f":"IF(OFFSET(DE108_23B!$AN$19,ROWS($AN$19:AN28)-1,COLUMNS($AN$19:AN28)-1)<>\"\",OFFSET(DE108_23B!$AN$19,ROWS($AN$19:AN28)-1,COLUMNS($AN$19:AN28)-1),\"\")","v":""},{"$f":"IF(OFFSET(DE108_23B!$AO$19,ROWS($AO$19:AO28)-1,COLUMNS($AO$19:AO28)-1)<>\"\",OFFSET(DE108_23B!$AO$19,ROWS($AO$19:AO28)-1,COLUMNS($AO$19:AO28)-1),\"\")","v":""},{"$f":"IF(OFFSET(DE108_23B!$AP$19,ROWS($AP$19:AP28)-1,COLUMNS($AP$19:AP28)-1)<>\"\",OFFSET(DE108_23B!$AP$19,ROWS($AP$19:AP28)-1,COLUMNS($AP$19:AP28)-1),\"\")","v":""},{"$f":"IF(OFFSET(DE108_23B!$AQ$19,ROWS($AQ$19:AQ28)-1,COLUMNS($AQ$19:AQ28)-1)<>\"\",OFFSET(DE108_23B!$AQ$19,ROWS($AQ$19:AQ28)-1,COLUMNS($AQ$19:AQ28)-1),\"\")","v":""},{"$f":"IF(OFFSET(DE108_23B!$AR$19,ROWS($AR$19:AR28)-1,COLUMNS($AR$19:AR28)-1)<>\"\",OFFSET(DE108_23B!$AR$19,ROWS($AR$19:AR28)-1,COLUMNS($AR$19:AR28)-1),\"\")","v":""},{"$f":"IF(OFFSET(DE108_23B!$AS$19,ROWS($AS$19:AS28)-1,COLUMNS($AS$19:AS28)-1)<>\"\",OFFSET(DE108_23B!$AS$19,ROWS($AS$19:AS28)-1,COLUMNS($AS$19:AS28)-1),\"\")","v":""},{"$f":"IF(OFFSET(DE108_23B!$AT$19,ROWS($AT$19:AT28)-1,COLUMNS($AT$19:AT28)-1)<>\"\",OFFSET(DE108_23B!$AT$19,ROWS($AT$19:AT28)-1,COLUMNS($AT$19:AT28)-1),\"\")","v":""},{"$f":"IF(OFFSET(DE108_23B!$AU$19,ROWS($AU$19:AU28)-1,COLUMNS($AU$19:AU28)-1)<>\"\",OFFSET(DE108_23B!$AU$19,ROWS($AU$19:AU28)-1,COLUMNS($AU$19:AU28)-1),\"\")","v":""},{"$f":"IF(OFFSET(DE108_23B!$AV$19,ROWS($AV$19:AV28)-1,COLUMNS($AV$19:AV28)-1)<>\"\",OFFSET(DE108_23B!$AV$19,ROWS($AV$19:AV28)-1,COLUMNS($AV$19:AV28)-1),\"\")","v":""},{"$f":"IF(OFFSET(DE108_23B!$AW$19,ROWS($AW$19:AW28)-1,COLUMNS($AW$19:AW28)-1)<>\"\",OFFSET(DE108_23B!$AW$19,ROWS($AW$19:AW28)-1,COLUMNS($AW$19:AW28)-1),\"\")","v":""},{"$f":"IF(OFFSET(DE108_23B!$AX$19,ROWS($AX$19:AX28)-1,COLUMNS($AX$19:AX28)-1)<>\"\",OFFSET(DE108_23B!$AX$19,ROWS($AX$19:AX28)-1,COLUMNS($AX$19:AX28)-1),\"\")","v":""},{"$f":"IF(OFFSET(DE108_23B!$AY$19,ROWS($AY$19:AY28)-1,COLUMNS($AY$19:AY28)-1)<>\"\",OFFSET(DE108_23B!$AY$19,ROWS($AY$19:AY28)-1,COLUMNS($AY$19:AY28)-1),\"\")","v":""}]
[{"$f":"IF(OFFSET(DE108_23B!$C$19,ROWS($C$19:C29)-1,COLUMNS($C$19:C29)-1)<>\"\",OFFSET(DE108_23B!$C$19,ROWS($C$19:C29)-1,COLUMNS($C$19:C29)-1),\"\")","v":""}]

{"sheet":"108_25","index":9,"n_rows":30,"n_cols":13,"rows_kept":30,"cut":false,"hidden":false,"merged":[[5,12,8,12],[0,0,0,12],[1,0,1,12],[2,0,4,12],[5,0,8,0],[5,1,8,1],[5,2,8,2],[5,3,8,3],[5,4,8,4],[5,5,8,5],[5,6,8,6],[5,7,8,7],[5,8,8,8],[5,9,8,9],[5,10,8,10],[5,11,8,11]]}
["108-25"]
["2014-10-21"]
["511 TRAVEL RESTRICTIONS"]
[]
[]
["Route","Direction","County","Location Description","Feature Crossed","Object Type","Maint. Bridge No.,\nStructure ID,\nor FHWA No.","Type of Restriction","Existing Measurement","Construction Measurement","Construction\nMeasurement\nas Signed","Projected\nAs Built\nMeasurement","Remarks"]
[]
[]
[]
[{"$f":"IF(OFFSET(DE108_25!$C$23,ROWS($C$23:C23)-1,COLUMNS($C$23:C23)-1)<>\"\",OFFSET(DE108_25!$C$23,ROWS($C$23:C23)-1,COLUMNS($C$23:C23)-1),\"\")","v":""},{"$f":"IF(OFFSET(DE108_25!$D$23,ROWS($D$23:D23)-1,COLUMNS($D$23:D23)-1)<>\"\",OFFSET(DE108_25!$D$23,ROWS($D$23:D23)-1,COLUMNS($D$23:D23)-1),\"\")","v":""},{"$f":"IF(OFFSET(DE108_25!$E$23,ROWS($E$23:E23)-1,COLUMNS($E$23:E23)-1)<>\"\",OFFSET(DE108_25!$E$23,ROWS($E$23:E23)-1,COLUMNS($E$23:E23)-1),\"\")","v":""},{"$f":"IF(OFFSET(DE108_25!$F$23,ROWS($F$23:F23)-1,COLUMNS($F$23:F23)-1)<>\"\",OFFSET(DE108_25!$F$23,ROWS($F$23:F23)-1,COLUMNS($F$23:F23)-1),\"\")","v":""},{"$f":"IF(OFFSET(DE108_25!$G$23,ROWS($G$23:G23)-1,COLUMNS($G$23:G23)-1)<>\"\",OFFSET(DE108_25!$G$23,ROWS($G$23:G23)-1,COLUMNS($G$23:G23)-1),\"\")","v":""},{"$f":"IF(OFFSET(DE108_25!$H$23,ROWS($H$23:H23)-1,COLUMNS($H$23:H23)-1)<>\"\",OFFSET(DE108_25!$H$23,ROWS($H$23:H23)-1,COLUMNS($H$23:H23)-1),\"\")","v":""},{"$f":"IF(OFFSET(DE108_25!$I$23,ROWS($I$23:I23)-1,COLUMNS($I$23:I23)-1)<>\"\",OFFSET(DE108_25!$I$23,ROWS($I$23:I23)-1,COLUMNS($I$23:I23)-1),\"\")","v":""},{"$f":"IF(OFFSET(DE108_25!$J$23,ROWS($J$23:J23)-1,COLUMNS($J$23:J23)-1)<>\"\",OFFSET(DE108_25!$J$23,ROWS($J$23:J23)-1,COLUMNS($J$23:J23)-1),\"\")","v":""},{"$f":"IF(OFFSET(DE108_25!$K$23,ROWS($K$23:K23)-1,COLUMNS($K$23:K23)-1)<>\"\",OFFSET(DE108_25!$K$23,ROWS($K$23:K23)-1,COLUMNS($K$23:K23)-1),\"\")","v":""},{"$f":"IF(OFFSET(DE108_25!$L$23,ROWS($L$23:L23)-1,COLUMNS($L$23:L23)-1)<>\"\",OFFSET(DE108_25!$L$23,ROWS($L$23:L23)-1,COLUMNS($L$23:L23)-1),\"\")","v":""},{"$f":"IF(OFFSET(DE108_25!$M$23,ROWS($M$23:M23)-1,COLUMNS($M$23:M23)-1)<>\"\",OFFSET(DE108_25!$M$23,ROWS($M$23:M23)-1,COLUMNS($M$23:M23)-1),\"\")","v":""},{"$f":"IF(OFFSET(DE108_25!$N$23,ROWS($N$23:N23)-1,COLUMNS($N$23:N23)-1)<>\"\",OFFSET(DE108_25!$N$23,ROWS($N$23:N23)-1,COLUMNS($N$23:N23)-1),\"\")","v":""},{"$f":"IF(OFFSET(DE108_25!$O$23,ROWS($O$23:O23)-1,COLUMNS($O$23:O23)-1)<>\"\",OFFSET(DE108_25!$O$23,ROWS($O$23:O23)-1,COLUMNS($O$23:O23)-1),\"\")","v":""}]
[{"$f":"IF(OFFSET(DE108_25!$C$23,ROWS($C$23:C24)-1,COLUMNS($C$23:C24)-1)<>\"\",OFFSET(DE108_25!$C$23,ROWS($C$23:C24)-1,COLUMNS($C$23:C24)-1),\"\")","v":""},{"$f":"IF(OFFSET(DE108_25!$D$23,ROWS($D$23:D24)-1,COLUMNS($D$23:D24)-1)<>\"\",OFFSET(DE108_25!$D$23,ROWS($D$23:D24)-1,COLUMNS($D$23:D24)-1),\"\")","v":""},{"$f":"IF(OFFSET(DE108_25!$E$23,ROWS($E$23:E24)-1,COLUMNS($E$23:E24)-1)<>\"\",OFFSET(DE108_25!$E$23,ROWS($E$23:E24)-1,COLUMNS($E$23:E24)-1),\"\")","v":""},{"$f":"IF(OFFSET(DE108_25!$F$23,ROWS($F$23:F24)-1,COLUMNS($F$23:F24)-1)<>\"\",OFFSET(DE108_25!$F$23,ROWS($F$23:F24)-1,COLUMNS($F$23:F24)-1),\"\")","v":"No Restrictions Expected"},{"$f":"IF(OFFSET(DE108_25!$G$23,ROWS($G$23:G24)-1,COLUMNS($G$23:G24)-1)<>\"\",OFFSET(DE108_25!$G$23,ROWS($G$23:G24)-1,COLUMNS($G$23:G24)-1),\"\")","v":""},{"$f":"IF(OFFSET(DE108_25!$H$23,ROWS($H$23:H24)-1,COLUMNS($H$23:H24)-1)<>\"\",OFFSET(DE108_25!$H$23,ROWS($H$23:H24)-1,COLUMNS($H$23:H24)-1),\"\")","v":""},{"$f":"IF(OFFSET(DE108_25!$I$23,ROWS($I$23:I24)-1,COLUMNS($I$23:I24)-1)<>\"\",OFFSET(DE108_25!$I$23,ROWS($I$23:I24)-1,COLUMNS($I$23:I24)-1),\"\")","v":""},{"$f":"IF(OFFSET(DE108_25!$J$23,ROWS($J$23:J24)-1,COLUMNS($J$23:J24)-1)<>\"\",OFFSET(DE108_25!$J$23,ROWS($J$23:J24)-1,COLUMNS($J$23:J24)-1),\"\")","v":""},{"$f":"IF(OFFSET(DE108_25!$K$23,ROWS($K$23:K24)-1,COLUMNS($K$23:K24)-1)<>\"\",OFFSET(DE108_25!$K$23,ROWS($K$23:K24)-1,COLUMNS($K$23:K24)-1),\"\")","v":""},{"$f":"IF(OFFSET(DE108_25!$L$23,ROWS($L$23:L24)-1,COLUMNS($L$23:L24)-1)<>\"\",OFFSET(DE108_25!$L$23,ROWS($L$23:L24)-1,COLUMNS($L$23:L24)-1),\"\")","v":""},{"$f":"IF(OFFSET(DE108_25!$M$23,ROWS($M$23:M24)-1,COLUMNS($M$23:M24)-1)<>\"\",OFFSET(DE108_25!$M$23,ROWS($M$23:M24)-1,COLUMNS($M$23:M24)-1),\"\")","v":""},{"$f":"IF(OFFSET(DE108_25!$N$23,ROWS($N$23:N24)-1,COLUMNS($N$23:N24)-1)<>\"\",OFFSET(DE108_25!$N$23,ROWS($N$23:N24)-1,COLUMNS($N$23:N24)-1),\"\")","v":""},{"$f":"IF(OFFSET(DE108_25!$O$23,ROWS($O$23:O24)-1,COLUMNS($O$23:O24)-1)<>\"\",OFFSET(DE108_25!$O$23,ROWS($O$23:O24)-1,COLUMNS($O$23:O24)-1),\"\")","v":""}]
[{"$f":"IF(OFFSET(DE108_25!$C$23,ROWS($C$23:C25)-1,COLUMNS($C$23:C25)-1)<>\"\",OFFSET(DE108_25!$C$23,ROWS($C$23:C25)-1,COLUMNS($C$23:C25)-1),\"\")","v":""},{"$f":"IF(OFFSET(DE108_25!$D$23,ROWS($D$23:D25)-1,COLUMNS($D$23:D25)-1)<>\"\",OFFSET(DE108_25!$D$23,ROWS($D$23:D25)-1,COLUMNS($D$23:D25)-1),\"\")","v":""},{"$f":"IF(OFFSET(DE108_25!$E$23,ROWS($E$23:E25)-1,COLUMNS($E$23:E25)-1)<>\"\",OFFSET(DE108_25!$E$23,ROWS($E$23:E25)-1,COLUMNS($E$23:E25)-1),\"\")","v":""},{"$f":"IF(OFFSET(DE108_25!$F$23,ROWS($F$23:F25)-1,COLUMNS($F$23:F25)-1)<>\"\",OFFSET(DE108_25!$F$23,ROWS($F$23:F25)-1,COLUMNS($F$23:F25)-1),\"\")","v":""},{"$f":"IF(OFFSET(DE108_25!$G$23,ROWS($G$23:G25)-1,COLUMNS($G$23:G25)-1)<>\"\",OFFSET(DE108_25!$G$23,ROWS($G$23:G25)-1,COLUMNS($G$23:G25)-1),\"\")","v":""},{"$f":"IF(OFFSET(DE108_25!$H$23,ROWS($H$23:H25)-1,COLUMNS($H$23:H25)-1)<>\"\",OFFSET(DE108_25!$H$23,ROWS($H$23:H25)-1,COLUMNS($H$23:H25)-1),\"\")","v":""},{"$f":"IF(OFFSET(DE108_25!$I$23,ROWS($I$23:I25)-1,COLUMNS($I$23:I25)-1)<>\"\",OFFSET(DE108_25!$I$23,ROWS($I$23:I25)-1,COLUMNS($I$23:I25)-1),\"\")","v":""},{"$f":"IF(OFFSET(DE108_25!$J$23,ROWS($J$23:J25)-1,COLUMNS($J$23:J25)-1)<>\"\",OFFSET(DE108_25!$J$23,ROWS($J$23:J25)-1,COLUMNS($J$23:J25)-1),\"\")","v":""},{"$f":"IF(OFFSET(DE108_25!$K$23,ROWS($K$23:K25)-1,COLUMNS($K$23:K25)-1)<>\"\",OFFSET(DE108_25!$K$23,ROWS($K$23:K25)-1,COLUMNS($K$23:K25)-1),\"\")","v":""},{"$f":"IF(OFFSET(DE108_25!$L$23,ROWS($L$23:L25)-1,COLUMNS($L$23:L25)-1)<>\"\",OFFSET(DE108_25!$L$23,ROWS($L$23:L25)-1,COLUMNS($L$23:L25)-1),\"\")","v":""},{"$f":"IF(OFFSET(DE108_25!$M$23,ROWS($M$23:M25)-1,COLUMNS($M$23:M25)-1)<>\"\",OFFSET(DE108_25!$M$23,ROWS($M$23:M25)-1,COLUMNS($M$23:M25)-1),\"\")","v":""},{"$f":"IF(OFFSET(DE108_25!$N$23,ROWS($N$23:N25)-1,COLUMNS($N$23:N25)-1)<>\"\",OFFSET(DE108_25!$N$23,ROWS($N$23:N25)-1,COLUMNS($N$23:N25)-1),\"\")","v":""},{"$f":"IF(OFFSET(DE108_25!$O$23,ROWS($O$23:O25)-1,COLUMNS($O$23:O25)-1)<>\"\",OFFSET(DE108_25!$O$23,ROWS($O$23:O25)-1,COLUMNS($O$23:O25)-1),\"\")","v":""}]
[{"$f":"IF(OFFSET(DE108_25!$C$23,ROWS($C$23:C26)-1,COLUMNS($C$23:C26)-1)<>\"\",OFFSET(DE108_25!$C$23,ROWS($C$23:C26)-1,COLUMNS($C$23:C26)-1),\"\")","v":""},{"$f":"IF(OFFSET(DE108_25!$D$23,ROWS($D$23:D26)-1,COLUMNS($D$23:D26)-1)<>\"\",OFFSET(DE108_25!$D$23,ROWS($D$23:D26)-1,COLUMNS($D$23:D26)-1),\"\")","v":""},{"$f":"IF(OFFSET(DE108_25!$E$23,ROWS($E$23:E26)-1,COLUMNS($E$23:E26)-1)<>\"\",OFFSET(DE108_25!$E$23,ROWS($E$23:E26)-1,COLUMNS($E$23:E26)-1),\"\")","v":""},{"$f":"IF(OFFSET(DE108_25!$F$23,ROWS($F$23:F26)-1,COLUMNS($F$23:F26)-1)<>\"\",OFFSET(DE108_25!$F$23,ROWS($F$23:F26)-1,COLUMNS($F$23:F26)-1),\"\")","v":""},{"$f":"IF(OFFSET(DE108_25!$G$23,ROWS($G$23:G26)-1,COLUMNS($G$23:G26)-1)<>\"\",OFFSET(DE108_25!$G$23,ROWS($G$23:G26)-1,COLUMNS($G$23:G26)-1),\"\")","v":""},{"$f":"IF(OFFSET(DE108_25!$H$23,ROWS($H$23:H26)-1,COLUMNS($H$23:H26)-1)<>\"\",OFFSET(DE108_25!$H$23,ROWS($H$23:H26)-1,COLUMNS($H$23:H26)-1),\"\")","v":""},{"$f":"IF(OFFSET(DE108_25!$I$23,ROWS($I$23:I26)-1,COLUMNS($I$23:I26)-1)<>\"\",OFFSET(DE108_25!$I$23,ROWS($I$23:I26)-1,COLUMNS($I$23:I26)-1),\"\")","v":""},{"$f":"IF(OFFSET(DE108_25!$J$23,ROWS($J$23:J26)-1,COLUMNS($J$23:J26)-1)<>\"\",OFFSET(DE108_25!$J$23,ROWS($J$23:J26)-1,COLUMNS($J$23:J26)-1),\"\")","v":""},{"$f":"IF(OFFSET(DE108_25!$K$23,ROWS($K$23:K26)-1,COLUMNS($K$23:K26)-1)<>\"\",OFFSET(DE108_25!$K$23,ROWS($K$23:K26)-1,COLUMNS($K$23:K26)-1),\"\")","v":""},{"$f":"IF(OFFSET(DE108_25!$L$23,ROWS($L$23:L26)-1,COLUMNS($L$23:L26)-1)<>\"\",OFFSET(DE108_25!$L$23,ROWS($L$23:L26)-1,COLUMNS($L$23:L26)-1),\"\")","v":""},{"$f":"IF(OFFSET(DE108_25!$M$23,ROWS($M$23:M26)-1,COLUMNS($M$23:M26)-1)<>\"\",OFFSET(DE108_25!$M$23,ROWS($M$23:M26)-1,COLUMNS($M$23:M26)-1),\"\")","v":""},{"$f":"IF(OFFSET(DE108_25!$N$23,ROWS($N$23:N26)-1,COLUMNS($N$23:N26)-1)<>\"\",OFFSET(DE108_25!$N$23,ROWS($N$23:N26)-1,COLUMNS($N$23:N26)-1),\"\")","v":""},{"$f":"IF(OFFSET(DE108_25!$O$23,ROWS($O$23:O26)-1,COLUMNS($O$23:O26)-1)<>\"\",OFFSET(DE108_25!$O$23,ROWS($O$23:O26)-1,COLUMNS($O$23:O26)-1),\"\")","v":""}]
[{"$f":"IF(OFFSET(DE108_25!$C$23,ROWS($C$23:C27)-1,COLUMNS($C$23:C27)-1)<>\"\",OFFSET(DE108_25!$C$23,ROWS($C$23:C27)-1,COLUMNS($C$23:C27)-1),\"\")","v":""},{"$f":"IF(OFFSET(DE108_25!$D$23,ROWS($D$23:D27)-1,COLUMNS($D$23:D27)-1)<>\"\",OFFSET(DE108_25!$D$23,ROWS($D$23:D27)-1,COLUMNS($D$23:D27)-1),\"\")","v":""},{"$f":"IF(OFFSET(DE108_25!$E$23,ROWS($E$23:E27)-1,COLUMNS($E$23:E27)-1)<>\"\",OFFSET(DE108_25!$E$23,ROWS($E$23:E27)-1,COLUMNS($E$23:E27)-1),\"\")","v":""},{"$f":"IF(OFFSET(DE108_25!$F$23,ROWS($F$23:F27)-1,COLUMNS($F$23:F27)-1)<>\"\",OFFSET(DE108_25!$F$23,ROWS($F$23:F27)-1,COLUMNS($F$23:F27)-1),\"\")","v":""},{"$f":"IF(OFFSET(DE108_25!$G$23,ROWS($G$23:G27)-1,COLUMNS($G$23:G27)-1)<>\"\",OFFSET(DE108_25!$G$23,ROWS($G$23:G27)-1,COLUMNS($G$23:G27)-1),\"\")","v":""},{"$f":"IF(OFFSET(DE108_25!$H$23,ROWS($H$23:H27)-1,COLUMNS($H$23:H27)-1)<>\"\",OFFSET(DE108_25!$H$23,ROWS($H$23:H27)-1,COLUMNS($H$23:H27)-1),\"\")","v":""},{"$f":"IF(OFFSET(DE108_25!$I$23,ROWS($I$23:I27)-1,COLUMNS($I$23:I27)-1)<>\"\",OFFSET(DE108_25!$I$23,ROWS($I$23:I27)-1,COLUMNS($I$23:I27)-1),\"\")","v":""},{"$f":"IF(OFFSET(DE108_25!$J$23,ROWS($J$23:J27)-1,COLUMNS($J$23:J27)-1)<>\"\",OFFSET(DE108_25!$J$23,ROWS($J$23:J27)-1,COLUMNS($J$23:J27)-1),\"\")","v":""},{"$f":"IF(OFFSET(DE108_25!$K$23,ROWS($K$23:K27)-1,COLUMNS($K$23:K27)-1)<>\"\",OFFSET(DE108_25!$K$23,ROWS($K$23:K27)-1,COLUMNS($K$23:K27)-1),\"\")","v":""},{"$f":"IF(OFFSET(DE108_25!$L$23,ROWS($L$23:L27)-1,COLUMNS($L$23:L27)-1)<>\"\",OFFSET(DE108_25!$L$23,ROWS($L$23:L27)-1,COLUMNS($L$23:L27)-1),\"\")","v":""},{"$f":"IF(OFFSET(DE108_25!$M$23,ROWS($M$23:M27)-1,COLUMNS($M$23:M27)-1)<>\"\",OFFSET(DE108_25!$M$23,ROWS($M$23:M27)-1,COLUMNS($M$23:M27)-1),\"\")","v":""},{"$f":"IF(OFFSET(DE108_25!$N$23,ROWS($N$23:N27)-1,COLUMNS($N$23:N27)-1)<>\"\",OFFSET(DE108_25!$N$23,ROWS($N$23:N27)-1,COLUMNS($N$23:N27)-1),\"\")","v":""},{"$f":"IF(OFFSET(DE108_25!$O$23,ROWS($O$23:O27)-1,COLUMNS($O$23:O27)-1)<>\"\",OFFSET(DE108_25!$O$23,ROWS($O$23:O27)-1,COLUMNS($O$23:O27)-1),\"\")","v":""}]
[{"$f":"IF(OFFSET(DE108_25!$C$23,ROWS($C$23:C28)-1,COLUMNS($C$23:C28)-1)<>\"\",OFFSET(DE108_25!$C$23,ROWS($C$23:C28)-1,COLUMNS($C$23:C28)-1),\"\")","v":""},{"$f":"IF(OFFSET(DE108_25!$D$23,ROWS($D$23:D28)-1,COLUMNS($D$23:D28)-1)<>\"\",OFFSET(DE108_25!$D$23,ROWS($D$23:D28)-1,COLUMNS($D$23:D28)-1),\"\")","v":""},{"$f":"IF(OFFSET(DE108_25!$E$23,ROWS($E$23:E28)-1,COLUMNS($E$23:E28)-1)<>\"\",OFFSET(DE108_25!$E$23,ROWS($E$23:E28)-1,COLUMNS($E$23:E28)-1),\"\")","v":""},{"$f":"IF(OFFSET(DE108_25!$F$23,ROWS($F$23:F28)-1,COLUMNS($F$23:F28)-1)<>\"\",OFFSET(DE108_25!$F$23,ROWS($F$23:F28)-1,COLUMNS($F$23:F28)-1),\"\")","v":""},{"$f":"IF(OFFSET(DE108_25!$G$23,ROWS($G$23:G28)-1,COLUMNS($G$23:G28)-1)<>\"\",OFFSET(DE108_25!$G$23,ROWS($G$23:G28)-1,COLUMNS($G$23:G28)-1),\"\")","v":""},{"$f":"IF(OFFSET(DE108_25!$H$23,ROWS($H$23:H28)-1,COLUMNS($H$23:H28)-1)<>\"\",OFFSET(DE108_25!$H$23,ROWS($H$23:H28)-1,COLUMNS($H$23:H28)-1),\"\")","v":""},{"$f":"IF(OFFSET(DE108_25!$I$23,ROWS($I$23:I28)-1,COLUMNS($I$23:I28)-1)<>\"\",OFFSET(DE108_25!$I$23,ROWS($I$23:I28)-1,COLUMNS($I$23:I28)-1),\"\")","v":""},{"$f":"IF(OFFSET(DE108_25!$J$23,ROWS($J$23:J28)-1,COLUMNS($J$23:J28)-1)<>\"\",OFFSET(DE108_25!$J$23,ROWS($J$23:J28)-1,COLUMNS($J$23:J28)-1),\"\")","v":""},{"$f":"IF(OFFSET(DE108_25!$K$23,ROWS($K$23:K28)-1,COLUMNS($K$23:K28)-1)<>\"\",OFFSET(DE108_25!$K$23,ROWS($K$23:K28)-1,COLUMNS($K$23:K28)-1),\"\")","v":""},{"$f":"IF(OFFSET(DE108_25!$L$23,ROWS($L$23:L28)-1,COLUMNS($L$23:L28)-1)<>\"\",OFFSET(DE108_25!$L$23,ROWS($L$23:L28)-1,COLUMNS($L$23:L28)-1),\"\")","v":""},{"$f":"IF(OFFSET(DE108_25!$M$23,ROWS($M$23:M28)-1,COLUMNS($M$23:M28)-1)<>\"\",OFFSET(DE108_25!$M$23,ROWS($M$23:M28)-1,COLUMNS($M$23:M28)-1),\"\")","v":""},{"$f":"IF(OFFSET(DE108_25!$N$23,ROWS($N$23:N28)-1,COLUMNS($N$23:N28)-1)<>\"\",OFFSET(DE108_25!$N$23,ROWS($N$23:N28)-1,COLUMNS($N$23:N28)-1),\"\")","v":""},{"$f":"IF(OFFSET(DE108_25!$O$23,ROWS($O$23:O28)-1,COLUMNS($O$23:O28)-1)<>\"\",OFFSET(DE108_25!$O$23,ROWS($O$23:O28)-1,COLUMNS($O$23:O28)-1),\"\")","v":""}]
[{"$f":"IF(OFFSET(DE108_25!$C$23,ROWS($C$23:C29)-1,COLUMNS($C$23:C29)-1)<>\"\",OFFSET(DE108_25!$C$23,ROWS($C$23:C29)-1,COLUMNS($C$23:C29)-1),\"\")","v":""},{"$f":"IF(OFFSET(DE108_25!$D$23,ROWS($D$23:D29)-1,COLUMNS($D$23:D29)-1)<>\"\",OFFSET(DE108_25!$D$23,ROWS($D$23:D29)-1,COLUMNS($D$23:D29)-1),\"\")","v":""},{"$f":"IF(OFFSET(DE108_25!$E$23,ROWS($E$23:E29)-1,COLUMNS($E$23:E29)-1)<>\"\",OFFSET(DE108_25!$E$23,ROWS($E$23:E29)-1,COLUMNS($E$23:E29)-1),\"\")","v":""},{"$f":"IF(OFFSET(DE108_25!$F$23,ROWS($F$23:F29)-1,COLUMNS($F$23:F29)-1)<>\"\",OFFSET(DE108_25!$F$23,ROWS($F$23:F29)-1,COLUMNS($F$23:F29)-1),\"\")","v":""},{"$f":"IF(OFFSET(DE108_25!$G$23,ROWS($G$23:G29)-1,COLUMNS($G$23:G29)-1)<>\"\",OFFSET(DE108_25!$G$23,ROWS($G$23:G29)-1,COLUMNS($G$23:G29)-1),\"\")","v":""},{"$f":"IF(OFFSET(DE108_25!$H$23,ROWS($H$23:H29)-1,COLUMNS($H$23:H29)-1)<>\"\",OFFSET(DE108_25!$H$23,ROWS($H$23:H29)-1,COLUMNS($H$23:H29)-1),\"\")","v":""},{"$f":"IF(OFFSET(DE108_25!$I$23,ROWS($I$23:I29)-1,COLUMNS($I$23:I29)-1)<>\"\",OFFSET(DE108_25!$I$23,ROWS($I$23:I29)-1,COLUMNS($I$23:I29)-1),\"\")","v":""},{"$f":"IF(OFFSET(DE108_25!$J$23,ROWS($J$23:J29)-1,COLUMNS($J$23:J29)-1)<>\"\",OFFSET(DE108_25!$J$23,ROWS($J$23:J29)-1,COLUMNS($J$23:J29)-1),\"\")","v":""},{"$f":"IF(OFFSET(DE108_25!$K$23,ROWS($K$23:K29)-1,COLUMNS($K$23:K29)-1)<>\"\",OFFSET(DE108_25!$K$23,ROWS($K$23:K29)-1,COLUMNS($K$23:K29)-1),\"\")","v":""},{"$f":"IF(OFFSET(DE108_25!$L$23,ROWS($L$23:L29)-1,COLUMNS($L$23:L29)-1)<>\"\",OFFSET(DE108_25!$L$23,ROWS($L$23:L29)-1,COLUMNS($L$23:L29)-1),\"\")","v":""},{"$f":"IF(OFFSET(DE108_25!$M$23,ROWS($M$23:M29)-1,COLUMNS($M$23:M29)-1)<>\"\",OFFSET(DE108_25!$M$23,ROWS($M$23:M29)-1,COLUMNS($M$23:M29)-1),\"\")","v":""},{"$f":"IF(OFFSET(DE108_25!$N$23,ROWS($N$23:N29)-1,COLUMNS($N$23:N29)-1)<>\"\",OFFSET(DE108_25!$N$23,ROWS($N$23:N29)-1,COLUMNS($N$23:N29)-1),\"\")","v":""},{"$f":"IF(OFFSET(DE108_25!$O$23,ROWS($O$23:O29)-1,COLUMNS($O$23:O29)-1)<>\"\",OFFSET(DE108_25!$O$23,ROWS($O$23:O29)-1,COLUMNS($O$23:O29)-1),\"\")","v":""}]
[{"$f":"IF(OFFSET(DE108_25!$C$23,ROWS($C$23:C30)-1,COLUMNS($C$23:C30)-1)<>\"\",OFFSET(DE108_25!$C$23,ROWS($C$23:C30)-1,COLUMNS($C$23:C30)-1),\"\")","v":""},{"$f":"IF(OFFSET(DE108_25!$D$23,ROWS($D$23:D30)-1,COLUMNS($D$23:D30)-1)<>\"\",OFFSET(DE108_25!$D$23,ROWS($D$23:D30)-1,COLUMNS($D$23:D30)-1),\"\")","v":""},{"$f":"IF(OFFSET(DE108_25!$E$23,ROWS($E$23:E30)-1,COLUMNS($E$23:E30)-1)<>\"\",OFFSET(DE108_25!$E$23,ROWS($E$23:E30)-1,COLUMNS($E$23:E30)-1),\"\")","v":""},{"$f":"IF(OFFSET(DE108_25!$F$23,ROWS($F$23:F30)-1,COLUMNS($F$23:F30)-1)<>\"\",OFFSET(DE108_25!$F$23,ROWS($F$23:F30)-1,COLUMNS($F$23:F30)-1),\"\")","v":""},{"$f":"IF(OFFSET(DE108_25!$G$23,ROWS($G$23:G30)-1,COLUMNS($G$23:G30)-1)<>\"\",OFFSET(DE108_25!$G$23,ROWS($G$23:G30)-1,COLUMNS($G$23:G30)-1),\"\")","v":""},{"$f":"IF(OFFSET(DE108_25!$H$23,ROWS($H$23:H30)-1,COLUMNS($H$23:H30)-1)<>\"\",OFFSET(DE108_25!$H$23,ROWS($H$23:H30)-1,COLUMNS($H$23:H30)-1),\"\")","v":""},{"$f":"IF(OFFSET(DE108_25!$I$23,ROWS($I$23:I30)-1,COLUMNS($I$23:I30)-1)<>\"\",OFFSET(DE108_25!$I$23,ROWS($I$23:I30)-1,COLUMNS($I$23:I30)-1),\"\")","v":""},{"$f":"IF(OFFSET(DE108_25!$J$23,ROWS($J$23:J30)-1,COLUMNS($J$23:J30)-1)<>\"\",OFFSET(DE108_25!$J$23,ROWS($J$23:J30)-1,COLUMNS($J$23:J30)-1),\"\")","v":""},{"$f":"IF(OFFSET(DE108_25!$K$23,ROWS($K$23:K30)-1,COLUMNS($K$23:K30)-1)<>\"\",OFFSET(DE108_25!$K$23,ROWS($K$23:K30)-1,COLUMNS($K$23:K30)-1),\"\")","v":""},{"$f":"IF(OFFSET(DE108_25!$L$23,ROWS($L$23:L30)-1,COLUMNS($L$23:L30)-1)<>\"\",OFFSET(DE108_25!$L$23,ROWS($L$23:L30)-1,COLUMNS($L$23:L30)-1),\"\")","v":""},{"$f":"IF(OFFSET(DE108_25!$M$23,ROWS($M$23:M30)-1,COLUMNS($M$23:M30)-1)<>\"\",OFFSET(DE108_25!$M$23,ROWS($M$23:M30)-1,COLUMNS($M$23:M30)-1),\"\")","v":""},{"$f":"IF(OFFSET(DE108_25!$N$23,ROWS($N$23:N30)-1,COLUMNS($N$23:N30)-1)<>\"\",OFFSET(DE108_25!$N$23,ROWS($N$23:N30)-1,COLUMNS($N$23:N30)-1),\"\")","v":""},{"$f":"IF(OFFSET(DE108_25!$O$23,ROWS($O$23:O30)-1,COLUMNS($O$23:O30)-1)<>\"\",OFFSET(DE108_25!$O$23,ROWS($O$23:O30)-1,COLUMNS($O$23:O30)-1),\"\")","v":""}]
[{"$f":"IF(OFFSET(DE108_25!$C$23,ROWS($C$23:C31)-1,COLUMNS($C$23:C31)-1)<>\"\",OFFSET(DE108_25!$C$23,ROWS($C$23:C31)-1,COLUMNS($C$23:C31)-1),\"\")","v":""},{"$f":"IF(OFFSET(DE108_25!$D$23,ROWS($D$23:D31)-1,COLUMNS($D$23:D31)-1)<>\"\",OFFSET(DE108_25!$D$23,ROWS($D$23:D31)-1,COLUMNS($D$23:D31)-1),\"\")","v":""},{"$f":"IF(OFFSET(DE108_25!$E$23,ROWS($E$23:E31)-1,COLUMNS($E$23:E31)-1)<>\"\",OFFSET(DE108_25!$E$23,ROWS($E$23:E31)-1,COLUMNS($E$23:E31)-1),\"\")","v":""},{"$f":"IF(OFFSET(DE108_25!$F$23,ROWS($F$23:F31)-1,COLUMNS($F$23:F31)-1)<>\"\",OFFSET(DE108_25!$F$23,ROWS($F$23:F31)-1,COLUMNS($F$23:F31)-1),\"\")","v":""},{"$f":"IF(OFFSET(DE108_25!$G$23,ROWS($G$23:G31)-1,COLUMNS($G$23:G31)-1)<>\"\",OFFSET(DE108_25!$G$23,ROWS($G$23:G31)-1,COLUMNS($G$23:G31)-1),\"\")","v":""},{"$f":"IF(OFFSET(DE108_25!$H$23,ROWS($H$23:H31)-1,COLUMNS($H$23:H31)-1)<>\"\",OFFSET(DE108_25!$H$23,ROWS($H$23:H31)-1,COLUMNS($H$23:H31)-1),\"\")","v":""},{"$f":"IF(OFFSET(DE108_25!$I$23,ROWS($I$23:I31)-1,COLUMNS($I$23:I31)-1)<>\"\",OFFSET(DE108_25!$I$23,ROWS($I$23:I31)-1,COLUMNS($I$23:I31)-1),\"\")","v":""},{"$f":"IF(OFFSET(DE108_25!$J$23,ROWS($J$23:J31)-1,COLUMNS($J$23:J31)-1)<>\"\",OFFSET(DE108_25!$J$23,ROWS($J$23:J31)-1,COLUMNS($J$23:J31)-1),\"\")","v":""},{"$f":"IF(OFFSET(DE108_25!$K$23,ROWS($K$23:K31)-1,COLUMNS($K$23:K31)-1)<>\"\",OFFSET(DE108_25!$K$23,ROWS($K$23:K31)-1,COLUMNS($K$23:K31)-1),\"\")","v":""},{"$f":"IF(OFFSET(DE108_25!$L$23,ROWS($L$23:L31)-1,COLUMNS($L$23:L31)-1)<>\"\",OFFSET(DE108_25!$L$23,ROWS($L$23:L31)-1,COLUMNS($L$23:L31)-1),\"\")","v":""},{"$f":"IF(OFFSET(DE108_25!$M$23,ROWS($M$23:M31)-1,COLUMNS($M$23:M31)-1)<>\"\",OFFSET(DE108_25!$M$23,ROWS($M$23:M31)-1,COLUMNS($M$23:M31)-1),\"\")","v":""},{"$f":"IF(OFFSET(DE108_25!$N$23,ROWS($N$23:N31)-1,COLUMNS($N$23:N31)-1)<>\"\",OFFSET(DE108_25!$N$23,ROWS($N$23:N31)-1,COLUMNS($N$23:N31)-1),\"\")","v":""},{"$f":"IF(OFFSET(DE108_25!$O$23,ROWS($O$23:O31)-1,COLUMNS($O$23:O31)-1)<>\"\",OFFSET(DE108_25!$O$23,ROWS($O$23:O31)-1,COLUMNS($O$23:O31)-1),\"\")","v":""}]
[{"$f":"IF(OFFSET(DE108_25!$C$23,ROWS($C$23:C32)-1,COLUMNS($C$23:C32)-1)<>\"\",OFFSET(DE108_25!$C$23,ROWS($C$23:C32)-1,COLUMNS($C$23:C32)-1),\"\")","v":""},{"$f":"IF(OFFSET(DE108_25!$D$23,ROWS($D$23:D32)-1,COLUMNS($D$23:D32)-1)<>\"\",OFFSET(DE108_25!$D$23,ROWS($D$23:D32)-1,COLUMNS($D$23:D32)-1),\"\")","v":""},{"$f":"IF(OFFSET(DE108_25!$E$23,ROWS($E$23:E32)-1,COLUMNS($E$23:E32)-1)<>\"\",OFFSET(DE108_25!$E$23,ROWS($E$23:E32)-1,COLUMNS($E$23:E32)-1),\"\")","v":""},{"$f":"IF(OFFSET(DE108_25!$F$23,ROWS($F$23:F32)-1,COLUMNS($F$23:F32)-1)<>\"\",OFFSET(DE108_25!$F$23,ROWS($F$23:F32)-1,COLUMNS($F$23:F32)-1),\"\")","v":""},{"$f":"IF(OFFSET(DE108_25!$G$23,ROWS($G$23:G32)-1,COLUMNS($G$23:G32)-1)<>\"\",OFFSET(DE108_25!$G$23,ROWS($G$23:G32)-1,COLUMNS($G$23:G32)-1),\"\")","v":""},{"$f":"IF(OFFSET(DE108_25!$H$23,ROWS($H$23:H32)-1,COLUMNS($H$23:H32)-1)<>\"\",OFFSET(DE108_25!$H$23,ROWS($H$23:H32)-1,COLUMNS($H$23:H32)-1),\"\")","v":""},{"$f":"IF(OFFSET(DE108_25!$I$23,ROWS($I$23:I32)-1,COLUMNS($I$23:I32)-1)<>\"\",OFFSET(DE108_25!$I$23,ROWS($I$23:I32)-1,COLUMNS($I$23:I32)-1),\"\")","v":""},{"$f":"IF(OFFSET(DE108_25!$J$23,ROWS($J$23:J32)-1,COLUMNS($J$23:J32)-1)<>\"\",OFFSET(DE108_25!$J$23,ROWS($J$23:J32)-1,COLUMNS($J$23:J32)-1),\"\")","v":""},{"$f":"IF(OFFSET(DE108_25!$K$23,ROWS($K$23:K32)-1,COLUMNS($K$23:K32)-1)<>\"\",OFFSET(DE108_25!$K$23,ROWS($K$23:K32)-1,COLUMNS($K$23:K32)-1),\"\")","v":""},{"$f":"IF(OFFSET(DE108_25!$L$23,ROWS($L$23:L32)-1,COLUMNS($L$23:L32)-1)<>\"\",OFFSET(DE108_25!$L$23,ROWS($L$23:L32)-1,COLUMNS($L$23:L32)-1),\"\")","v":""},{"$f":"IF(OFFSET(DE108_25!$M$23,ROWS($M$23:M32)-1,COLUMNS($M$23:M32)-1)<>\"\",OFFSET(DE108_25!$M$23,ROWS($M$23:M32)-1,COLUMNS($M$23:M32)-1),\"\")","v":""},{"$f":"IF(OFFSET(DE108_25!$N$23,ROWS($N$23:N32)-1,COLUMNS($N$23:N32)-1)<>\"\",OFFSET(DE108_25!$N$23,ROWS($N$23:N32)-1,COLUMNS($N$23:N32)-1),\"\")","v":""},{"$f":"IF(OFFSET(DE108_25!$O$23,ROWS($O$23:O32)-1,COLUMNS($O$23:O32)-1)<>\"\",OFFSET(DE108_25!$O$23,ROWS($O$23:O32)-1,COLUMNS($O$23:O32)-1),\"\")","v":""}]
[{"$f":"IF(OFFSET(DE108_25!$C$23,ROWS($C$23:C33)-1,COLUMNS($C$23:C33)-1)<>\"\",OFFSET(DE108_25!$C$23,ROWS($C$23:C33)-1,COLUMNS($C$23:C33)-1),\"\")","v":""},{"$f":"IF(OFFSET(DE108_25!$D$23,ROWS($D$23:D33)-1,COLUMNS($D$23:D33)-1)<>\"\",OFFSET(DE108_25!$D$23,ROWS($D$23:D33)-1,COLUMNS($D$23:D33)-1),\"\")","v":""},{"$f":"IF(OFFSET(DE108_25!$E$23,ROWS($E$23:E33)-1,COLUMNS($E$23:E33)-1)<>\"\",OFFSET(DE108_25!$E$23,ROWS($E$23:E33)-1,COLUMNS($E$23:E33)-1),\"\")","v":""},{"$f":"IF(OFFSET(DE108_25!$F$23,ROWS($F$23:F33)-1,COLUMNS($F$23:F33)-1)<>\"\",OFFSET(DE108_25!$F$23,ROWS($F$23:F33)-1,COLUMNS($F$23:F33)-1),\"\")","v":""},{"$f":"IF(OFFSET(DE108_25!$G$23,ROWS($G$23:G33)-1,COLUMNS($G$23:G33)-1)<>\"\",OFFSET(DE108_25!$G$23,ROWS($G$23:G33)-1,COLUMNS($G$23:G33)-1),\"\")","v":""},{"$f":"IF(OFFSET(DE108_25!$H$23,ROWS($H$23:H33)-1,COLUMNS($H$23:H33)-1)<>\"\",OFFSET(DE108_25!$H$23,ROWS($H$23:H33)-1,COLUMNS($H$23:H33)-1),\"\")","v":""},{"$f":"IF(OFFSET(DE108_25!$I$23,ROWS($I$23:I33)-1,COLUMNS($I$23:I33)-1)<>\"\",OFFSET(DE108_25!$I$23,ROWS($I$23:I33)-1,COLUMNS($I$23:I33)-1),\"\")","v":""},{"$f":"IF(OFFSET(DE108_25!$J$23,ROWS($J$23:J33)-1,COLUMNS($J$23:J33)-1)<>\"\",OFFSET(DE108_25!$J$23,ROWS($J$23:J33)-1,COLUMNS($J$23:J33)-1),\"\")","v":""},{"$f":"IF(OFFSET(DE108_25!$K$23,ROWS($K$23:K33)-1,COLUMNS($K$23:K33)-1)<>\"\",OFFSET(DE108_25!$K$23,ROWS($K$23:K33)-1,COLUMNS($K$23:K33)-1),\"\")","v":""},{"$f":"IF(OFFSET(DE108_25!$L$23,ROWS($L$23:L33)-1,COLUMNS($L$23:L33)-1)<>\"\",OFFSET(DE108_25!$L$23,ROWS($L$23:L33)-1,COLUMNS($L$23:L33)-1),\"\")","v":""},{"$f":"IF(OFFSET(DE108_25!$M$23,ROWS($M$23:M33)-1,COLUMNS($M$23:M33)-1)<>\"\",OFFSET(DE108_25!$M$23,ROWS($M$23:M33)-1,COLUMNS($M$23:M33)-1),\"\")","v":""},{"$f":"IF(OFFSET(DE108_25!$N$23,ROWS($N$23:N33)-1,COLUMNS($N$23:N33)-1)<>\"\",OFFSET(DE108_25!$N$23,ROWS($N$23:N33)-1,COLUMNS($N$23:N33)-1),\"\")","v":""},{"$f":"IF(OFFSET(DE108_25!$O$23,ROWS($O$23:O33)-1,COLUMNS($O$23:O33)-1)<>\"\",OFFSET(DE108_25!$O$23,ROWS($O$23:O33)-1,COLUMNS($O$23:O33)-1),\"\")","v":""}]
[{"$f":"IF(OFFSET(DE108_25!$C$23,ROWS($C$23:C34)-1,COLUMNS($C$23:C34)-1)<>\"\",OFFSET(DE108_25!$C$23,ROWS($C$23:C34)-1,COLUMNS($C$23:C34)-1),\"\")","v":""},{"$f":"IF(OFFSET(DE108_25!$D$23,ROWS($D$23:D34)-1,COLUMNS($D$23:D34)-1)<>\"\",OFFSET(DE108_25!$D$23,ROWS($D$23:D34)-1,COLUMNS($D$23:D34)-1),\"\")","v":""},{"$f":"IF(OFFSET(DE108_25!$E$23,ROWS($E$23:E34)-1,COLUMNS($E$23:E34)-1)<>\"\",OFFSET(DE108_25!$E$23,ROWS($E$23:E34)-1,COLUMNS($E$23:E34)-1),\"\")","v":""},{"$f":"IF(OFFSET(DE108_25!$F$23,ROWS($F$23:F34)-1,COLUMNS($F$23:F34)-1)<>\"\",OFFSET(DE108_25!$F$23,ROWS($F$23:F34)-1,COLUMNS($F$23:F34)-1),\"\")","v":""},{"$f":"IF(OFFSET(DE108_25!$G$23,ROWS($G$23:G34)-1,COLUMNS($G$23:G34)-1)<>\"\",OFFSET(DE108_25!$G$23,ROWS($G$23:G34)-1,COLUMNS($G$23:G34)-1),\"\")","v":""},{"$f":"IF(OFFSET(DE108_25!$H$23,ROWS($H$23:H34)-1,COLUMNS($H$23:H34)-1)<>\"\",OFFSET(DE108_25!$H$23,ROWS($H$23:H34)-1,COLUMNS($H$23:H34)-1),\"\")","v":""},{"$f":"IF(OFFSET(DE108_25!$I$23,ROWS($I$23:I34)-1,COLUMNS($I$23:I34)-1)<>\"\",OFFSET(DE108_25!$I$23,ROWS($I$23:I34)-1,COLUMNS($I$23:I34)-1),\"\")","v":""},{"$f":"IF(OFFSET(DE108_25!$J$23,ROWS($J$23:J34)-1,COLUMNS($J$23:J34)-1)<>\"\",OFFSET(DE108_25!$J$23,ROWS($J$23:J34)-1,COLUMNS($J$23:J34)-1),\"\")","v":""},{"$f":"IF(OFFSET(DE108_25!$K$23,ROWS($K$23:K34)-1,COLUMNS($K$23:K34)-1)<>\"\",OFFSET(DE108_25!$K$23,ROWS($K$23:K34)-1,COLUMNS($K$23:K34)-1),\"\")","v":""},{"$f":"IF(OFFSET(DE108_25!$L$23,ROWS($L$23:L34)-1,COLUMNS($L$23:L34)-1)<>\"\",OFFSET(DE108_25!$L$23,ROWS($L$23:L34)-1,COLUMNS($L$23:L34)-1),\"\")","v":""},{"$f":"IF(OFFSET(DE108_25!$M$23,ROWS($M$23:M34)-1,COLUMNS($M$23:M34)-1)<>\"\",OFFSET(DE108_25!$M$23,ROWS($M$23:M34)-1,COLUMNS($M$23:M34)-1),\"\")","v":""},{"$f":"IF(OFFSET(DE108_25!$N$23,ROWS($N$23:N34)-1,COLUMNS($N$23:N34)-1)<>\"\",OFFSET(DE108_25!$N$23,ROWS($N$23:N34)-1,COLUMNS($N$23:N34)-1),\"\")","v":""},{"$f":"IF(OFFSET(DE108_25!$O$23,ROWS($O$23:O34)-1,COLUMNS($O$23:O34)-1)<>\"\",OFFSET(DE108_25!$O$23,ROWS($O$23:O34)-1,COLUMNS($O$23:O34)-1),\"\")","v":""}]
[{"$f":"IF(OFFSET(DE108_25!$C$23,ROWS($C$23:C35)-1,COLUMNS($C$23:C35)-1)<>\"\",OFFSET(DE108_25!$C$23,ROWS($C$23:C35)-1,COLUMNS($C$23:C35)-1),\"\")","v":""},{"$f":"IF(OFFSET(DE108_25!$D$23,ROWS($D$23:D35)-1,COLUMNS($D$23:D35)-1)<>\"\",OFFSET(DE108_25!$D$23,ROWS($D$23:D35)-1,COLUMNS($D$23:D35)-1),\"\")","v":""},{"$f":"IF(OFFSET(DE108_25!$E$23,ROWS($E$23:E35)-1,COLUMNS($E$23:E35)-1)<>\"\",OFFSET(DE108_25!$E$23,ROWS($E$23:E35)-1,COLUMNS($E$23:E35)-1),\"\")","v":""},{"$f":"IF(OFFSET(DE108_25!$F$23,ROWS($F$23:F35)-1,COLUMNS($F$23:F35)-1)<>\"\",OFFSET(DE108_25!$F$23,ROWS($F$23:F35)-1,COLUMNS($F$23:F35)-1),\"\")","v":""},{"$f":"IF(OFFSET(DE108_25!$G$23,ROWS($G$23:G35)-1,COLUMNS($G$23:G35)-1)<>\"\",OFFSET(DE108_25!$G$23,ROWS($G$23:G35)-1,COLUMNS($G$23:G35)-1),\"\")","v":""},{"$f":"IF(OFFSET(DE108_25!$H$23,ROWS($H$23:H35)-1,COLUMNS($H$23:H35)-1)<>\"\",OFFSET(DE108_25!$H$23,ROWS($H$23:H35)-1,COLUMNS($H$23:H35)-1),\"\")","v":""},{"$f":"IF(OFFSET(DE108_25!$I$23,ROWS($I$23:I35)-1,COLUMNS($I$23:I35)-1)<>\"\",OFFSET(DE108_25!$I$23,ROWS($I$23:I35)-1,COLUMNS($I$23:I35)-1),\"\")","v":""},{"$f":"IF(OFFSET(DE108_25!$J$23,ROWS($J$23:J35)-1,COLUMNS($J$23:J35)-1)<>\"\",OFFSET(DE108_25!$J$23,ROWS($J$23:J35)-1,COLUMNS($J$23:J35)-1),\"\")","v":""},{"$f":"IF(OFFSET(DE108_25!$K$23,ROWS($K$23:K35)-1,COLUMNS($K$23:K35)-1)<>\"\",OFFSET(DE108_25!$K$23,ROWS($K$23:K35)-1,COLUMNS($K$23:K35)-1),\"\")","v":""},{"$f":"IF(OFFSET(DE108_25!$L$23,ROWS($L$23:L35)-1,COLUMNS($L$23:L35)-1)<>\"\",OFFSET(DE108_25!$L$23,ROWS($L$23:L35)-1,COLUMNS($L$23:L35)-1),\"\")","v":""},{"$f":"IF(OFFSET(DE108_25!$M$23,ROWS($M$23:M35)-1,COLUMNS($M$23:M35)-1)<>\"\",OFFSET(DE108_25!$M$23,ROWS($M$23:M35)-1,COLUMNS($M$23:M35)-1),\"\")","v":""},{"$f":"IF(OFFSET(DE108_25!$N$23,ROWS($N$23:N35)-1,COLUMNS($N$23:N35)-1)<>\"\",OFFSET(DE108_25!$N$23,ROWS($N$23:N35)-1,COLUMNS($N$23:N35)-1),\"\")","v":""},{"$f":"IF(OFFSET(DE108_25!$O$23,ROWS($O$23:O35)-1,COLUMNS($O$23:O35)-1)<>\"\",OFFSET(DE108_25!$O$23,ROWS($O$23:O35)-1,COLUMNS($O$23:O35)-1),\"\")","v":""}]
[{"$f":"IF(OFFSET(DE108_25!$C$23,ROWS($C$23:C36)-1,COLUMNS($C$23:C36)-1)<>\"\",OFFSET(DE108_25!$C$23,ROWS($C$23:C36)-1,COLUMNS($C$23:C36)-1),\"\")","v":""},{"$f":"IF(OFFSET(DE108_25!$D$23,ROWS($D$23:D36)-1,COLUMNS($D$23:D36)-1)<>\"\",OFFSET(DE108_25!$D$23,ROWS($D$23:D36)-1,COLUMNS($D$23:D36)-1),\"\")","v":""},{"$f":"IF(OFFSET(DE108_25!$E$23,ROWS($E$23:E36)-1,COLUMNS($E$23:E36)-1)<>\"\",OFFSET(DE108_25!$E$23,ROWS($E$23:E36)-1,COLUMNS($E$23:E36)-1),\"\")","v":""},{"$f":"IF(OFFSET(DE108_25!$F$23,ROWS($F$23:F36)-1,COLUMNS($F$23:F36)-1)<>\"\",OFFSET(DE108_25!$F$23,ROWS($F$23:F36)-1,COLUMNS($F$23:F36)-1),\"\")","v":""},{"$f":"IF(OFFSET(DE108_25!$G$23,ROWS($G$23:G36)-1,COLUMNS($G$23:G36)-1)<>\"\",OFFSET(DE108_25!$G$23,ROWS($G$23:G36)-1,COLUMNS($G$23:G36)-1),\"\")","v":""},{"$f":"IF(OFFSET(DE108_25!$H$23,ROWS($H$23:H36)-1,COLUMNS($H$23:H36)-1)<>\"\",OFFSET(DE108_25!$H$23,ROWS($H$23:H36)-1,COLUMNS($H$23:H36)-1),\"\")","v":""},{"$f":"IF(OFFSET(DE108_25!$I$23,ROWS($I$23:I36)-1,COLUMNS($I$23:I36)-1)<>\"\",OFFSET(DE108_25!$I$23,ROWS($I$23:I36)-1,COLUMNS($I$23:I36)-1),\"\")","v":""},{"$f":"IF(OFFSET(DE108_25!$J$23,ROWS($J$23:J36)-1,COLUMNS($J$23:J36)-1)<>\"\",OFFSET(DE108_25!$J$23,ROWS($J$23:J36)-1,COLUMNS($J$23:J36)-1),\"\")","v":""},{"$f":"IF(OFFSET(DE108_25!$K$23,ROWS($K$23:K36)-1,COLUMNS($K$23:K36)-1)<>\"\",OFFSET(DE108_25!$K$23,ROWS($K$23:K36)-1,COLUMNS($K$23:K36)-1),\"\")","v":""},{"$f":"IF(OFFSET(DE108_25!$L$23,ROWS($L$23:L36)-1,COLUMNS($L$23:L36)-1)<>\"\",OFFSET(DE108_25!$L$23,ROWS($L$23:L36)-1,COLUMNS($L$23:L36)-1),\"\")","v":""},{"$f":"IF(OFFSET(DE108_25!$M$23,ROWS($M$23:M36)-1,COLUMNS($M$23:M36)-1)<>\"\",OFFSET(DE108_25!$M$23,ROWS($M$23:M36)-1,COLUMNS($M$23:M36)-1),\"\")","v":""},{"$f":"IF(OFFSET(DE108_25!$N$23,ROWS($N$23:N36)-1,COLUMNS($N$23:N36)-1)<>\"\",OFFSET(DE108_25!$N$23,ROWS($N$23:N36)-1,COLUMNS($N$23:N36)-1),\"\")","v":""},{"$f":"IF(OFFSET(DE108_25!$O$23,ROWS($O$23:O36)-1,COLUMNS($O$23:O36)-1)<>\"\",OFFSET(DE108_25!$O$23,ROWS($O$23:O36)-1,COLUMNS($O$23:O36)-1),\"\")","v":""}]
[{"$f":"IF(OFFSET(DE108_25!$C$23,ROWS($C$23:C37)-1,COLUMNS($C$23:C37)-1)<>\"\",OFFSET(DE108_25!$C$23,ROWS($C$23:C37)-1,COLUMNS($C$23:C37)-1),\"\")","v":""},{"$f":"IF(OFFSET(DE108_25!$D$23,ROWS($D$23:D37)-1,COLUMNS($D$23:D37)-1)<>\"\",OFFSET(DE108_25!$D$23,ROWS($D$23:D37)-1,COLUMNS($D$23:D37)-1),\"\")","v":""},{"$f":"IF(OFFSET(DE108_25!$E$23,ROWS($E$23:E37)-1,COLUMNS($E$23:E37)-1)<>\"\",OFFSET(DE108_25!$E$23,ROWS($E$23:E37)-1,COLUMNS($E$23:E37)-1),\"\")","v":""},{"$f":"IF(OFFSET(DE108_25!$F$23,ROWS($F$23:F37)-1,COLUMNS($F$23:F37)-1)<>\"\",OFFSET(DE108_25!$F$23,ROWS($F$23:F37)-1,COLUMNS($F$23:F37)-1),\"\")","v":""},{"$f":"IF(OFFSET(DE108_25!$G$23,ROWS($G$23:G37)-1,COLUMNS($G$23:G37)-1)<>\"\",OFFSET(DE108_25!$G$23,ROWS($G$23:G37)-1,COLUMNS($G$23:G37)-1),\"\")","v":""},{"$f":"IF(OFFSET(DE108_25!$H$23,ROWS($H$23:H37)-1,COLUMNS($H$23:H37)-1)<>\"\",OFFSET(DE108_25!$H$23,ROWS($H$23:H37)-1,COLUMNS($H$23:H37)-1),\"\")","v":""},{"$f":"IF(OFFSET(DE108_25!$I$23,ROWS($I$23:I37)-1,COLUMNS($I$23:I37)-1)<>\"\",OFFSET(DE108_25!$I$23,ROWS($I$23:I37)-1,COLUMNS($I$23:I37)-1),\"\")","v":""},{"$f":"IF(OFFSET(DE108_25!$J$23,ROWS($J$23:J37)-1,COLUMNS($J$23:J37)-1)<>\"\",OFFSET(DE108_25!$J$23,ROWS($J$23:J37)-1,COLUMNS($J$23:J37)-1),\"\")","v":""},{"$f":"IF(OFFSET(DE108_25!$K$23,ROWS($K$23:K37)-1,COLUMNS($K$23:K37)-1)<>\"\",OFFSET(DE108_25!$K$23,ROWS($K$23:K37)-1,COLUMNS($K$23:K37)-1),\"\")","v":""},{"$f":"IF(OFFSET(DE108_25!$L$23,ROWS($L$23:L37)-1,COLUMNS($L$23:L37)-1)<>\"\",OFFSET(DE108_25!$L$23,ROWS($L$23:L37)-1,COLUMNS($L$23:L37)-1),\"\")","v":""},{"$f":"IF(OFFSET(DE108_25!$M$23,ROWS($M$23:M37)-1,COLUMNS($M$23:M37)-1)<>\"\",OFFSET(DE108_25!$M$23,ROWS($M$23:M37)-1,COLUMNS($M$23:M37)-1),\"\")","v":""},{"$f":"IF(OFFSET(DE108_25!$N$23,ROWS($N$23:N37)-1,COLUMNS($N$23:N37)-1)<>\"\",OFFSET(DE108_25!$N$23,ROWS($N$23:N37)-1,COLUMNS($N$23:N37)-1),\"\")","v":""},{"$f":"IF(OFFSET(DE108_25!$O$23,ROWS($O$23:O37)-1,COLUMNS($O$23:O37)-1)<>\"\",OFFSET(DE108_25!$O$23,ROWS($O$23:O37)-1,COLUMNS($O$23:O37)-1),\"\")","v":""}]
[{"$f":"IF(OFFSET(DE108_25!$C$23,ROWS($C$23:C38)-1,COLUMNS($C$23:C38)-1)<>\"\",OFFSET(DE108_25!$C$23,ROWS($C$23:C38)-1,COLUMNS($C$23:C38)-1),\"\")","v":""},{"$f":"IF(OFFSET(DE108_25!$D$23,ROWS($D$23:D38)-1,COLUMNS($D$23:D38)-1)<>\"\",OFFSET(DE108_25!$D$23,ROWS($D$23:D38)-1,COLUMNS($D$23:D38)-1),\"\")","v":""},{"$f":"IF(OFFSET(DE108_25!$E$23,ROWS($E$23:E38)-1,COLUMNS($E$23:E38)-1)<>\"\",OFFSET(DE108_25!$E$23,ROWS($E$23:E38)-1,COLUMNS($E$23:E38)-1),\"\")","v":""},{"$f":"IF(OFFSET(DE108_25!$F$23,ROWS($F$23:F38)-1,COLUMNS($F$23:F38)-1)<>\"\",OFFSET(DE108_25!$F$23,ROWS($F$23:F38)-1,COLUMNS($F$23:F38)-1),\"\")","v":""},{"$f":"IF(OFFSET(DE108_25!$G$23,ROWS($G$23:G38)-1,COLUMNS($G$23:G38)-1)<>\"\",OFFSET(DE108_25!$G$23,ROWS($G$23:G38)-1,COLUMNS($G$23:G38)-1),\"\")","v":""},{"$f":"IF(OFFSET(DE108_25!$H$23,ROWS($H$23:H38)-1,COLUMNS($H$23:H38)-1)<>\"\",OFFSET(DE108_25!$H$23,ROWS($H$23:H38)-1,COLUMNS($H$23:H38)-1),\"\")","v":""},{"$f":"IF(OFFSET(DE108_25!$I$23,ROWS($I$23:I38)-1,COLUMNS($I$23:I38)-1)<>\"\",OFFSET(DE108_25!$I$23,ROWS($I$23:I38)-1,COLUMNS($I$23:I38)-1),\"\")","v":""},{"$f":"IF(OFFSET(DE108_25!$J$23,ROWS($J$23:J38)-1,COLUMNS($J$23:J38)-1)<>\"\",OFFSET(DE108_25!$J$23,ROWS($J$23:J38)-1,COLUMNS($J$23:J38)-1),\"\")","v":""},{"$f":"IF(OFFSET(DE108_25!$K$23,ROWS($K$23:K38)-1,COLUMNS($K$23:K38)-1)<>\"\",OFFSET(DE108_25!$K$23,ROWS($K$23:K38)-1,COLUMNS($K$23:K38)-1),\"\")","v":""},{"$f":"IF(OFFSET(DE108_25!$L$23,ROWS($L$23:L38)-1,COLUMNS($L$23:L38)-1)<>\"\",OFFSET(DE108_25!$L$23,ROWS($L$23:L38)-1,COLUMNS($L$23:L38)-1),\"\")","v":""},{"$f":"IF(OFFSET(DE108_25!$M$23,ROWS($M$23:M38)-1,COLUMNS($M$23:M38)-1)<>\"\",OFFSET(DE108_25!$M$23,ROWS($M$23:M38)-1,COLUMNS($M$23:M38)-1),\"\")","v":""},{"$f":"IF(OFFSET(DE108_25!$N$23,ROWS($N$23:N38)-1,COLUMNS($N$23:N38)-1)<>\"\",OFFSET(DE108_25!$N$23,ROWS($N$23:N38)-1,COLUMNS($N$23:N38)-1),\"\")","v":""},{"$f":"IF(OFFSET(DE108_25!$O$23,ROWS($O$23:O38)-1,COLUMNS($O$23:O38)-1)<>\"\",OFFSET(DE108_25!$O$23,ROWS($O$23:O38)-1,COLUMNS($O$23:O38)-1),\"\")","v":""}]
[{"$f":"IF(OFFSET(DE108_25!$C$23,ROWS($C$23:C39)-1,COLUMNS($C$23:C39)-1)<>\"\",OFFSET(DE108_25!$C$23,ROWS($C$23:C39)-1,COLUMNS($C$23:C39)-1),\"\")","v":""},{"$f":"IF(OFFSET(DE108_25!$D$23,ROWS($D$23:D39)-1,COLUMNS($D$23:D39)-1)<>\"\",OFFSET(DE108_25!$D$23,ROWS($D$23:D39)-1,COLUMNS($D$23:D39)-1),\"\")","v":""},{"$f":"IF(OFFSET(DE108_25!$E$23,ROWS($E$23:E39)-1,COLUMNS($E$23:E39)-1)<>\"\",OFFSET(DE108_25!$E$23,ROWS($E$23:E39)-1,COLUMNS($E$23:E39)-1),\"\")","v":""},{"$f":"IF(OFFSET(DE108_25!$F$23,ROWS($F$23:F39)-1,COLUMNS($F$23:F39)-1)<>\"\",OFFSET(DE108_25!$F$23,ROWS($F$23:F39)-1,COLUMNS($F$23:F39)-1),\"\")","v":""},{"$f":"IF(OFFSET(DE108_25!$G$23,ROWS($G$23:G39)-1,COLUMNS($G$23:G39)-1)<>\"\",OFFSET(DE108_25!$G$23,ROWS($G$23:G39)-1,COLUMNS($G$23:G39)-1),\"\")","v":""},{"$f":"IF(OFFSET(DE108_25!$H$23,ROWS($H$23:H39)-1,COLUMNS($H$23:H39)-1)<>\"\",OFFSET(DE108_25!$H$23,ROWS($H$23:H39)-1,COLUMNS($H$23:H39)-1),\"\")","v":""},{"$f":"IF(OFFSET(DE108_25!$I$23,ROWS($I$23:I39)-1,COLUMNS($I$23:I39)-1)<>\"\",OFFSET(DE108_25!$I$23,ROWS($I$23:I39)-1,COLUMNS($I$23:I39)-1),\"\")","v":""},{"$f":"IF(OFFSET(DE108_25!$J$23,ROWS($J$23:J39)-1,COLUMNS($J$23:J39)-1)<>\"\",OFFSET(DE108_25!$J$23,ROWS($J$23:J39)-1,COLUMNS($J$23:J39)-1),\"\")","v":""},{"$f":"IF(OFFSET(DE108_25!$K$23,ROWS($K$23:K39)-1,COLUMNS($K$23:K39)-1)<>\"\",OFFSET(DE108_25!$K$23,ROWS($K$23:K39)-1,COLUMNS($K$23:K39)-1),\"\")","v":""},{"$f":"IF(OFFSET(DE108_25!$L$23,ROWS($L$23:L39)-1,COLUMNS($L$23:L39)-1)<>\"\",OFFSET(DE108_25!$L$23,ROWS($L$23:L39)-1,COLUMNS($L$23:L39)-1),\"\")","v":""},{"$f":"IF(OFFSET(DE108_25!$M$23,ROWS($M$23:M39)-1,COLUMNS($M$23:M39)-1)<>\"\",OFFSET(DE108_25!$M$23,ROWS($M$23:M39)-1,COLUMNS($M$23:M39)-1),\"\")","v":""},{"$f":"IF(OFFSET(DE108_25!$N$23,ROWS($N$23:N39)-1,COLUMNS($N$23:N39)-1)<>\"\",OFFSET(DE108_25!$N$23,ROWS($N$23:N39)-1,COLUMNS($N$23:N39)-1),\"\")","v":""},{"$f":"IF(OFFSET(DE108_25!$O$23,ROWS($O$23:O39)-1,COLUMNS($O$23:O39)-1)<>\"\",OFFSET(DE108_25!$O$23,ROWS($O$23:O39)-1,COLUMNS($O$23:O39)-1),\"\")","v":""}]
[{"$f":"IF(OFFSET(DE108_25!$C$23,ROWS($C$23:C40)-1,COLUMNS($C$23:C40)-1)<>\"\",OFFSET(DE108_25!$C$23,ROWS($C$23:C40)-1,COLUMNS($C$23:C40)-1),\"\")","v":""},{"$f":"IF(OFFSET(DE108_25!$D$23,ROWS($D$23:D40)-1,COLUMNS($D$23:D40)-1)<>\"\",OFFSET(DE108_25!$D$23,ROWS($D$23:D40)-1,COLUMNS($D$23:D40)-1),\"\")","v":""},{"$f":"IF(OFFSET(DE108_25!$E$23,ROWS($E$23:E40)-1,COLUMNS($E$23:E40)-1)<>\"\",OFFSET(DE108_25!$E$23,ROWS($E$23:E40)-1,COLUMNS($E$23:E40)-1),\"\")","v":""},{"$f":"IF(OFFSET(DE108_25!$F$23,ROWS($F$23:F40)-1,COLUMNS($F$23:F40)-1)<>\"\",OFFSET(DE108_25!$F$23,ROWS($F$23:F40)-1,COLUMNS($F$23:F40)-1),\"\")","v":""},{"$f":"IF(OFFSET(DE108_25!$G$23,ROWS($G$23:G40)-1,COLUMNS($G$23:G40)-1)<>\"\",OFFSET(DE108_25!$G$23,ROWS($G$23:G40)-1,COLUMNS($G$23:G40)-1),\"\")","v":""},{"$f":"IF(OFFSET(DE108_25!$H$23,ROWS($H$23:H40)-1,COLUMNS($H$23:H40)-1)<>\"\",OFFSET(DE108_25!$H$23,ROWS($H$23:H40)-1,COLUMNS($H$23:H40)-1),\"\")","v":""},{"$f":"IF(OFFSET(DE108_25!$I$23,ROWS($I$23:I40)-1,COLUMNS($I$23:I40)-1)<>\"\",OFFSET(DE108_25!$I$23,ROWS($I$23:I40)-1,COLUMNS($I$23:I40)-1),\"\")","v":""},{"$f":"IF(OFFSET(DE108_25!$J$23,ROWS($J$23:J40)-1,COLUMNS($J$23:J40)-1)<>\"\",OFFSET(DE108_25!$J$23,ROWS($J$23:J40)-1,COLUMNS($J$23:J40)-1),\"\")","v":""},{"$f":"IF(OFFSET(DE108_25!$K$23,ROWS($K$23:K40)-1,COLUMNS($K$23:K40)-1)<>\"\",OFFSET(DE108_25!$K$23,ROWS($K$23:K40)-1,COLUMNS($K$23:K40)-1),\"\")","v":""},{"$f":"IF(OFFSET(DE108_25!$L$23,ROWS($L$23:L40)-1,COLUMNS($L$23:L40)-1)<>\"\",OFFSET(DE108_25!$L$23,ROWS($L$23:L40)-1,COLUMNS($L$23:L40)-1),\"\")","v":""},{"$f":"IF(OFFSET(DE108_25!$M$23,ROWS($M$23:M40)-1,COLUMNS($M$23:M40)-1)<>\"\",OFFSET(DE108_25!$M$23,ROWS($M$23:M40)-1,COLUMNS($M$23:M40)-1),\"\")","v":""},{"$f":"IF(OFFSET(DE108_25!$N$23,ROWS($N$23:N40)-1,COLUMNS($N$23:N40)-1)<>\"\",OFFSET(DE108_25!$N$23,ROWS($N$23:N40)-1,COLUMNS($N$23:N40)-1),\"\")","v":""},{"$f":"IF(OFFSET(DE108_25!$O$23,ROWS($O$23:O40)-1,COLUMNS($O$23:O40)-1)<>\"\",OFFSET(DE108_25!$O$23,ROWS($O$23:O40)-1,COLUMNS($O$23:O40)-1),\"\")","v":""}]
[{"$f":"IF(OFFSET(DE108_25!$C$23,ROWS($C$23:C41)-1,COLUMNS($C$23:C41)-1)<>\"\",OFFSET(DE108_25!$C$23,ROWS($C$23:C41)-1,COLUMNS($C$23:C41)-1),\"\")","v":""},{"$f":"IF(OFFSET(DE108_25!$D$23,ROWS($D$23:D41)-1,COLUMNS($D$23:D41)-1)<>\"\",OFFSET(DE108_25!$D$23,ROWS($D$23:D41)-1,COLUMNS($D$23:D41)-1),\"\")","v":""},{"$f":"IF(OFFSET(DE108_25!$E$23,ROWS($E$23:E41)-1,COLUMNS($E$23:E41)-1)<>\"\",OFFSET(DE108_25!$E$23,ROWS($E$23:E41)-1,COLUMNS($E$23:E41)-1),\"\")","v":""},{"$f":"IF(OFFSET(DE108_25!$F$23,ROWS($F$23:F41)-1,COLUMNS($F$23:F41)-1)<>\"\",OFFSET(DE108_25!$F$23,ROWS($F$23:F41)-1,COLUMNS($F$23:F41)-1),\"\")","v":""},{"$f":"IF(OFFSET(DE108_25!$G$23,ROWS($G$23:G41)-1,COLUMNS($G$23:G41)-1)<>\"\",OFFSET(DE108_25!$G$23,ROWS($G$23:G41)-1,COLUMNS($G$23:G41)-1),\"\")","v":""},{"$f":"IF(OFFSET(DE108_25!$H$23,ROWS($H$23:H41)-1,COLUMNS($H$23:H41)-1)<>\"\",OFFSET(DE108_25!$H$23,ROWS($H$23:H41)-1,COLUMNS($H$23:H41)-1),\"\")","v":""},{"$f":"IF(OFFSET(DE108_25!$I$23,ROWS($I$23:I41)-1,COLUMNS($I$23:I41)-1)<>\"\",OFFSET(DE108_25!$I$23,ROWS($I$23:I41)-1,COLUMNS($I$23:I41)-1),\"\")","v":""},{"$f":"IF(OFFSET(DE108_25!$J$23,ROWS($J$23:J41)-1,COLUMNS($J$23:J41)-1)<>\"\",OFFSET(DE108_25!$J$23,ROWS($J$23:J41)-1,COLUMNS($J$23:J41)-1),\"\")","v":""},{"$f":"IF(OFFSET(DE108_25!$K$23,ROWS($K$23:K41)-1,COLUMNS($K$23:K41)-1)<>\"\",OFFSET(DE108_25!$K$23,ROWS($K$23:K41)-1,COLUMNS($K$23:K41)-1),\"\")","v":""},{"$f":"IF(OFFSET(DE108_25!$L$23,ROWS($L$23:L41)-1,COLUMNS($L$23:L41)-1)<>\"\",OFFSET(DE108_25!$L$23,ROWS($L$23:L41)-1,COLUMNS($L$23:L41)-1),\"\")","v":""},{"$f":"IF(OFFSET(DE108_25!$M$23,ROWS($M$23:M41)-1,COLUMNS($M$23:M41)-1)<>\"\",OFFSET(DE108_25!$M$23,ROWS($M$23:M41)-1,COLUMNS($M$23:M41)-1),\"\")","v":""},{"$f":"IF(OFFSET(DE108_25!$N$23,ROWS($N$23:N41)-1,COLUMNS($N$23:N41)-1)<>\"\",OFFSET(DE108_25!$N$23,ROWS($N$23:N41)-1,COLUMNS($N$23:N41)-1),\"\")","v":""},{"$f":"IF(OFFSET(DE108_25!$O$23,ROWS($O$23:O41)-1,COLUMNS($O$23:O41)-1)<>\"\",OFFSET(DE108_25!$O$23,ROWS($O$23:O41)-1,COLUMNS($O$23:O41)-1),\"\")","v":""}]
[{"$f":"IF(OFFSET(DE108_25!$C$23,ROWS($C$23:C42)-1,COLUMNS($C$23:C42)-1)<>\"\",OFFSET(DE108_25!$C$23,ROWS($C$23:C42)-1,COLUMNS($C$23:C42)-1),\"\")","v":""},{"$f":"IF(OFFSET(DE108_25!$D$23,ROWS($D$23:D42)-1,COLUMNS($D$23:D42)-1)<>\"\",OFFSET(DE108_25!$D$23,ROWS($D$23:D42)-1,COLUMNS($D$23:D42)-1),\"\")","v":""},{"$f":"IF(OFFSET(DE108_25!$E$23,ROWS($E$23:E42)-1,COLUMNS($E$23:E42)-1)<>\"\",OFFSET(DE108_25!$E$23,ROWS($E$23:E42)-1,COLUMNS($E$23:E42)-1),\"\")","v":""},{"$f":"IF(OFFSET(DE108_25!$F$23,ROWS($F$23:F42)-1,COLUMNS($F$23:F42)-1)<>\"\",OFFSET(DE108_25!$F$23,ROWS($F$23:F42)-1,COLUMNS($F$23:F42)-1),\"\")","v":""},{"$f":"IF(OFFSET(DE108_25!$G$23,ROWS($G$23:G42)-1,COLUMNS($G$23:G42)-1)<>\"\",OFFSET(DE108_25!$G$23,ROWS($G$23:G42)-1,COLUMNS($G$23:G42)-1),\"\")","v":""},{"$f":"IF(OFFSET(DE108_25!$H$23,ROWS($H$23:H42)-1,COLUMNS($H$23:H42)-1)<>\"\",OFFSET(DE108_25!$H$23,ROWS($H$23:H42)-1,COLUMNS($H$23:H42)-1),\"\")","v":""},{"$f":"IF(OFFSET(DE108_25!$I$23,ROWS($I$23:I42)-1,COLUMNS($I$23:I42)-1)<>\"\",OFFSET(DE108_25!$I$23,ROWS($I$23:I42)-1,COLUMNS($I$23:I42)-1),\"\")","v":""},{"$f":"IF(OFFSET(DE108_25!$J$23,ROWS($J$23:J42)-1,COLUMNS($J$23:J42)-1)<>\"\",OFFSET(DE108_25!$J$23,ROWS($J$23:J42)-1,COLUMNS($J$23:J42)-1),\"\")","v":""},{"$f":"IF(OFFSET(DE108_25!$K$23,ROWS($K$23:K42)-1,COLUMNS($K$23:K42)-1)<>\"\",OFFSET(DE108_25!$K$23,ROWS($K$23:K42)-1,COLUMNS($K$23:K42)-1),\"\")","v":""},{"$f":"IF(OFFSET(DE108_25!$L$23,ROWS($L$23:L42)-1,COLUMNS($L$23:L42)-1)<>\"\",OFFSET(DE108_25!$L$23,ROWS($L$23:L42)-1,COLUMNS($L$23:L42)-1),\"\")","v":""},{"$f":"IF(OFFSET(DE108_25!$M$23,ROWS($M$23:M42)-1,COLUMNS($M$23:M42)-1)<>\"\",OFFSET(DE108_25!$M$23,ROWS($M$23:M42)-1,COLUMNS($M$23:M42)-1),\"\")","v":""},{"$f":"IF(OFFSET(DE108_25!$N$23,ROWS($N$23:N42)-1,COLUMNS($N$23:N42)-1)<>\"\",OFFSET(DE108_25!$N$23,ROWS($N$23:N42)-1,COLUMNS($N$23:N42)-1),\"\")","v":""},{"$f":"IF(OFFSET(DE108_25!$O$23,ROWS($O$23:O42)-1,COLUMNS($O$23:O42)-1)<>\"\",OFFSET(DE108_25!$O$23,ROWS($O$23:O42)-1,COLUMNS($O$23:O42)-1),\"\")","v":""}]
[{"$f":"IF(OFFSET(DE108_25!$C$23,ROWS($C$23:C43)-1,COLUMNS($C$23:C43)-1)<>\"\",OFFSET(DE108_25!$C$23,ROWS($C$23:C43)-1,COLUMNS($C$23:C43)-1),\"\")","v":""},{"$f":"IF(OFFSET(DE108_25!$D$23,ROWS($D$23:D43)-1,COLUMNS($D$23:D43)-1)<>\"\",OFFSET(DE108_25!$D$23,ROWS($D$23:D43)-1,COLUMNS($D$23:D43)-1),\"\")","v":""},{"$f":"IF(OFFSET(DE108_25!$E$23,ROWS($E$23:E43)-1,COLUMNS($E$23:E43)-1)<>\"\",OFFSET(DE108_25!$E$23,ROWS($E$23:E43)-1,COLUMNS($E$23:E43)-1),\"\")","v":""},{"$f":"IF(OFFSET(DE108_25!$F$23,ROWS($F$23:F43)-1,COLUMNS($F$23:F43)-1)<>\"\",OFFSET(DE108_25!$F$23,ROWS($F$23:F43)-1,COLUMNS($F$23:F43)-1),\"\")","v":""},{"$f":"IF(OFFSET(DE108_25!$G$23,ROWS($G$23:G43)-1,COLUMNS($G$23:G43)-1)<>\"\",OFFSET(DE108_25!$G$23,ROWS($G$23:G43)-1,COLUMNS($G$23:G43)-1),\"\")","v":""},{"$f":"IF(OFFSET(DE108_25!$H$23,ROWS($H$23:H43)-1,COLUMNS($H$23:H43)-1)<>\"\",OFFSET(DE108_25!$H$23,ROWS($H$23:H43)-1,COLUMNS($H$23:H43)-1),\"\")","v":""},{"$f":"IF(OFFSET(DE108_25!$I$23,ROWS($I$23:I43)-1,COLUMNS($I$23:I43)-1)<>\"\",OFFSET(DE108_25!$I$23,ROWS($I$23:I43)-1,COLUMNS($I$23:I43)-1),\"\")","v":""},{"$f":"IF(OFFSET(DE108_25!$J$23,ROWS($J$23:J43)-1,COLUMNS($J$23:J43)-1)<>\"\",OFFSET(DE108_25!$J$23,ROWS($J$23:J43)-1,COLUMNS($J$23:J43)-1),\"\")","v":""},{"$f":"IF(OFFSET(DE108_25!$K$23,ROWS($K$23:K43)-1,COLUMNS($K$23:K43)-1)<>\"\",OFFSET(DE108_25!$K$23,ROWS($K$23:K43)-1,COLUMNS($K$23:K43)-1),\"\")","v":""},{"$f":"IF(OFFSET(DE108_25!$L$23,ROWS($L$23:L43)-1,COLUMNS($L$23:L43)-1)<>\"\",OFFSET(DE108_25!$L$23,ROWS($L$23:L43)-1,COLUMNS($L$23:L43)-1),\"\")","v":""},{"$f":"IF(OFFSET(DE108_25!$M$23,ROWS($M$23:M43)-1,COLUMNS($M$23:M43)-1)<>\"\",OFFSET(DE108_25!$M$23,ROWS($M$23:M43)-1,COLUMNS($M$23:M43)-1),\"\")","v":""},{"$f":"IF(OFFSET(DE108_25!$N$23,ROWS($N$23:N43)-1,COLUMNS($N$23:N43)-1)<>\"\",OFFSET(DE108_25!$N$23,ROWS($N$23:N43)-1,COLUMNS($N$23:N43)-1),\"\")","v":""},{"$f":"IF(OFFSET(DE108_25!$O$23,ROWS($O$23:O43)-1,COLUMNS($O$23:O43)-1)<>\"\",OFFSET(DE108_25!$O$23,ROWS($O$23:O43)-1,COLUMNS($O$23:O43)-1),\"\")","v":""}]

{"sheet":"108_26A","index":10,"n_rows":67,"n_cols":1,"rows_kept":67,"cut":false,"hidden":false,"merged":[[2,0,3,0]]}
["108-26A"]
["2008-08-01"]
["STAGING NOTES"]
[]
[{"$f":"IF(OFFSET(DE108_26A!$C$18,ROWS($C$18:C18)-1,COLUMNS($C$18:C18)-1)<>\"\",OFFSET(DE108_26A!$C$18,ROWS($C$18:C18)-1,COLUMNS($C$18:C18)-1),\"\")","v":"STAGE 1:"}]
[{"$f":"IF(OFFSET(DE108_26A!$C$18,ROWS($C$18:C19)-1,COLUMNS($C$18:C19)-1)<>\"\",OFFSET(DE108_26A!$C$18,ROWS($C$18:C19)-1,COLUMNS($C$18:C19)-1),\"\")","v":"Grade and pave crossover 2"}]
[{"$f":"IF(OFFSET(DE108_26A!$C$18,ROWS($C$18:C20)-1,COLUMNS($C$18:C20)-1)<>\"\",OFFSET(DE108_26A!$C$18,ROWS($C$18:C20)-1,COLUMNS($C$18:C20)-1),\"\")","v":""}]
[{"$f":"IF(OFFSET(DE108_26A!$C$18,ROWS($C$18:C21)-1,COLUMNS($C$18:C21)-1)<>\"\",OFFSET(DE108_26A!$C$18,ROWS($C$18:C21)-1,COLUMNS($C$18:C21)-1),\"\")","v":""}]
[{"$f":"IF(OFFSET(DE108_26A!$C$18,ROWS($C$18:C22)-1,COLUMNS($C$18:C22)-1)<>\"\",OFFSET(DE108_26A!$C$18,ROWS($C$18:C22)-1,COLUMNS($C$18:C22)-1),\"\")","v":"STAGE 2:"}]
[{"$f":"IF(OFFSET(DE108_26A!$C$18,ROWS($C$18:C23)-1,COLUMNS($C$18:C23)-1)<>\"\",OFFSET(DE108_26A!$C$18,ROWS($C$18:C23)-1,COLUMNS($C$18:C23)-1),\"\")","v":"Traffic:"}]
[{"$f":"IF(OFFSET(DE108_26A!$C$18,ROWS($C$18:C24)-1,COLUMNS($C$18:C24)-1)<>\"\",OFFSET(DE108_26A!$C$18,ROWS($C$18:C24)-1,COLUMNS($C$18:C24)-1),\"\")","v":"US 30 on existing WB lanes"}]
[{"$f":"IF(OFFSET(DE108_26A!$C$18,ROWS($C$18:C25)-1,COLUMNS($C$18:C25)-1)<>\"\",OFFSET(DE108_26A!$C$18,ROWS($C$18:C25)-1,COLUMNS($C$18:C25)-1),\"\")","v":"US 218 on detour"}]
[{"$f":"IF(OFFSET(DE108_26A!$C$18,ROWS($C$18:C26)-1,COLUMNS($C$18:C26)-1)<>\"\",OFFSET(DE108_26A!$C$18,ROWS($C$18:C26)-1,COLUMNS($C$18:C26)-1),\"\")","v":"24th Avenue closed"}]
[{"$f":"IF(OFFSET(DE108_26A!$C$18,ROWS($C$18:C27)-1,COLUMNS($C$18:C27)-1)<>\"\",OFFSET(DE108_26A!$C$18,ROWS($C$18:C27)-1,COLUMNS($C$18:C27)-1),\"\")","v":"23rd Avenue open to the north, closed to the south"}]
[{"$f":"IF(OFFSET(DE108_26A!$C$18,ROWS($C$18:C28)-1,COLUMNS($C$18:C28)-1)<>\"\",OFFSET(DE108_26A!$C$18,ROWS($C$18:C28)-1,COLUMNS($C$18:C28)-1),\"\")","v":""}]
[{"$f":"IF(OFFSET(DE108_26A!$C$18,ROWS($C$18:C29)-1,COLUMNS($C$18:C29)-1)<>\"\",OFFSET(DE108_26A!$C$18,ROWS($C$18:C29)-1,COLUMNS($C$18:C29)-1),\"\")","v":"Construction:"}]
[{"$f":"IF(OFFSET(DE108_26A!$C$18,ROWS($C$18:C30)-1,COLUMNS($C$18:C30)-1)<>\"\",OFFSET(DE108_26A!$C$18,ROWS($C$18:C30)-1,COLUMNS($C$18:C30)-1),\"\")","v":"Grade and pave new EB lanes from Sta. 1380+00 to Sta. 1516+70"}]
[{"$f":"IF(OFFSET(DE108_26A!$C$18,ROWS($C$18:C31)-1,COLUMNS($C$18:C31)-1)<>\"\",OFFSET(DE108_26A!$C$18,ROWS($C$18:C31)-1,COLUMNS($C$18:C31)-1),\"\")","v":"Grade and surface 23rd Avenue south of US 30"}]
[{"$f":"IF(OFFSET(DE108_26A!$C$18,ROWS($C$18:C32)-1,COLUMNS($C$18:C32)-1)<>\"\",OFFSET(DE108_26A!$C$18,ROWS($C$18:C32)-1,COLUMNS($C$18:C32)-1),\"\")","v":"Grade and pave proposed crossover 1"}]
[{"$f":"IF(OFFSET(DE108_26A!$C$18,ROWS($C$18:C33)-1,COLUMNS($C$18:C33)-1)<>\"\",OFFSET(DE108_26A!$C$18,ROWS($C$18:C33)-1,COLUMNS($C$18:C33)-1),\"\")","v":""}]
[{"$f":"IF(OFFSET(DE108_26A!$C$18,ROWS($C$18:C34)-1,COLUMNS($C$18:C34)-1)<>\"\",OFFSET(DE108_26A!$C$18,ROWS($C$18:C34)-1,COLUMNS($C$18:C34)-1),\"\")","v":""}]
[{"$f":"IF(OFFSET(DE108_26A!$C$18,ROWS($C$18:C35)-1,COLUMNS($C$18:C35)-1)<>\"\",OFFSET(DE108_26A!$C$18,ROWS($C$18:C35)-1,COLUMNS($C$18:C35)-1),\"\")","v":"STAGE 3: "}]
[{"$f":"IF(OFFSET(DE108_26A!$C$18,ROWS($C$18:C36)-1,COLUMNS($C$18:C36)-1)<>\"\",OFFSET(DE108_26A!$C$18,ROWS($C$18:C36)-1,COLUMNS($C$18:C36)-1),\"\")","v":"Traffic:"}]
[{"$f":"IF(OFFSET(DE108_26A!$C$18,ROWS($C$18:C37)-1,COLUMNS($C$18:C37)-1)<>\"\",OFFSET(DE108_26A!$C$18,ROWS($C$18:C37)-1,COLUMNS($C$18:C37)-1),\"\")","v":"US 30 new existing EB lanes"}]
[{"$f":"IF(OFFSET(DE108_26A!$C$18,ROWS($C$18:C38)-1,COLUMNS($C$18:C38)-1)<>\"\",OFFSET(DE108_26A!$C$18,ROWS($C$18:C38)-1,COLUMNS($C$18:C38)-1),\"\")","v":"US 218 on detour"}]
[{"$f":"IF(OFFSET(DE108_26A!$C$18,ROWS($C$18:C39)-1,COLUMNS($C$18:C39)-1)<>\"\",OFFSET(DE108_26A!$C$18,ROWS($C$18:C39)-1,COLUMNS($C$18:C39)-1),\"\")","v":"24th Avenue closed"}]
[{"$f":"IF(OFFSET(DE108_26A!$C$18,ROWS($C$18:C40)-1,COLUMNS($C$18:C40)-1)<>\"\",OFFSET(DE108_26A!$C$18,ROWS($C$18:C40)-1,COLUMNS($C$18:C40)-1),\"\")","v":"23rd Avenue open to the south, closed to the north"}]
[{"$f":"IF(OFFSET(DE108_26A!$C$18,ROWS($C$18:C41)-1,COLUMNS($C$18:C41)-1)<>\"\",OFFSET(DE108_26A!$C$18,ROWS($C$18:C41)-1,COLUMNS($C$18:C41)-1),\"\")","v":""}]
[{"$f":"IF(OFFSET(DE108_26A!$C$18,ROWS($C$18:C42)-1,COLUMNS($C$18:C42)-1)<>\"\",OFFSET(DE108_26A!$C$18,ROWS($C$18:C42)-1,COLUMNS($C$18:C42)-1),\"\")","v":""}]
[{"$f":"IF(OFFSET(DE108_26A!$C$18,ROWS($C$18:C43)-1,COLUMNS($C$18:C43)-1)<>\"\",OFFSET(DE108_26A!$C$18,ROWS($C$18:C43)-1,COLUMNS($C$18:C43)-1),\"\")","v":"Construction:"}]
[{"$f":"IF(OFFSET(DE108_26A!$C$18,ROWS($C$18:C44)-1,COLUMNS($C$18:C44)-1)<>\"\",OFFSET(DE108_26A!$C$18,ROWS($C$18:C44)-1,COLUMNS($C$18:C44)-1),\"\")","v":"Grade and pave new WB lanes from Sta. 1389+00 to Sta. 1516+70"}]
[{"$f":"IF(OFFSET(DE108_26A!$C$18,ROWS($C$18:C45)-1,COLUMNS($C$18:C45)-1)<>\"\",OFFSET(DE108_26A!$C$18,ROWS($C$18:C45)-1,COLUMNS($C$18:C45)-1),\"\")","v":"Grade and surface 23rd Avenue north of US 30"}]
[{"$f":"IF(OFFSET(DE108_26A!$C$18,ROWS($C$18:C46)-1,COLUMNS($C$18:C46)-1)<>\"\",OFFSET(DE108_26A!$C$18,ROWS($C$18:C46)-1,COLUMNS($C$18:C46)-1),\"\")","v":"Finish grade and pave Ramps A - D."}]
[{"$f":"IF(OFFSET(DE108_26A!$C$18,ROWS($C$18:C47)-1,COLUMNS($C$18:C47)-1)<>\"\",OFFSET(DE108_26A!$C$18,ROWS($C$18:C47)-1,COLUMNS($C$18:C47)-1),\"\")","v":"Grade and pave proposed crossover 3"}]
[{"$f":"IF(OFFSET(DE108_26A!$C$18,ROWS($C$18:C48)-1,COLUMNS($C$18:C48)-1)<>\"\",OFFSET(DE108_26A!$C$18,ROWS($C$18:C48)-1,COLUMNS($C$18:C48)-1),\"\")","v":""}]
[{"$f":"IF(OFFSET(DE108_26A!$C$18,ROWS($C$18:C49)-1,COLUMNS($C$18:C49)-1)<>\"\",OFFSET(DE108_26A!$C$18,ROWS($C$18:C49)-1,COLUMNS($C$18:C49)-1),\"\")","v":""}]
[{"$f":"IF(OFFSET(DE108_26A!$C$18,ROWS($C$18:C50)-1,COLUMNS($C$18:C50)-1)<>\"\",OFFSET(DE108_26A!$C$18,ROWS($C$18:C50)-1,COLUMNS($C$18:C50)-1),\"\")","v":"STAGE 4:"}]
[{"$f":"IF(OFFSET(DE108_26A!$C$18,ROWS($C$18:C51)-1,COLUMNS($C$18:C51)-1)<>\"\",OFFSET(DE108_26A!$C$18,ROWS($C$18:C51)-1,COLUMNS($C$18:C51)-1),\"\")","v":"Traffic:"}]
[{"$f":"IF(OFFSET(DE108_26A!$C$18,ROWS($C$18:C52)-1,COLUMNS($C$18:C52)-1)<>\"\",OFFSET(DE108_26A!$C$18,ROWS($C$18:C52)-1,COLUMNS($C$18:C52)-1),\"\")","v":"Traffic in normal lanes"}]
[{"$f":"IF(OFFSET(DE108_26A!$C$18,ROWS($C$18:C53)-1,COLUMNS($C$18:C53)-1)<>\"\",OFFSET(DE108_26A!$C$18,ROWS($C$18:C53)-1,COLUMNS($C$18:C53)-1),\"\")","v":""}]
[{"$f":"IF(OFFSET(DE108_26A!$C$18,ROWS($C$18:C54)-1,COLUMNS($C$18:C54)-1)<>\"\",OFFSET(DE108_26A!$C$18,ROWS($C$18:C54)-1,COLUMNS($C$18:C54)-1),\"\")","v":"Construction:"}]
[{"$f":"IF(OFFSET(DE108_26A!$C$18,ROWS($C$18:C55)-1,COLUMNS($C$18:C55)-1)<>\"\",OFFSET(DE108_26A!$C$18,ROWS($C$18:C55)-1,COLUMNS($C$18:C55)-1),\"\")","v":"Complete"}]
[{"$f":"IF(OFFSET(DE108_26A!$C$18,ROWS($C$18:C56)-1,COLUMNS($C$18:C56)-1)<>\"\",OFFSET(DE108_26A!$C$18,ROWS($C$18:C56)-1,COLUMNS($C$18:C56)-1),\"\")","v":""}]
[{"$f":"IF(OFFSET(DE108_26A!$C$18,ROWS($C$18:C57)-1,COLUMNS($C$18:C57)-1)<>\"\",OFFSET(DE108_26A!$C$18,ROWS($C$18:C57)-1,COLUMNS($C$18:C57)-1),\"\")","v":""}]
[{"$f":"IF(OFFSET(DE108_26A!$C$18,ROWS($C$18:C58)-1,COLUMNS($C$18:C58)-1)<>\"\",OFFSET(DE108_26A!$C$18,ROWS($C$18:C58)-1,COLUMNS($C$18:C58)-1),\"\")","v":""}]
[{"$f":"IF(OFFSET(DE108_26A!$C$18,ROWS($C$18:C59)-1,COLUMNS($C$18:C59)-1)<>\"\",OFFSET(DE108_26A!$C$18,ROWS($C$18:C59)-1,COLUMNS($C$18:C59)-1),\"\")","v":""}]
[{"$f":"IF(OFFSET(DE108_26A!$C$18,ROWS($C$18:C60)-1,COLUMNS($C$18:C60)-1)<>\"\",OFFSET(DE108_26A!$C$18,ROWS($C$18:C60)-1,COLUMNS($C$18:C60)-1),\"\")","v":""}]
[{"$f":"IF(OFFSET(DE108_26A!$C$18,ROWS($C$18:C61)-1,COLUMNS($C$18:C61)-1)<>\"\",OFFSET(DE108_26A!$C$18,ROWS($C$18:C61)-1,COLUMNS($C$18:C61)-1),\"\")","v":""}]
[{"$f":"IF(OFFSET(DE108_26A!$C$18,ROWS($C$18:C62)-1,COLUMNS($C$18:C62)-1)<>\"\",OFFSET(DE108_26A!$C$18,ROWS($C$18:C62)-1,COLUMNS($C$18:C62)-1),\"\")","v":""}]
[{"$f":"IF(OFFSET(DE108_26A!$C$18,ROWS($C$18:C63)-1,COLUMNS($C$18:C63)-1)<>\"\",OFFSET(DE108_26A!$C$18,ROWS($C$18:C63)-1,COLUMNS($C$18:C63)-1),\"\")","v":""}]
[{"$f":"IF(OFFSET(DE108_26A!$C$18,ROWS($C$18:C64)-1,COLUMNS($C$18:C64)-1)<>\"\",OFFSET(DE108_26A!$C$18,ROWS($C$18:C64)-1,COLUMNS($C$18:C64)-1),\"\")","v":""}]
[{"$f":"IF(OFFSET(DE108_26A!$C$18,ROWS($C$18:C65)-1,COLUMNS($C$18:C65)-1)<>\"\",OFFSET(DE108_26A!$C$18,ROWS($C$18:C65)-1,COLUMNS($C$18:C65)-1),\"\")","v":""}]
[{"$f":"IF(OFFSET(DE108_26A!$C$18,ROWS($C$18:C66)-1,COLUMNS($C$18:C66)-1)<>\"\",OFFSET(DE108_26A!$C$18,ROWS($C$18:C66)-1,COLUMNS($C$18:C66)-1),\"\")","v":""}]
[{"$f":"IF(OFFSET(DE108_26A!$C$18,ROWS($C$18:C67)-1,COLUMNS($C$18:C67)-1)<>\"\",OFFSET(DE108_26A!$C$18,ROWS($C$18:C67)-1,COLUMNS($C$18:C67)-1),\"\")","v":""}]
[{"$f":"IF(OFFSET(DE108_26A!$C$18,ROWS($C$18:C68)-1,COLUMNS($C$18:C68)-1)<>\"\",OFFSET(DE108_26A!$C$18,ROWS($C$18:C68)-1,COLUMNS($C$18:C68)-1),\"\")","v":""}]
[{"$f":"IF(OFFSET(DE108_26A!$C$18,ROWS($C$18:C69)-1,COLUMNS($C$18:C69)-1)<>\"\",OFFSET(DE108_26A!$C$18,ROWS($C$18:C69)-1,COLUMNS($C$18:C69)-1),\"\")","v":""}]
[{"$f":"IF(OFFSET(DE108_26A!$C$18,ROWS($C$18:C70)-1,COLUMNS($C$18:C70)-1)<>\"\",OFFSET(DE108_26A!$C$18,ROWS($C$18:C70)-1,COLUMNS($C$18:C70)-1),\"\")","v":""}]
[{"$f":"IF(OFFSET(DE108_26A!$C$18,ROWS($C$18:C71)-1,COLUMNS($C$18:C71)-1)<>\"\",OFFSET(DE108_26A!$C$18,ROWS($C$18:C71)-1,COLUMNS($C$18:C71)-1),\"\")","v":""}]
[{"$f":"IF(OFFSET(DE108_26A!$C$18,ROWS($C$18:C72)-1,COLUMNS($C$18:C72)-1)<>\"\",OFFSET(DE108_26A!$C$18,ROWS($C$18:C72)-1,COLUMNS($C$18:C72)-1),\"\")","v":""}]
[{"$f":"IF(OFFSET(DE108_26A!$C$18,ROWS($C$18:C73)-1,COLUMNS($C$18:C73)-1)<>\"\",OFFSET(DE108_26A!$C$18,ROWS($C$18:C73)-1,COLUMNS($C$18:C73)-1),\"\")","v":""}]
[{"$f":"IF(OFFSET(DE108_26A!$C$18,ROWS($C$18:C74)-1,COLUMNS($C$18:C74)-1)<>\"\",OFFSET(DE108_26A!$C$18,ROWS($C$18:C74)-1,COLUMNS($C$18:C74)-1),\"\")","v":""}]
[{"$f":"IF(OFFSET(DE108_26A!$C$18,ROWS($C$18:C75)-1,COLUMNS($C$18:C75)-1)<>\"\",OFFSET(DE108_26A!$C$18,ROWS($C$18:C75)-1,COLUMNS($C$18:C75)-1),\"\")","v":""}]
[{"$f":"IF(OFFSET(DE108_26A!$C$18,ROWS($C$18:C76)-1,COLUMNS($C$18:C76)-1)<>\"\",OFFSET(DE108_26A!$C$18,ROWS($C$18:C76)-1,COLUMNS($C$18:C76)-1),\"\")","v":""}]
[{"$f":"IF(OFFSET(DE108_26A!$C$18,ROWS($C$18:C77)-1,COLUMNS($C$18:C77)-1)<>\"\",OFFSET(DE108_26A!$C$18,ROWS($C$18:C77)-1,COLUMNS($C$18:C77)-1),\"\")","v":""}]
[{"$f":"IF(OFFSET(DE108_26A!$C$18,ROWS($C$18:C78)-1,COLUMNS($C$18:C78)-1)<>\"\",OFFSET(DE108_26A!$C$18,ROWS($C$18:C78)-1,COLUMNS($C$18:C78)-1),\"\")","v":""}]
[{"$f":"IF(OFFSET(DE108_26A!$C$18,ROWS($C$18:C79)-1,COLUMNS($C$18:C79)-1)<>\"\",OFFSET(DE108_26A!$C$18,ROWS($C$18:C79)-1,COLUMNS($C$18:C79)-1),\"\")","v":""}]
[{"$f":"IF(OFFSET(DE108_26A!$C$18,ROWS($C$18:C80)-1,COLUMNS($C$18:C80)-1)<>\"\",OFFSET(DE108_26A!$C$18,ROWS($C$18:C80)-1,COLUMNS($C$18:C80)-1),\"\")","v":""}]

{"sheet":"111_01","index":11,"n_rows":31,"n_cols":2,"rows_kept":31,"cut":false,"hidden":false,"merged":[[0,0,0,1],[1,0,1,1],[2,0,4,1],[5,0,9,1],[10,0,11,0],[10,1,11,1]]}
["111-01"]
["2012-04-17"]
["COORDINATED OPERATIONS"]
[]
[]
["Other work in progress during the same period of time will include the construction of the projects listed. Coordinate operations with those of other contractors working within the same area. "]
[]
[]
[]
[]
["Project","Type of Work"]
[]
[{"$f":"IF(OFFSET(DE111_01!$C$26,ROWS($C$26:C26)-1,COLUMNS($C$26:C26)-1)<>\"\",OFFSET(DE111_01!$C$26,ROWS($C$26:C26)-1,COLUMNS($C$26:C26)-1),\"\")","v":""},{"$f":"IF(OFFSET(DE111_01!$D$26,ROWS($D$26:D26)-1,COLUMNS($D$26:D26)-1)<>\"\",OFFSET(DE111_01!$D$26,ROWS($D$26:D26)-1,COLUMNS($D$26:D26)-1),\"\")","v":""}]
[{"$f":"IF(OFFSET(DE111_01!$C$26,ROWS($C$26:C27)-1,COLUMNS($C$26:C27)-1)<>\"\",OFFSET(DE111_01!$C$26,ROWS($C$26:C27)-1,COLUMNS($C$26:C27)-1),\"\")","v":"NHSX-030-6(189)--3H-86"},{"$f":"IF(OFFSET(DE111_01!$D$26,ROWS($D$26:D27)-1,COLUMNS($D$26:D27)-1)<>\"\",OFFSET(DE111_01!$D$26,ROWS($D$26:D27)-1,COLUMNS($D$26:D27)-1),\"\")","v":"Grading"}]
[{"$f":"IF(OFFSET(DE111_01!$C$26,ROWS($C$26:C28)-1,COLUMNS($C$26:C28)-1)<>\"\",OFFSET(DE111_01!$C$26,ROWS($C$26:C28)-1,COLUMNS($C$26:C28)-1),\"\")","v":"MP-030-6(709)234--76-06"},{"$f":"IF(OFFSET(DE111_01!$D$26,ROWS($D$26:D28)-1,COLUMNS($D$26:D28)-1)<>\"\",OFFSET(DE111_01!$D$26,ROWS($D$26:D28)-1,COLUMNS($D$26:D28)-1),\"\")","v":"PCC Patching"}]
[{"$f":"IF(OFFSET(DE111_01!$C$26,ROWS($C$26:C29)-1,COLUMNS($C$26:C29)-1)<>\"\",OFFSET(DE111_01!$C$26,ROWS($C$26:C29)-1,COLUMNS($C$26:C29)-1),\"\")","v":"NHSN-000-S(943)--2R-00"},{"$f":"IF(OFFSET(DE111_01!$D$26,ROWS($D$26:D29)-1,COLUMNS($D$26:D29)-1)<>\"\",OFFSET(DE111_01!$D$26,ROWS($D$26:D29)-1,COLUMNS($D$26:D29)-1),\"\")","v":"Traffic Signs"}]
[{"$f":"IF(OFFSET(DE111_01!$C$26,ROWS($C$26:C30)-1,COLUMNS($C$26:C30)-1)<>\"\",OFFSET(DE111_01!$C$26,ROWS($C$26:C30)-1,COLUMNS($C$26:C30)-1),\"\")","v":""},{"$f":"IF(OFFSET(DE111_01!$D$26,ROWS($D$26:D30)-1,COLUMNS($D$26:D30)-1)<>\"\",OFFSET(DE111_01!$D$26,ROWS($D$26:D30)-1,COLUMNS($D$26:D30)-1),\"\")","v":""}]
[{"$f":"IF(OFFSET(DE111_01!$C$26,ROWS($C$26:C31)-1,COLUMNS($C$26:C31)-1)<>\"\",OFFSET(DE111_01!$C$26,ROWS($C$26:C31)-1,COLUMNS($C$26:C31)-1),\"\")","v":""},{"$f":"IF(OFFSET(DE111_01!$D$26,ROWS($D$26:D31)-1,COLUMNS($D$26:D31)-1)<>\"\",OFFSET(DE111_01!$D$26,ROWS($D$26:D31)-1,COLUMNS($D$26:D31)-1),\"\")","v":""}]
[{"$f":"IF(OFFSET(DE111_01!$C$26,ROWS($C$26:C32)-1,COLUMNS($C$26:C32)-1)<>\"\",OFFSET(DE111_01!$C$26,ROWS($C$26:C32)-1,COLUMNS($C$26:C32)-1),\"\")","v":""},{"$f":"IF(OFFSET(DE111_01!$D$26,ROWS($D$26:D32)-1,COLUMNS($D$26:D32)-1)<>\"\",OFFSET(DE111_01!$D$26,ROWS($D$26:D32)-1,COLUMNS($D$26:D32)-1),\"\")","v":""}]
[{"$f":"IF(OFFSET(DE111_01!$C$26,ROWS($C$26:C33)-1,COLUMNS($C$26:C33)-1)<>\"\",OFFSET(DE111_01!$C$26,ROWS($C$26:C33)-1,COLUMNS($C$26:C33)-1),\"\")","v":""},{"$f":"IF(OFFSET(DE111_01!$D$26,ROWS($D$26:D33)-1,COLUMNS($D$26:D33)-1)<>\"\",OFFSET(DE111_01!$D$26,ROWS($D$26:D33)-1,COLUMNS($D$26:D33)-1),\"\")","v":""}]
[{"$f":"IF(OFFSET(DE111_01!$C$26,ROWS($C$26:C34)-1,COLUMNS($C$26:C34)-1)<>\"\",OFFSET(DE111_01!$C$26,ROWS($C$26:C34)-1,COLUMNS($C$26:C34)-1),\"\")","v":""},{"$f":"IF(OFFSET(DE111_01!$D$26,ROWS($D$26:D34)-1,COLUMNS($D$26:D34)-1)<>\"\",OFFSET(DE111_01!$D$26,ROWS($D$26:D34)-1,COLUMNS($D$26:D34)-1),\"\")","v":""}]
[{"$f":"IF(OFFSET(DE111_01!$C$26,ROWS($C$26:C35)-1,COLUMNS($C$26:C35)-1)<>\"\",OFFSET(DE111_01!$C$26,ROWS($C$26:C35)-1,COLUMNS($C$26:C35)-1),\"\")","v":""},{"$f":"IF(OFFSET(DE111_01!$D$26,ROWS($D$26:D35)-1,COLUMNS($D$26:D35)-1)<>\"\",OFFSET(DE111_01!$D$26,ROWS($D$26:D35)-1,COLUMNS($D$26:D35)-1),\"\")","v":""}]
[{"$f":"IF(OFFSET(DE111_01!$C$26,ROWS($C$26:C36)-1,COLUMNS($C$26:C36)-1)<>\"\",OFFSET(DE111_01!$C$26,ROWS($C$26:C36)-1,COLUMNS($C$26:C36)-1),\"\")","v":""},{"$f":"IF(OFFSET(DE111_01!$D$26,ROWS($D$26:D36)-1,COLUMNS($D$26:D36)-1)<>\"\",OFFSET(DE111_01!$D$26,ROWS($D$26:D36)-1,COLUMNS($D$26:D36)-1),\"\")","v":""}]
[{"$f":"IF(OFFSET(DE111_01!$C$26,ROWS($C$26:C37)-1,COLUMNS($C$26:C37)-1)<>\"\",OFFSET(DE111_01!$C$26,ROWS($C$26:C37)-1,COLUMNS($C$26:C37)-1),\"\")","v":""},{"$f":"IF(OFFSET(DE111_01!$D$26,ROWS($D$26:D37)-1,COLUMNS($D$26:D37)-1)<>\"\",OFFSET(DE111_01!$D$26,ROWS($D$26:D37)-1,COLUMNS($D$26:D37)-1),\"\")","v":""}]
[{"$f":"IF(OFFSET(DE111_01!$C$26,ROWS($C$26:C38)-1,COLUMNS($C$26:C38)-1)<>\"\",OFFSET(DE111_01!$C$26,ROWS($C$26:C38)-1,COLUMNS($C$26:C38)-1),\"\")","v":""},{"$f":"IF(OFFSET(DE111_01!$D$26,ROWS($D$26:D38)-1,COLUMNS($D$26:D38)-1)<>\"\",OFFSET(DE111_01!$D$26,ROWS($D$26:D38)-1,COLUMNS($D$26:D38)-1),\"\")","v":""}]
[{"$f":"IF(OFFSET(DE111_01!$C$26,ROWS($C$26:C39)-1,COLUMNS($C$26:C39)-1)<>\"\",OFFSET(DE111_01!$C$26,ROWS($C$26:C39)-1,COLUMNS($C$26:C39)-1),\"\")","v":""},{"$f":"IF(OFFSET(DE111_01!$D$26,ROWS($D$26:D39)-1,COLUMNS($D$26:D39)-1)<>\"\",OFFSET(DE111_01!$D$26,ROWS($D$26:D39)-1,COLUMNS($D$26:D39)-1),\"\")","v":""}]
[{"$f":"IF(OFFSET(DE111_01!$C$26,ROWS($C$26:C40)-1,COLUMNS($C$26:C40)-1)<>\"\",OFFSET(DE111_01!$C$26,ROWS($C$26:C40)-1,COLUMNS($C$26:C40)-1),\"\")","v":""},{"$f":"IF(OFFSET(DE111_01!$D$26,ROWS($D$26:D40)-1,COLUMNS($D$26:D40)-1)<>\"\",OFFSET(DE111_01!$D$26,ROWS($D$26:D40)-1,COLUMNS($D$26:D40)-1),\"\")","v":""}]
[{"$f":"IF(OFFSET(DE111_01!$C$26,ROWS($C$26:C41)-1,COLUMNS($C$26:C41)-1)<>\"\",OFFSET(DE111_01!$C$26,ROWS($C$26:C41)-1,COLUMNS($C$26:C41)-1),\"\")","v":""},{"$f":"IF(OFFSET(DE111_01!$D$26,ROWS($D$26:D41)-1,COLUMNS($D$26:D41)-1)<>\"\",OFFSET(DE111_01!$D$26,ROWS($D$26:D41)-1,COLUMNS($D$26:D41)-1),\"\")","v":""}]
[{"$f":"IF(OFFSET(DE111_01!$C$26,ROWS($C$26:C42)-1,COLUMNS($C$26:C42)-1)<>\"\",OFFSET(DE111_01!$C$26,ROWS($C$26:C42)-1,COLUMNS($C$26:C42)-1),\"\")","v":""},{"$f":"IF(OFFSET(DE111_01!$D$26,ROWS($D$26:D42)-1,COLUMNS($D$26:D42)-1)<>\"\",OFFSET(DE111_01!$D$26,ROWS($D$26:D42)-1,COLUMNS($D$26:D42)-1),\"\")","v":""}]
[{"$f":"IF(OFFSET(DE111_01!$C$26,ROWS($C$26:C43)-1,COLUMNS($C$26:C43)-1)<>\"\",OFFSET(DE111_01!$C$26,ROWS($C$26:C43)-1,COLUMNS($C$26:C43)-1),\"\")","v":""},{"$f":"IF(OFFSET(DE111_01!$D$26,ROWS($D$26:D43)-1,COLUMNS($D$26:D43)-1)<>\"\",OFFSET(DE111_01!$D$26,ROWS($D$26:D43)-1,COLUMNS($D$26:D43)-1),\"\")","v":""}]
[{"$f":"IF(OFFSET(DE111_01!$C$26,ROWS($C$26:C44)-1,COLUMNS($C$26:C44)-1)<>\"\",OFFSET(DE111_01!$C$26,ROWS($C$26:C44)-1,COLUMNS($C$26:C44)-1),\"\")","v":""},{"$f":"IF(OFFSET(DE111_01!$D$26,ROWS($D$26:D44)-1,COLUMNS($D$26:D44)-1)<>\"\",OFFSET(DE111_01!$D$26,ROWS($D$26:D44)-1,COLUMNS($D$26:D44)-1),\"\")","v":""}]

{"sheet":"PrintSheetTemplate","index":12,"n_rows":95,"n_cols":179,"rows_kept":95,"cut":false,"hidden":true,"merged":[[93,171,93,178],[94,1,94,178],[93,101,93,106],[93,107,93,118],[93,119,93,148],[93,149,93,158],[93,159,93,164],[93,165,93,170],[93,1,93,7],[93,8,93,14],[93,15,93,21],[93,22,93,30],[93,31,93,64],[93,65,93,100]]}
[" "]
[]
[]
[]
[]
[]
[]
[]
[]
[]
[]
[]
[]
[]
[]
[]
[]
[]
[]
[]
[]
[]
[]
[]
[]
[]
[]
[]
[]
[]
[]
[]
[]
[]
[]
[]
[]
[]
[]
[]
[]
[]
[]
[]
[]
[]
[]
[]
[]
[]
[]
[]
[]
[]
[]
[]
[]
[]
[]
[]
[]
[]
[]
[]
[]
[]
[]
[]
[]
[]
[]
[]
[]
[]
[]
[]
[]
[]
[]
[]
[]
[]
[]
[]
[]
[]
[]
[]
[]
[]
[]
[]
[null,"","","","","","","","","","","","","","","","","","","","","","","","","","","","","","","","","","","","","","","","","","","","","","","","","","","","","","","","","","","","","","","","","","","","","","","","","","","","","","","","","","","","","","","","","","","","","","","","","","","","","","","","","","","","","","","","","","","","","","","","","","","","","","","","","","","","","","","","","","","","","","","","","","","","","","","",null,"","","","","","","","","","","","","","","","","","","","","","","","","",""]
[null,"FILE NO.",null,null,null,null,null,null,{"$f":"IF(ProjectInformation!$B$11<>\"\",ProjectInformation!$B$11,\"\")","v":""},null,null,null,null,null,null,{"$f":"UPPER(ProjectInformation!$B$8)","v":"ENGLISH"},null,null,null,null,null,null,"DESIGN TEAM",null,null,null,null,null,null,null,null,{"$f":"IF(AND(ProjectInformation!$B$3<>\"\",ProjectInformation!$B$4<>\"\",ProjectInformation!$B$5<>\"\"),ProjectInformation!$B$3&\"\\\"&ProjectInformation!$B$4&\"\\\"&ProjectInformation!$B$5,IF(AND(ProjectInformation!$B$3<>\"\",ProjectInformation!$B$4<>\"\"),ProjectInformation!$B$3&\"\\\"&ProjectInformation!$B$4,IF(ProjectInformation!$B$3<>\"\",ProjectInformation!$B$3,\"\")))","v":"Flattery\\Bell"},null,null,null,null,null,null,null,null,null,null,null,null,null,null,null,null,null,null,null,null,null,null,null,null,null,null,null,null,null,null,null,null,null,{"$f":"IF(ProjectInformation!$B$6<>\"\",ProjectInformation!$B$6,\"\")","v":"BENTON"},null,null,null,null,null,null,null,null,null,null,null,null,null,null,null,null,null,null,null,null,null,null,null,null,null,null,null,null,null,null,null,null,null,null,null,"COUNTY",null,null,null,null,null,"PROJECT NUMBER",null,null,null,null,null,null,null,null,null,null,null,{"$f":"IF(ProjectInformation!$B$7<>\"\",ProjectInformation!$B$7,\"\")","v":"NHSX-030-6(231)--3H-06"},null,null,null,null,null,null,null,null,null,null,null,null,null,null,null,null,null,null,null,null,null,null,null,null,null,null,null,null,null,"SHEET NUMBER",null,null,null,null,null,null,null,null,null,null,null,null,null,null,null,{"$f":"IF(FP94<>\"\",\"REVISED\",\"\")","v":""},null,null,null,null,null,{"$f":"IF(ProjectInformation!$B$9<>\"\",ProjectInformation!$B$9,\"\")","v":""}]
[""]

{"sheet":"Note1","index":13,"n_rows":1,"n_cols":1,"rows_kept":1,"cut":false,"hidden":true,"merged":[[0,0,2,0]]}
["SEE V SHEETS FOR ADDITIONAL BID ITEMS AND QUANTITIES"]

{"sheet":"BridgeBlock","index":14,"n_rows":4,"n_cols":14,"rows_kept":4,"cut":false,"hidden":true,"merged":[[2,2,2,8],[3,2,3,7],[2,9,2,12],[3,8,3,12]]}
[2]
[null,"","","","","","","","","","","","",""]
[null,null,"Design No.",null,null,null,null,null,null,{"$f":"IF(#REF!<>\"\",#REF!,\"\")","v":{"$error":"#REF!"}}]
[null,null,"File No.",null,null,null,null,null,{"$f":"IF(#REF!<>\"\",#REF!,\"\")","v":{"$error":"#REF!"}}]

{"sheet":"Index","index":15,"n_rows":164,"n_cols":15,"rows_kept":164,"cut":false,"hidden":true,"merged":[]}
["100-0A","1997-10-28","4.5.5","ADAIR",null,"Live English File Path","W:\\Highway\\Design\\RoadDesignDetails\\ExcelTabs\\",null,"Brian R. Smith","bsmith2","Methods","ROADWAY DESIGN",null,"108_23A(1)","='108_23A'!$A$1:$A$51"]
["100-1A","1997-07-15","10/01/15","ADAMS",null,"Live Metric File Path","W:\\Highway\\Design\\RoadDesignDetails\\ExcelTabs\\MetricTabs\\",null,"Khyle B. Clute","kclute","Methods","ROADWAY DESIGN",null,"108_23B(1)","='108_23B'!$A$1:$AW$15"]
["100-1C","2012-04-17","J","ALLAMAKEE",null,"Index File Path","W:\\Highway\\Design\\RoadDesignDetails\\PDFsandWebFiles\\Indexes\\",null,"Thomas M. Hamski","thamski","Methods","ROADWAY DESIGN",null,"108_25(1)","='108_25'!$A$1:$M$30"]
["100-1D","2005-10-18",null,"APPANOOSE",null,"Index File Name","TNT_EnglishIndexes.xlsx",null,"Wesley L. Mayberry","wmayber","Methods","ROADWAY DESIGN",null,"108_26A(1)","='108_26A'!$A$1:$A$67"]
["100-4A","2002-10-29",null,"AUDUBON",null,"Last Revision English File Path","W:\\Highway\\Design\\RoadDesignDetails\\Old_Details\\ExcelTabs\\",null,"John M. Narigon","jnarigo","Methods","ROADWAY DESIGN",null,"111_01(1)","='111_01'!$A$1:$B$31"]
["100-7","2012-10-16",null,"BENTON",null,"Last Revision Metric File Path","W:\\Highway\\Design\\RoadDesignDetails\\Old_Details\\ExcelTabs\\MetricTabs\\",null,"Christopher Poole","cpoole","Methods","ROADWAY DESIGN"]
["100-10","2011-10-18",null,"BLACK HAWK",null,"Seed Path","W:\\Highway\\Design\\CADD\\SpreadSheets\\ExcelTabulations.xltm",null,"Daniel J. Harness","dharnes","Methods","ROADWAY DESIGN"]
["100-11","2008-08-01",null,"BOONE",null,"VersionCheck Path","W:\\Highway\\Design\\CADD\\SpreadSheets\\ExcelTabulations.xlsm",null,"Jason M. Holst","jholst","Road2","ROADWAY DESIGN"]
["100-12","2008-08-01",null,"BREMER",null,"Standard Road Plan Path","W:\\Highway\\Design\\StandardRoadPlans\\PDFsAndWebFiles\\Indexes\\SRP_EnglishIndex.xls",null,"Jason R. Strum","jstrum","Road1","ROADWAY DESIGN"]
["100-12A","2008-08-01",null,"BUCHANAN",null,"Last Revision Standard Road Plan Path","W:\\Highway\\Design\\StandardRoadPlans\\PDFsAndWebFiles\\Old_Indexes\\SRP_EnglishIndex.xls",null,"Robert A. Schoenrock","rschoen","Road1","ROADWAY DESIGN"]
["100-13","2010-04-20",null,"BUENA VISTA",null,"AddIn Path","W:\\Highway\\Design\\CADD\\SpreadSheets\\ExcelTabulations.xlam",null,"Stacy M. Ryan","sryan","Road1","ROADWAY DESIGN"]
["100-14","2010-04-20",null,"BUTLER",null,"Old Files Path","W:\\Highway\\Design\\RoadDesignDetails\\Old_Details\\ExcelTabs\\",null,"Nathan A. Thede","nthede","Road1","ROADWAY DESIGN"]
["100-15","2010-04-20",null,"CALHOUN",null,null,null,null,"Yanxiao Jia","yjia","Road2","ROADWAY DESIGN"]
["100-16","2010-10-19",null,"CARROLL",null,null,null,null,"Ryan R. Miller","rmille3","Road2","ROADWAY DESIGN"]
["100-17","2010-04-20",null,"CASS",null,null,null,null,"Dustin T. Skogerboe","dskoge2","Road2","ROADWAY DESIGN"]
["100-18","2010-04-20",null,"CEDAR",null,null,null,null,"Dung T. Ta","dta","Road2","ROADWAY DESIGN"]
["100-19","2012-10-16",null,"CERRO GORDO",null,null,null,null,"Allison L. P. Smyth","asmyth","Road2","ROADWAY DESIGN"]
["100-20","2008-08-01",null,"CHEROKEE",null,null,null,null,"Paul W. Flattery","pflatte","Road3","ROADWAY DESIGN"]
["100-21","2008-08-01",null,"CHICKASAW",null,null,null,null,"Kelly C. Bell","kbell","Road3","ROADWAY DESIGN"]
["100-22","2008-08-01",null,"CLARKE",null,null,null,null,"Angela K. Johnson","ajohns1","Road3","ROADWAY DESIGN"]
["100-23","2010-10-19",null,"CLAY",null,null,null,null,"Elijah D. Gansen","egansen","Road3","ROADWAY DESIGN"]
["100-24","2013-04-16",null,"CLAYTON",null,null,null,null,"James R. Schoenrock","jschoen","Consultant","ROADWAY DESIGN"]
["100-26","2008-08-01",null,"CLINTON",null,null,null,null,"Randall E. Schlei","rschlie","Consultant","ROADWAY DESIGN"]
["100-27","2009-10-20",null,"CRAWFORD",null,null,null,null,"Mark D. Mastellar","mmastel","Roadside","ROADWAY DESIGN"]
["100-28","2010-10-19",null,"DALLAS",null,null,null,null,"Robert L. Stanley","rstanle","Soils","GEOTECHNICAL DESIGN"]
["101-4","2002-04-30",null,"DAVIS",null,null,null,null,"Stephen J. Megivern","smegive","Soils","GEOTECHNICAL DESIGN"]
["101-5","2002-04-30",null,"DECATUR",null,null,null,null,"Mark A. Dell","mdell","Soils","GEOTECHNICAL DESIGN"]
["101-6","2002-04-30",null,"DELAWARE",null,null,null,null,"David R. Claman","dclaman","Bridge","HYDRAULIC DESIGN"]
["101-7","2002-04-30",null,"DES MOINES",null,null,null,null,"Zachary K. Abrams","zabrams","TrafficAndSafety","ROADWAY DESIGN"]
["101-8","2013-04-16",null,"DICKINSON"]
["101-13","2004-04-20",null,"DUBUQUE"]
["101-16","2009-10-20",null,"EMMET"]
["101-17","2011-04-19",null,"FAYETTE"]
["101-18","2011-04-19",null,"FLOYD"]
["102-3","2013-04-16",null,"FRANKLIN"]
["102-4","2011-10-18",null,"FREMONT"]
["102-5","2012-10-16",null,"GREENE"]
["102-5A","2008-08-01",null,"GRUNDY"]
["102-6C","2011-10-18",null,"GUTHRIE"]
["102-10","2008-08-01",null,"HAMILTON"]
["102-11","2008-08-01",null,"HANCOCK"]
["102-12","2008-08-01",null,"HARDIN"]
["102-14","2012-04-17",null,"HARRISON"]
["102-15","2008-08-01",null,"HENRY"]
["103-1","2010-10-19",null,"HOWARD"]
["103-3","2012-10-16",null,"HUMBOLDT"]
["103-4","2011-04-19",null,"IDA"]
["103-5","2008-08-01",null,"IOWA"]
["103-6","2011-04-19",null,"JACKSON"]
["103-7","2008-08-01",null,"JASPER"]
["104-3","2012-10-16",null,"JEFFERSON"]
["104-4","2009-10-20",null,"JOHNSON"]
["104-5A","2011-10-18",null,"JONES"]
["104-5B","2011-10-18",null,"KEOKUK"]
["104-5C","2012-04-17",null,"KOSSUTH"]
["104-8","2008-08-01",null,"LEE"]
["104-8A","2010-04-20",null,"LINN"]
["104-9","2012-04-17",null,"LOUISA"]
["104-10","2008-08-01",null,"LUCAS"]
["104-11","2008-08-01",null,"LYON"]
["104-12","2012-10-16",null,"MADISON"]
["104-13","2013-04-16",null,"MAHASKA"]
["105-1","1994-09-27",null,"MARION"]
["105-3","2005-10-18",null,"MARSHALL"]
["105-4","2011-10-18",null,"MILLS"]
["106-1","2008-08-01",null,"MITCHELL"]
["106-2","2008-08-01",null,"MONONA"]
["106-3","2008-08-01",null,"MONROE"]
["106-4","2013-04-16",null,"MONTGOMERY"]
["106-5","2008-08-01",null,"MUSCATINE"]
["106-7","2008-08-01",null,"O'BRIEN"]
["106-8","2011-04-19",null,"OSCEOLA"]
["107-7","2008-08-01",null,"PAGE"]
["107-22","2013-04-16",null,"PALO ALTO"]
["107-23","2011-10-18",null,"PLYMOUTH"]
["107-24","2008-08-01",null,"POCAHONTAS"]
["107-25","2008-08-01",null,"POLK"]
["107-29","2012-04-17",null,"POTTAWATTAMIE"]
["107-30","2012-04-17",null,"POWESHIEK"]
["107-31","2011-04-19",null,"RINGGOLD"]
["108-1","2008-08-01",null,"SAC"]
["108-2","2008-08-01",null,"SCOTT"]
["108-2A","2008-08-01",null,"SHELBY"]
["108-8A","2010-10-19",null,"SIOUX"]
["108-8B","2011-10-18",null,"STORY"]
["108-8C","2011-10-18",null,"TAMA"]
["108-8D","2010-10-19",null,"TAYLOR"]
["108-9A","2010-04-20",null,"UNION"]
["108-11A","2008-08-01",null,"VAN BUREN"]
["108-12","2008-08-01",null,"WAPELLO"]
["108-13A","2008-08-01",null,"WARREN"]
["108-15","2008-08-01",null,"WASHINGTON"]
["108-16","2010-10-19",null,"WAYNE"]
["108-18","2011-10-18",null,"WEBSTER"]
["108-18B","2012-10-16",null,"WINNEBAGO"]
["108-22","2013-04-16",null,"WINNESHIEK"]
["108-23A","2008-08-01",null,"WOODBURY"]
["108-24","2011-04-19",null,"WORTH"]
["108-26A","2008-08-01",null,"WRIGHT"]
["108-27","2012-10-16"]
["108-28","2008-08-01"]
["108-29","2012-10-16"]
["108-30","2013-04-16"]
["108-33","2013-04-16"]
["108-34","2010-10-19"]
["108-35","2012-04-17"]
["110-1","2013-04-16"]
["110-2","2013-04-16"]
["110-3","2008-08-01"]
["110-4","2008-08-01"]
["110-5","2008-08-01"]
["110-6","2008-08-01"]
["110-7A","2012-04-17"]
["110-7B","2010-10-19"]
["110-8","2008-08-01"]
["110-9","2011-10-18"]
["110-10","2008-08-01"]
["110-11","2008-08-01"]
["110-12A","2013-04-16"]
["110-13","2010-04-20"]
["110-14","2013-04-16"]
["110-15","2013-04-16"]
["110-16","2013-04-16"]
["111-1","2012-04-17"]
["111-2","1989-02-28"]
["111-23","2002-10-29"]
["111-25","2011-10-18"]
["112-3","2013-04-16"]
["112-5","2008-08-01"]
["112-6","2013-04-16"]
["112-7","2010-10-19"]
["112-8","2012-10-16"]
["112-9","2012-04-17"]
["112-10","2011-04-19"]
["113-1","2013-04-16"]
["113-2","2013-04-16"]
["113-3","2011-10-18"]
["113-10","2012-10-16"]
["213-2","2011-10-18"]
["213-3","2011-10-18"]
["231-1","2011-10-18"]
["231-2","2012-10-16"]
["232-3A","2012-10-16"]
["232-3B","2012-10-16"]
["232-3C","2012-10-16"]
["232-3D","2012-10-16"]
["232-4","2011-10-18"]
["232-6","2011-10-18"]
["232-7","2012-10-16"]
["232-9","2011-10-18"]
["232-11","2012-10-16"]
["241-5","2011-10-18"]
["252-1","2012-10-16"]
["253-1","2011-10-18"]
["254-1","2001-10-02"]
["262-3","2012-10-16"]
["262-4","2013-04-16"]
["262-5","2005-10-18"]
["262-6","2005-10-18"]
["263-1","2011-10-18"]
["271-1","2011-10-18"]
["271-2","1985-08-20"]
["271-4","2011-10-18"]
["271-9","1994-09-27"]