{"text_format":"1","workbook":"xlsx","n_sheets":7,"sheets":["General Data","Alignment Data","Ditch Grades","Corridor Modeler","Plotting Data","Comments","Listing of Files for SP"],"not_rendered":{"charts":0,"images":1,"macros":0,"external_links":2,"defined_names":11,"comments":0,"pivot_tables":0},"unopened":[],"bounds":{"document_bytes":16777216,"sheet_cells":100000,"rows_first":2000,"rows_last":500,"rows_between":2000,"halvings":0,"cell_chars":16384,"cell_head_chars":4096},"cells_cut":0,"cells_raw":0,"read":"whole","date_system":"1900"}

{"sheet":"General Data","index":0,"n_rows":36,"n_cols":3,"rows_kept":36,"cut":false,"hidden":false,"merged":[]}
[]
[null,"Iowa Department of Transportation"]
[null,"Office of Design  "]
[null,"Project Data Summary"]
[]
[null,"Revised Date:                                      "]
[null,"Project Information"]
[null,"County:","Benton"]
[null,"PIN:","92-06-030-030-01"]
[null,"Project Number:","NHSX-030-6(231)--3H-06"]
[null,"Project Location:","US 30"]
[null,"Project Description:","US 218 Interchange"]
[null,"Design Engineer:","Flattery"]
[null,"Design Team:","Bell"]
[]
[null,"Design File Information"]
[null,"Design File name:","06030231.dsn"]
[null,"Linework Model:","Road_Design_Line_Work"]
[null,"Proposed DTM:"]
[null,"Design Criteria:"]
[null,"Plansheet PDFs"]
[]
[null,"Survey File Information"]
[null,"Aerial Photography filename:"]
[null,"Survey file name:","06030087.sur, 1505MS.sur"]
[null,"TIN file name:","exist_surf_06030231.tin"]
[null,"Raster file name:","06030087.ras"]
[]
[null,"GEOPAK Information"]
[null,"GPK File:","job231.gpk"]
[null,"Operator Code:","r3"]
[null,"Project Manager File:"]
[null,"COGO Input Folder:"]
[null,"COGO Output Folder:"]
[]
[null,"Location of this File:"]

{"sheet":"Alignment Data","index":1,"n_rows":82,"n_cols":9,"rows_kept":82,"cut":false,"hidden":false,"merged":[]}
[]
[null,"Horizontal and Vertical Alignments"]
[null,"Roadway","Survey Chain","Construction Chain","Point Range","Beginning Station","End Station","Existing Ground Profile","Construction Profile"]
[null,"Mainline"]
[null,"US 30",null,"ML030",null,"690+00","1581+34.10","ML030_E","ML030_P"]
[null,null,"SUR030",null,null,"686+94.11","1581+36.35"]
[]
[]
[]
[]
[]
[]
[null,"Side Roads"]
[null,"23rd Ave",null,"SR23rdAve",null,"231414+82.97","231439+41.44","SR23rdAve_E","SR23rdAve_P"]
[null,"US 218 (Survey)","SUR218",null,null,"0+00.00","79+35.42"]
[null,"US 218/24th Ave",null,"SR218",null,"241450+04.05","541555+79.84","SR218_E","SR218_P"]
[null,"US 218 Frontage Road",null,"ENTR241482"]
[]
[null,"Ramps/ Loops"]
[]
[]
[]
[]
[]
[]
[]
[]
[null,"US 218 Loop A",null,"SR218A",null,"11473+14.29","11489+98.12",null,"SR218A"]
[null,"US 218 Loop B",null,"SR218B",null,"21466+23.05","21483+06.29",null,"SR218B"]
[null,"US 218 Ramp C",null,"SR218C",null,"31440+41.75","31468+75.20",null,"SR218C"]
[null,"US 218 Ranp D",null,"SR218D",null,"41474+26.45","41502+26.51",null,"SR218D"]
[]
[null,"Returns"]
[null,"23rd Avenue Median",null,"SR23RDAVE_RET_3","51532-51536","30+00.00","31+99.43",null,"SR23RDAVE_RET_3_P"]
[null,"23rd Avenue Median",null,"SR23RDAVE_RET_4","51142-51146","40+00.00","41+99.43",null,"SR23RDAVE_RET_4_P"]
[null,"US 218 Ramp C",null,"SR218B_RET_1",null,"100+00.00","101+98.39",null,"SR218B_RET_1"]
[null,"US 218 Ramp C",null,"SR218C_RET_1",null,"100+00.00","102+12.12",null,"SR218C_RET_1"]
[null,"US 218 Ramp D",null,"SR218A_RET_1",null,"100+00.00","102+03.09",null,"SR218A_RET_1"]
[null,"US 218 Ramp D",null,"SR218D_RET_1",null,"100+00.00","101+97.27",null,"SR218D_RET_1"]
[]
[]
[null,"Miscellaneous"]
[null,"ML030_PGL",null,null,null,"769+77.95","815+52.54"]
[null,"WALL",null,null,null,"1000+00.00","1007+53.61",null,"WALL_P, WALL_G, WALL_F"]
[]
[null,"Crossovers"]
[null,"Crossover 1",null,"XOVER1",null,"100+00.00","119+94.92","XOVER1","XOVER1_P"]
[null,"Crossover 2",null,"XOVEREB2",null,"1200+00.00","1216+26.60"]
[null,"Crossover 2",null,"XOVERWB2",null,"2200+00.00","2212+40.90"]
[null,"Crossover 3",null,"XOVER3",null,"300+00.00","310+02.44",null,"XOVER3_P"]
[]
[]
[null,"Entrances"]
[null,"U.S. Highway 30"]
[null,"Sta. 1389+39 Lt.",null,"ENTL1389",null,"0+00","2+06",null,"ENTL1389"]
[null,"Sta. 1398+08 Lt.",null,"ENTL1398",null,"0+00","2+06",null,"ENTL1398"]
[null,"Sta. 1398+08 Rt.",null,"ENTR1398",null,"0+00","2+06",null,"ENTR1398"]
[null,"Sta. 1398+08 Median",null,"ENTM1398",null,"0+00","2+00",null,"ENTM1398"]
[null,"Sta. 1409+90 Lt.",null,"ENTL1409",null,"0+00","2+06",null,"ENTL1409"]
[null,"Sta. 1409+90 Rt.",null,"ENTR1409",null,"0+00","2+06",null,"ENTR1409"]
[null,"Sta. 1436+04 Lt.",null,"ENTL1436",null,"0+00","2+56",null,"ENTL1436"]
[null,"Sta. 1436+07 Rt. ",null,"ENTR1436",null,"0+00","2+06",null,"ENTR1436"]
[null,"Sta. 1497+25 Lt.",null,"ENTL1497",null,"0+00","2+06",null,"ENTL1497"]
[]
[null,"23rd Avenue"]
[null,"Sta. 231425+00 Lt.",null,"ENTL231425",null,"0+00","3+00",null,"ENTL231425"]
[]
[null,"U.S. Hwy 218/24th Ave."]
[null,"Sta. 241458+00 Lt.",null,"ENTL241458",null,"100+00","102+00",null,"ENTL241458"]
[null,"Sta. 241469+35 Lt.",null,"ENTL241469",null,"100+00","104+04.98",null,"ENTL241469"]
[null,"Sta. 241482+00 Rt.",null,"ENTR241482",null,"0+00","12+92.88",null,"ENTR241482"]
[null,"Sta. 241499+00 Lt.",null,"ENTL241499",null,"100+00","102+00",null,"ENTL241499"]
[null,"Sta. 241499+00 Rt.",null,"ENTR241499",null,"200+00","202+00",null,"ENTR241499"]
[]
[]
[null,"Dikes"]
[null,"Sta. 1469+69 Lt",null,"DIKEL1469",null,"0+00","2+00",null,"DIKEL1469"]
[null,"Sta. 1413+55 Median",null,"DIKEM1413",null,"0+00","2+00",null,"DIKEM1413"]
[null,"Sta. 1438+80 Median",null,"DIKEM1438",null,"0+00","2+00",null,"DIKEM1438"]
[null,"Sta. 1470+00 Median",null,"DIKEM1470",null,"0+00","2+00",null,"DIKEM1470"]
[null,"Sta. 1476+85 Median",null,"DIKEM1476",null,"0+00","2+00",null,"DIKEM1476"]
[null,"Sta. 1501+00 Median",null,"DIKEM1501",null,"0+00","2+00",null,"DIKEM1501"]

{"sheet":"Ditch Grades","index":2,"n_rows":68,"n_cols":5,"rows_kept":68,"cut":false,"hidden":false,"merged":[[13,1,13,2]]}
[]
[null,"Ditch Grades"]
[null,"Roadway","Profile Name","Beginning Station","End Station"]
[null,"Mainline"]
[null,"US 30 - Left"]
[null,null,"DGL1372","1372+00.00","1461+05.00"]
[null,null,"DGL1463","1463+87.00","1470+75.00"]
[null,null,"DGL1472","1472+29.00","1474+60.00"]
[null,null,"DGL1477","1477+55.00","1516+70.00"]
[]
[null,"US 30 - Median"]
[null,null,"DGM1515","1515+00.00","1516+70.00"]
[]
[null,"US 30 - Temporary Median (Stage 1)"]
[null,null,"DGM1388","1388+15.00","1400+80.00"]
[null,null,"DGM1401","1401+00.00","1422+50.00"]
[null,null,"DGM1423","1423+25.00","1425+35.00"]
[null,null,"DGM1425","1425+50.00","1442+00.00"]
[null,null,"DGM1448","1448+00.00","1452+70.00"]
[null,null,"DGM1452","1452+80.00","1461+00.00"]
[null,null,"DGM1485","1485+00.00","1515+00.00"]
[]
[null,"US 30 - Right"]
[null,null,"DGR1343","1343+00.00","1422+00.00"]
[null,null,"DGR1422","1422+00.00","1423+50.00"]
[null,null,"DGR1423","1423+50.00","1458+00.00"]
[null,null,"DGR1460","1460+75.00","1475+50.00"]
[null,null,"DGR1476","1476+40.00","1479+15.00"]
[null,null,"DGR1481","1480+25.00","1487+90.00"]
[null,null,"DGR1489","1489+95.00","1516+70.00"]
[]
[null,"Side Roads"]
[null,"23rd Avenue"]
[null,null,"DGL231416","231416+75.00","231421+25.00"]
[null,null,"DGL231424","231424+30.00","231427+00.00"]
[null,null,"DGR231416","231416+75.00","231421+00.00"]
[null,null,"DGR231424","231424+45.00","231427+00.00"]
[]
[null,"U.S. Hwy 218/24th Ave"]
[null,null,"DGL241450","241450+50.00","241474+40.00"]
[null,null,"DGL241477","241477+17.72","241480+40.00"]
[null,null,"DGL241483","241483+25.00","241503+00.00"]
[null,null,"DGR241450","241450+50.00","241468+10.00"]
[null,null,"DGR241470","241470+98.30","241474+35.00"]
[null,null,"DGR241476","241476+75.00","241503+00.00"]
[]
[]
[null,"Ramps/ Loops"]
[null,"U.S. 218 Ramp A"]
[null,null,"DGL11480","11480+60.00","11481+75.00"]
[null,null,"DGR11479","11479+15.00","11486+64.71"]
[]
[null,"U.S. 218 Ramp B"]
[null,null,"DGL21473","21474+00.00","21476+70.00"]
[null,null,"DGR21472","21472+25.00","21479+75.06"]
[]
[null,"U.S. 218 Ramp C"]
[null,null,"DGL31441","31441+47.50","31443+73.46"]
[null,null,"DGL31447","31447+15.00","31453+75.00"]
[null,null,"DGR31441","31441+70.00","31448+75.00"]
[null,null,"DGR31452","31452+05.00","31456+46.34"]
[null,"U.S. 218 Ramp D"]
[null,null,"DGL41475","41475+34.00","41477+60.34"]
[null,null,"DGL41481","41483+40.00","41487+65.00"]
[null,null,"DGR41480","41475+50.00","47489+96.32"]
[]
[]
[null,"Miscellaneous"]

{"sheet":"Corridor Modeler","index":3,"n_rows":17,"n_cols":7,"rows_kept":17,"cut":false,"hidden":false,"merged":[[14,5,14,6],[3,5,3,6],[4,5,4,6],[5,5,5,6],[6,5,6,6],[7,5,7,6],[8,5,8,6],[9,5,9,6],[10,5,10,6],[11,5,11,6],[12,5,12,6],[13,5,13,6],[14,2,14,4],[3,2,3,4],[4,2,4,4],[5,2,5,4],[6,2,6,4],[7,2,7,4],[8,2,8,4],[9,2,9,4],[10,2,10,4],[11,2,11,4],[12,2,12,4],[13,2,13,4]]}
[]
[null,"Corridor Modeler"]
[null,"Project Files"]
[null,null,"Folder / Filename",null,null,"Description"]
[null,"Working Directory"]
[null,"Plan Graphics Design File"]
[null,"Template Drops Visualization File"]
[]
[null,"Preference File"]
[null,"Template Library"]
[null,"Road Designer File"]
[]
[null,"DTM - Base Existing Ground"]
[null,"DTM - Proposed"]
[]
[null,"Plan Graphics Documentation"]
[null,"Name","Drafting Standard","Type","Purpose","Model","Created by"]

{"sheet":"Plotting Data","index":4,"n_rows":45,"n_cols":9,"rows_kept":45,"cut":false,"hidden":false,"merged":[[3,4,3,5],[4,4,4,5],[5,4,5,5]]}
[]
[null,"Plotting Data"]
[null,"Batch Printing Files"]
[null,"Black & White - Plan Sheets","___.job",null,"Black & White",null,{"$f":"SUMIF(G10:G49,E4,F10:F49)","v":0}]
[null,"Black & White - Cross Sectiongs","___.job",null,"Color",null,{"$f":"SUMIF(G10:G49,E5,F10:F49)","v":0}]
[null,"Color - Plan Sheets","___.job",null,"Total Sheets",null,{"$f":"SUM(G4:G5)","v":0}]
[null,null,null,null,"% Color",null,{"$f":"IF(G6=0,0,G5/G6*100)","v":0}]
[null,"Plan Sheets"]
[null,"Sheet Description","File Name","Model Name","Scale or Width","No. of Sheets","Color","Sheet Number","File Location if not in the \"Design Folder\""]
[null,"Title Sheet",null,"Working",100,null,"Black & White","A.1"]
[null,"Location Map",null,"Working",100,null,"Black & White","A.2"]
[null,"Typical Cross Sections",null,"Working",100,null,"Black & White","B.1-B.16"]
[null,"Estimate of Quantities and General Information",null,null,null,null,null,"C.1-C.xx"]
[null,"Tabulations",null,null,null,null,null,"C.xx-C.xx"]
[null,"Plan and Profile: ",null,null,100,null,"Color","D.1-D.57"]
[null,"Plan and Profile: ",null,null,100,null,"Color","E.1-E.24"]
[null,"Plan and Profile: ",null,null,null,null,null,"F.1-F.xx"]
[null,"Reference Ties and Bench Marks",null,null,100,null,"Black & White","G.1-G.6"]
[null,"Horizontal Control",null,null,100,null,"Black & White","G.7-G.20"]
[null,"Right-of-Way: Mainline",null,null,null,null,null,"H.1-H.xx"]
[null,"Right-of-Way: Sideroad",null,null,null,null,null,"HE.1-HE.xx"]
[null,"Staging and Traffic Control",null,null,null,null,"Black & White","J.1"]
[null,"Interchange Sheets",null,null,null,null,null,"K.1-K.12"]
[null,"Intersection Geometric Staking, Jointing, & Edge Profiles",null,null,null,null,null,"L.1-L.xx"]
[null,"Storm Sewer Tabulations",null,null,null,null,null,"M.1-M.xx"]
[null,"Storm Sewer Plan and Profiles",null,null,null,null,null,"M.xx-M.xx"]
[null,"Traffic Signal",null,null,null,null,null,"N.1-N.xx"]
[null,"Lighting Layout",null,null,null,null,null,"P.1-P.xx"]
[null,"Soils",null,null,null,null,null,"Q.1-Q.xx"]
[null,"Borrow ",null,null,null,null,null,"R.1-R.xx"]
[null,"Wetland",null,null,null,null,null,"S.1-S.xx"]
[null,"Bridge Plan Soils",null,null,null,null,null,"SPS.1-SPS.xx"]
[null,"Earthwork Quantities",null,null,null,null,null,"T.1-T.xx"]
[null,"Modified Standards and Details",null,null,null,null,null,"U.1-U.xx"]
[null,"Bridge and Culvert Situation Plans",null,null,null,null,null,"V.1-V.xx"]
[]
[null,"XS - Mainline",null,null,100,null,"Black & White","W.1-W.556"]
[null,"XS - 23rd Avenue",null,"Working",100,null,"Black & White","X.1800-X.1807"]
[null,"XS - 24th Avenue & US 218",null,"Working",100,null,"Black & White","X.1901-X.1944"]
[null,"XS - US 218 Frontage Road",null,"Working",100,null,"Black & White","X.2000-X.2008"]
[null,"XS - Borrow",null,null,null,null,null,"Z.1-Z.xx"]
[null,"XS - US 218 Ramp A",null,"Working",100,null,"Black & White","Y.400-Y.406"]
[null,"XS - US 218 Ramp B",null,"Working",100,null,"Black & White","Y.500-Y.506"]
[null,"XS - US 218 Ramp C",null,"Working",100,null,"Black & White","Y.600-Y.614"]
[null,"XS - US 218 Ramp D",null,"Working",100,null,"Black & White","Y.700-Y.714"]

{"sheet":"Comments","index":5,"n_rows":2,"n_cols":2,"rows_kept":2,"cut":false,"hidden":false,"merged":[]}
[]
[null,"Comments"]

{"sheet":"Listing of Files for SP","index":6,"n_rows":137,"n_cols":5,"rows_kept":137,"cut":false,"hidden":false,"merged":[[0,1,0,2],[0,3,0,4],[1,1,1,2],[1,3,1,4]]}
[null,"File Size",null,"File Updated"]
["XML Files"]
["Existing"]
["exist_surf_060300231_Signed.xml",19835,{"$f":"IF(B4=\"\",\"\",\"KB\")","v":"KB"},"2017-04-03","10:52:00"]
[null,null,""]
[null,null,""]
[null,null,""]
[null,null,""]
[null,null,""]
["Proposed",null,""]
["US Highway 30 Stage 1 ",null,""]
["prop_surf_subgrade_STG1_ML030_5_Signed.xml",3260,{"$f":"IF(B12=\"\",\"\",\"KB\")","v":"KB"},"2017-04-03","10:02:00"]
["prop_surf_subgrade_STG1_ML030_6_Signed.xml",5316,"KB","2017-04-03","10:02:00"]
["prop_surf_top_STG1_ML030_5_Signed.xml",6390,"KB","2017-04-03","10:02:00"]
["prop_surf_top_STG1_ML030_6_Signed.xml",8911,{"$f":"IF(B15=\"\",\"\",\"KB\")","v":"KB"},"2017-04-03","10:02:00"]
[null,null,""]
["US Highway 30 Stage 2",null,""]
["prop_surf_subgrade_STG2_ML030_5_Signed.xml",3037,"KB","2018-02-21","07:51:00"]
["prop_surf_subgrade_STG2_ML030_6_Signed.xml",8381,"KB","2017-04-03","10:02:00"]
["prop_surf_top_STG2_ML030_5_Signed.xml",5800,"KB","2018-02-21","07:51:00"]
["prop_surf_top_STG2_ML030_6_Signed.xml",11411,"KB","2017-04-03","10:02:00"]
[null,null,""]
["US 218 Ramp A",null,""]
["prop_surf_subgrade_SR218A_Signed.xml",541,"KB","2017-04-03","10:01:00"]
["prop_surf_top_SR218A_Signed.xml",1037,"KB","2017-04-03","10:02:00"]
[null,null,""]
["US 218 Ramp B",null,""]
["prop_surf_subgrade_SR218B_Signed.xml",559,"KB","2017-04-03","10:01:00"]
["prop_surf_top_SR218B_Signed.xml",1053,"KB","2017-04-03","10:02:00"]
[null,null,""]
["US 218 Ramp C",null,""]
["prop_surf_subgrade_SR218C_Signed.xml",2900,"KB","2017-04-03","10:01:00"]
["prop_surf_top_SR218C_Signed.xml",2957,"KB","2017-04-03","10:02:00"]
[null,null,""]
["US 218 Ramp D",null,""]
["prop_surf_subgrade_SR218D_Signed.xml",1326,"KB","2017-04-03","10:01:00"]
["prop_surf_top_SR218D_Signed.xml",1515,"KB","2017-04-03","10:02:00"]
[null,null,""]
["23rd Avenue",null,""]
["prop_surf_subgrade_SR23rdN_Signed.xml",293,"KB","2017-04-03","10:01:00"]
["prop_surf_subgrade_SR23rdS_Signed.xml",408,"KB","2017-04-03","10:01:00"]
["prop_surf_top_SR23rdN_Signed.xml",453,"KB","2017-04-03","10:02:00"]
["prop_surf_top_SR23rdS_Signed.xml",621,"KB","2017-04-03","10:02:00"]
[null,null,""]
["US 218/24th Ave",null,""]
["prop_surf_subgrade_SR218N_Signed.xml",1541,"KB","2017-04-03","10:01:00"]
["prop_surf_subgrade_SR218S_Signed.xml",1477,"KB","2017-04-03","10:01:00"]
["prop_surf_top_SR218N_Signed.xml",2541,"KB","2017-04-03","10:02:00"]
["prop_surf_top_SR218S_Signed.xml",2507,"KB","2017-04-03","10:02:00"]
[null,null,""]
["Crossover 1",null,""]
["prop_surf_subgrade_Xover1_Signed.xml",916,"KB","2017-04-03","10:02:00"]
["prop_surf_top_Xover1_Signed.xml",1599,"KB","2017-04-03","10:02:00"]
[null,null,""]
["Crossover 2",null,""]
["prop_surf_subgrade_Xover2_Signed.xml",395,"KB","2017-04-03","10:02:00"]
["prop_surf_top_Xover2_Signed.xml",1001,"KB","2017-04-03","10:02:00"]
[null,null,""]
["Crossover 2 (Removal)",null,""]
["prop_surf_subgrade_Xover2_Removal_Signed.xml",210,"KB","2017-04-03","10:02:00"]
["prop_surf_top_Xover2_Removal_Signed.xml",459,"KB","2017-04-03","10:02:00"]
[null,null,""]
["Crossover 3",null,""]
["prop_surf_subgrade_Xover3_Signed.xml",1350,"KB","2017-04-03","10:02:00"]
["prop_surf_top_Xover3_Signed.xml",2618,"KB","2017-04-03","10:02:00"]
[null,null,""]
["Entrances",null,""]
["prop_surf_ENTL1389_Signed.xml",59,"KB","2017-04-03","10:01:00"]
["prop_surf_ENTL1398_Signed.xml",138,"KB","2018-02-12","09:20:00"]
["prop_surf_ENTL1409_Signed.xml",157,"KB","2017-04-03","10:01:00"]
["prop_surf_ENTL1436_Signed.xml",150,"KB","2017-04-03","10:01:00"]
["prop_surf_ENTL1497_Signed.xml",183,"KB","2017-04-03","10:01:00"]
["prop_surf_ENTL231425_Signed.xml",91,"KB","2017-04-03","10:01:00"]
["prop_surf_ENTL241458_Signed.xml",24,"KB","2017-04-03","10:01:00"]
["prop_surf_ENTL241469_Signed.xml",168,"KB","2017-04-03","10:01:00"]
["prop_surf_ENTL241499_Signed.xml",24,{"$f":"IF(B76=\"\",\"\",\"KB\")","v":"KB"},"2017-04-03","10:01:00"]
["prop_surf_ENTM1398_Signed.xml",74,"KB","2017-04-03","10:01:00"]
["prop_surf_ENTR1398_Signed.xml",268,"KB","2017-04-03","10:01:00"]
["prop_surf_ENTR1409_Signed.xml",210,"KB","2017-04-03","10:01:00"]
["prop_surf_ENTR1436_Signed.xml",243,"KB","2017-04-03","10:01:00"]
["prop_surf_ENTR1518_Signed.xml",534,"KB","2017-04-03","10:01:00"]
["prop_surf_ENTR241482_Signed.xml",1498,"KB","2017-04-03","10:01:00"]
["prop_surf_ENTR241499_Signed.xml",67,"KB","2017-04-03","10:01:00"]
[null,null,""]
["Dikes",null,""]
["prop_surf_DIKEL1469_Signed.xml",48,"KB","2017-04-03","10:01:00"]
["prop_surf_DIKEM1413_Signed.xml",58,"KB","2017-04-03","10:01:00"]
["prop_surf_DIKEM1438_Signed.xml",58,"KB","2017-04-03","10:01:00"]
["prop_surf_DIKEM1470_Signed.xml",57,"KB","2017-04-03","10:01:00"]
["prop_surf_DIKEM1476_Signed.xml",46,"KB","2017-04-03","10:01:00"]
["prop_surf_DIKEM1501_Signed.xml",48,"KB","2017-04-04","14:22:00"]
[]
[]
[]
[]
[null,null,{"$f":"IF(B96=\"\",\"\",\"KB\")","v":""}]
[null,null,{"$f":"IF(B97=\"\",\"\",\"KB\")","v":""}]
["3D DGN Files",null,""]
["06030231_3D.dgn",81,"KB","2017-04-03","08:27:00"]
["06030231_DIKEL1469_3D.dgn",50,"KB","2017-04-03","08:11:00"]
["06030231_DIKEM1413_3D.dgn",51,"KB","2017-04-03","08:11:00"]
["06030231_DIKEM1438_3D.dgn",47,"KB","2017-04-03","08:11:00"]
["06030231_DIKEM1470_3D.dgn",51,"KB","2017-04-03","08:11:00"]
["06030231_DIKEM1476_3D.dgn",50,"KB","2017-04-03","08:12:00"]
["06030231_DIKEM1501_3D.dgn",50,"KB","2017-04-03","08:12:00"]
["06030231_ENTL1389_3D.dgn",56,{"$f":"IF(B106=\"\",\"\",\"KB\")","v":"KB"},"2017-04-03","08:12:00"]
["06030231_ENTL1398_3D.dgn",62,"KB","2018-02-12","09:17:00"]
["06030231_ENTL1409_3D.dgn",62,"KB","2017-04-03","08:12:00"]
["06030231_ENTL1436_3D.dgn",62,"KB","2017-04-03","08:13:00"]
["06030231_ENTL1497_3D.dgn",66,"KB","2017-04-03","08:13:00"]
["06030231_ENTL231425_3D.dgn",57,"KB","2017-04-03","08:13:00"]
["06030231_ENTL241458_3D.dgn",51,"KB","2017-04-03","08:13:00"]
["06030231_ENTL241469_3D.dgn",62,"KB","2017-04-03","08:14:00"]
["06030231_ENTL241499_3D.dgn",51,"KB","2017-04-03","08:14:00"]
["06030231_ENTM1398_3D.dgn",54,"KB","2017-04-03","08:14:00"]
["06030231_ENTR1398_3D.dgn",70,"KB","2017-04-03","08:14:00"]
["06030231_ENTR1409_3D.dgn",66,"KB","2017-04-03","08:15:00"]
["06030231_ENTR1436_3D.dgn",68,"KB","2017-04-03","08:15:00"]
["06030231_ENTR1518_3D.dgn",105,"KB","2017-04-03","08:15:00"]
["06030231_ENTR241482_3D.dgn",330,"KB","2017-04-03","08:16:00"]
["06030231_ENTR241499_3D.dgn",56,"KB","2017-04-03","08:16:00"]
["06030231_SR218A_3D.dgn",256,"KB","2017-04-03","08:16:00"]
["06030231_SR218B_3D.dgn",268,"KB","2017-04-03","08:17:00"]
["06030231_SR218C_3D.dgn",655,"KB","2017-04-03","08:17:00"]
["06030231_SR218D_3D.dgn",555,"KB","2017-04-03","08:17:00"]
["06030231_SR218N_3D.dgn",612,"KB","2017-04-03","08:17:00"]
["06030231_SR218S_3D.dgn",673,"KB","2017-04-03","08:18:00"]
["06030231_SR23rdN_3D.dgn",127,"KB","2017-04-03","08:16:00"]
["06030231_SR23rdS_3D.dgn",157,"KB","2017-04-03","08:16:00"]
["06030231_STG1_ML030_5_3D.dgn",1244,"KB","2017-04-03","08:18:00"]
["06030231_STG1_ML030_6_3D.dgn",2144,"KB","2017-04-03","08:18:00"]
["06030231_STG2_ML030_5_3D.dgn",1265,"KB","2017-12-15","10:20:00"]
["06030231_STG2_ML030_6_3D.dgn",3483,"KB","2017-04-03","08:19:00"]
["06030231_Xover1_3D.dgn",394,"KB","2017-04-03","08:19:00"]
["06030231_Xover2_3D.dgn",210,"KB","2017-04-03","08:26:00"]
["06030231_Xover2_Removal_3D.dgn",134,"KB","2017-04-03","08:26:00"]
["06030231_Xover3_3D.dgn",645,"KB","2017-04-03","08:27:00"]