{"text_format":"1","workbook":"xlsx","n_sheets":8,"sheets":["ProjectInformation","PrintSheets","PrintSheetTemplate","Note1","BridgeBlock","DE108_26A","108_26A","Index"],"not_rendered":{"charts":0,"images":6,"macros":1,"external_links":0,"defined_names":8,"comments":0,"pivot_tables":0},"unopened":[],"bounds":{"document_bytes":16777216,"sheet_cells":100000,"rows_first":2000,"rows_last":500,"rows_between":2000,"halvings":0,"cell_chars":16384,"cell_head_chars":4096},"cells_cut":0,"cells_raw":0,"read":"whole","date_system":"1900"}

{"sheet":"ProjectInformation","index":0,"n_rows":10,"n_cols":2,"rows_kept":10,"cut":false,"hidden":false,"merged":[[0,0,0,1],[1,0,1,1],[8,0,8,1]]}
["CPN DATA"]
["INFORMATION ADDED BY DESIGNER"]
["Engineer of Record","HDR\\Iowa DOT"]
["Lead Designer"]
["County","DUBUQUE"]
["Project Number","NHS-020-9(121)--19-31"]
["English or Metric","English"]
["Revised"]
["Bridge Block"]
["File No."]

{"sheet":"PrintSheets","index":1,"n_rows":95,"n_cols":179,"rows_kept":95,"cut":false,"hidden":false,"merged":[[93,171,93,178],[94,1,94,178],[93,101,93,106],[93,107,93,118],[93,119,93,148],[93,149,93,158],[93,159,93,164],[93,165,93,170],[93,1,93,7],[93,8,93,14],[93,15,93,21],[93,22,93,30],[93,31,93,64],[93,65,93,100]]}
[" "]
[]
[]
[]
[]
[]
[]
[]
[]
[]
[]
[]
[]
[]
[]
[]
[]
[]
[]
[]
[]
[]
[]
[]
[]
[]
[]
[]
[]
[]
[]
[]
[]
[]
[]
[]
[]
[]
[]
[]
[]
[]
[]
[]
[]
[]
[]
[]
[]
[]
[]
[]
[]
[]
[]
[]
[]
[]
[]
[]
[]
[]
[]
[]
[]
[]
[]
[]
[]
[]
[]
[]
[]
[null,null,null,null,null,null,null,null,null,null,null,null,null,null,null,null,null,null,null,null,null,null,null,null,null,null,null,null,null,null,null,null,null,null,null,null,null,null,null,null,null,null,null,null,null,null,null,null,null,null,null,null,null,null,null,null,null,null,null,null,null,null,null,null,null,null,null,null,null,null,null,null,null,null,null,null,null,null,null,null,null,null,null,null,null,null,null,null,null,null,null,null,null,null,null,null,null,null,null,null,null,null,null,null,null,null,null,null,null,null,null,null,null,null,null,null,null,null,null,null,null,null,null,null,null,null,null,null,null,null,null,null,null,null,null,"","","","","","","","","","","","","","","","","","","","","","","","","","","","","","","","","","","","","","","","","","",""]
[]
[]
[]
[]
[]
[]
[]
[]
[]
[]
[]
[]
[]
[]
[]
[]
[]
[]
[null,"","","","","","","","","","","","","","","","","","","","","","","","","","","","","","","","","","","","","","","","","","","","","","","","","","","","","","","","","","","","","","","","","","","","","","","","","","","","","","","","","","","","","","","","","","","","","","","","","","","","","","","","","","","","","","","","","","","","","","","","","","","","","","","","","","","","","","","","","","","","","","","","","","","","","","","",null,"","","","","","","","","","","","","","","","","","","","","","","","","",""]
[null,"FILE NO.",null,null,null,null,null,null,{"$f":"IF(ProjectInformation!$B$10<>\"\",ProjectInformation!$B$10,\"\")","v":""},null,null,null,null,null,null,{"$f":"UPPER(ProjectInformation!B7)","v":"ENGLISH"},null,null,null,null,null,null,"DESIGN TEAM",null,null,null,null,null,null,null,null,{"$f":"IF(ProjectInformation!$B$3<>\"\",ProjectInformation!$B$3&\"\\\"&ProjectInformation!$B$4,\"\")","v":"HDR\\Iowa DOT\\"},null,null,null,null,null,null,null,null,null,null,null,null,null,null,null,null,null,null,null,null,null,null,null,null,null,null,null,null,null,null,null,null,null,{"$f":"IF(ProjectInformation!$B$5<>\"\",ProjectInformation!$B$5,\"\")","v":"DUBUQUE"},null,null,null,null,null,null,null,null,null,null,null,null,null,null,null,null,null,null,null,null,null,null,null,null,null,null,null,null,null,null,null,null,null,null,null,"COUNTY",null,null,null,null,null,"PROJECT NUMBER",null,null,null,null,null,null,null,null,null,null,null,{"$f":"IF(ProjectInformation!$B$6<>\"\",ProjectInformation!$B$6,\"\")","v":"NHS-020-9(121)--19-31"},null,null,null,null,null,null,null,null,null,null,null,null,null,null,null,null,null,null,null,null,null,null,null,null,null,null,null,null,null,"SHEET NUMBER",null,null,null,null,null,null,null,null,null,"J.1",null,null,null,null,null,{"$f":"IF(FP94<>\"\",\"REVISED\",\"\")","v":""},null,null,null,null,null,{"$f":"IF(ProjectInformation!$B$8<>\"\",ProjectInformation!$B$8,\"\")","v":""}]
["","2/1/2017     2:47:46 PM     mkline     c:\\pwworking\\oma\\d1308983\\31020121j01.xlsm"]

{"sheet":"PrintSheetTemplate","index":2,"n_rows":95,"n_cols":179,"rows_kept":95,"cut":false,"hidden":true,"merged":[[93,171,93,178],[94,1,94,178],[93,101,93,106],[93,107,93,118],[93,119,93,148],[93,149,93,158],[93,159,93,164],[93,165,93,170],[93,1,93,7],[93,8,93,14],[93,15,93,21],[93,22,93,30],[93,31,93,64],[93,65,93,100]]}
[" "]
[]
[]
[]
[]
[]
[]
[]
[]
[]
[]
[]
[]
[]
[]
[]
[]
[]
[]
[]
[]
[]
[]
[]
[]
[]
[]
[]
[]
[]
[]
[]
[]
[]
[]
[]
[]
[]
[]
[]
[]
[]
[]
[]
[]
[]
[]
[]
[]
[]
[]
[]
[]
[]
[]
[]
[]
[]
[]
[]
[]
[]
[]
[]
[]
[]
[]
[]
[]
[]
[]
[]
[]
[]
[]
[]
[]
[]
[]
[]
[]
[]
[]
[]
[]
[]
[]
[]
[]
[]
[]
[]
[null,"","","","","","","","","","","","","","","","","","","","","","","","","","","","","","","","","","","","","","","","","","","","","","","","","","","","","","","","","","","","","","","","","","","","","","","","","","","","","","","","","","","","","","","","","","","","","","","","","","","","","","","","","","","","","","","","","","","","","","","","","","","","","","","","","","","","","","","","","","","","","","","","","","","","","","","",null,"","","","","","","","","","","","","","","","","","","","","","","","","",""]
[null,"FILE NO.",null,null,null,null,null,null,{"$f":"IF(ProjectInformation!$B$10<>\"\",ProjectInformation!$B$10,\"\")","v":""},null,null,null,null,null,null,{"$f":"UPPER(ProjectInformation!$B$7)","v":"ENGLISH"},null,null,null,null,null,null,"DESIGN TEAM",null,null,null,null,null,null,null,null,{"$f":"IF(ProjectInformation!$B$3<>\"\",ProjectInformation!$B$3&\"\\\"&ProjectInformation!$B$4,\"\")","v":"HDR\\Iowa DOT\\"},null,null,null,null,null,null,null,null,null,null,null,null,null,null,null,null,null,null,null,null,null,null,null,null,null,null,null,null,null,null,null,null,null,{"$f":"IF(ProjectInformation!$B$5<>\"\",ProjectInformation!$B$5,\"\")","v":"DUBUQUE"},null,null,null,null,null,null,null,null,null,null,null,null,null,null,null,null,null,null,null,null,null,null,null,null,null,null,null,null,null,null,null,null,null,null,null,"COUNTY",null,null,null,null,null,"PROJECT NUMBER",null,null,null,null,null,null,null,null,null,null,null,{"$f":"IF(ProjectInformation!$B$6<>\"\",ProjectInformation!$B$6,\"\")","v":"NHS-020-9(121)--19-31"},null,null,null,null,null,null,null,null,null,null,null,null,null,null,null,null,null,null,null,null,null,null,null,null,null,null,null,null,null,"SHEET NUMBER",null,null,null,null,null,null,null,null,null,null,null,null,null,null,null,{"$f":"IF(FP94<>\"\",\"REVISED\",\"\")","v":""},null,null,null,null,null,{"$f":"IF(ProjectInformation!$B$8<>\"\",ProjectInformation!$B$8,\"\")","v":""}]
[""]

{"sheet":"Note1","index":3,"n_rows":1,"n_cols":1,"rows_kept":1,"cut":false,"hidden":true,"merged":[[0,0,2,0]]}
["SEE V SHEETS FOR ADDITIONAL BID ITEMS AND QUANTITIES"]

{"sheet":"BridgeBlock","index":4,"n_rows":4,"n_cols":14,"rows_kept":4,"cut":false,"hidden":true,"merged":[[2,2,2,8],[3,2,3,7],[2,9,2,12],[3,8,3,12]]}
[2]
[null,"","","","","","","","","","","","",""]
[null,null,"Design No.",null,null,null,null,null,null,{"$f":"IF(#REF!<>\"\",#REF!,\"\")","v":{"$error":"#REF!"}}]
[null,null,"File No.",null,null,null,null,null,{"$f":"IF(#REF!<>\"\",#REF!,\"\")","v":{"$error":"#REF!"}}]

{"sheet":"DE108_26A","index":5,"n_rows":150,"n_cols":5,"rows_kept":150,"cut":false,"hidden":false,"merged":[[14,2,15,2],[16,4,17,4]]}
["TabTitle",{"$f":"C15","v":"STAGING NOTES"}]
["Number of Tab Columns",1]
["DE Starter Row Number",18]
["TabSheet Starter Row Number",5]
["TabSheet Header Row Count",4]
["Top Header Cell","E15"]
["Bottom Header Cell","E18"]
["DESheet Row Count",133]
["Fixed Empty Rows",5]
["Usable Empty Rows",0]
["Total Rows Placed",138,"xlLeft(1)",null,{"$f":"C11","v":"xlLeft(1)"}]
["Total Rows Needed",{"$f":"SUM(B8:B10)","v":138},"General",null,{"$f":"C12","v":"General"}]
["Last Tab DE Starter Row",104,{"$f":"CELL(\"width\",C13)","v":159},null,{"$f":"CELL(\"width\",E13)","v":0}]
["Last Tab TabSheet Starter Row",95,"A",null,{"$f":"LOWER(C14)","v":"a"}]
["Last Copy Starter Row",91,"STAGING NOTES",null,"108-26A"]
["Tab Loop Number",3,null,null,{"$f":"B17","v":"2008-08-01"}]
["Revision Date","2008-08-01",{"$f":"\"This Data Entry Sheet fills Tab \"&E15&\" effective \"&TEXT(B17,\"mm-dd-yy\")","v":"This Data Entry Sheet fills Tab 108-26A effective 08-01-08"},null,{"$f":"C15","v":"STAGING NOTES"}]
["Tabulation Width",2,"Stage 1A"]
["Horizontal Grid Lines","No","Traffic:"]
[null,null,"Maintain traffic on existing US 20."]
[null,null,"Close Cottingham Road and detour traffic north to Seippel Road then east to US 20."]
[null,null,"Maintain access to from US 20."]
[null,null,"Maintain access to Landfill and parcels to the east via existing US 20 access."]
[]
[null,null,"Construction:"]
[null,null,"Construct relocated Cottingham Road from Sta 8931+65 to Sta 8961+00 (just west of Higley Drive)."]
[null,null,"Construct Cottingham Road Connector."]
[null,null,"Construct Landfill Road but defer tie-in portion at west end until bridge and road is ready to open. "]
[null,null,"Construct Landfill Road Bridge over Catfish Creek."]
[null,null,"Construct Chesterfield Drive from Barrington Drive to Stone Valley Drive."]
[]
[null,null,"Stage 1B"]
[null,null,"Traffic:"]
[null,null,"Maintain traffic on existing US 20, existing SVR, existing North Cascade Road (NCR), Barrington Lakes Road and Stone Valley Drive."]
[null,null,"Open existing US 20 & Cottingham Road intersection with access to relocated Cottingham Road."]
[null,null,"Open relocated Cottingham Road to Cypress Drive."]
[null,null,"Open Landfill Road from existing landfill access to just west of new bridge for local access."]
[null,null,"Close access to parcels from US 20 east of landfill. "]
[null,null,"Open Chesterfield Drive."]
[null,null,"Close Higley Drive to US 20."]
[null,null,"Maintain local access north of proposed North Frontage Road (NFR) via US 20 with staged entrance construction to North Frontage Road.  No"]
[null,null,"access directly to US 20 following completion of NFR."]
[null,null,"Maintain local access north of proposed Tower Drive via US 20 with staged entrance construction to Tower Drive.  No access directly to US"]
[null,null,"20 following completion of Tower Drive."]
[]
[null,null,"Construction:"]
[null,null,"Continue construction of Landfill Road bridge."]
[null,null,"Construct US 20 WB Sta 955+00 to 1027+50."]
[null,null,"Construct US 20 EB Sta 959+00 to 984+00; Sta 999+75 to 1017+75."]
[null,null,"Construct WB entrance and exit ramps."]
[null,null,"Construct relocated Cottingham Road Sta 8961+00 to 8976+00."]
[null,null,"Construct NFR Sta 9976+24 to 10024+45."]
[null,null,"Construct Tower Drive Sta 400+00 to 420+00."]
[null,null,"Construct SVR Sta 5968+00 to 5976+24."]
[null,null,"Construct SVR Bridge over relocated US 20."]
[]
[null,null,"Stage 2A"]
[null,null,"Traffic:"]
[null,null,"Maintain traffic on existing US 20, and existing North Cascade Road (NCR) east and west of SVR."]
[null,null,"Close SVR and detour southeast to a location to be determined in final design."]
[null,null,"Maintain local access via staged entrance construction."]
[]
[null,null,"Construction:"]
[null,null,"Construct SVR Sta 5954+50 to 5961+00."]
[null,null,"Construct NCR West Sta 6936+00 to SVR."]
[null,null,"Construct NCR East from SVR to Sta 7966+50 and Sta 7974+50 to 7993+00."]
[]
[null,null,"Stage 2B"]
[null,null,"Traffic:"]
[null,null,"Maintain traffic on existing US 20."]
[null,null,"Maintain existing NCR connection to US 20."]
[null,null,"Open SVR and NCR West to traffic."]
[null,null,"Open NCR East from SVR to Sta 7966+50 and Sta 7974+50 to 7993+00 for local access."]
[null,null,"Close existing NCR west of SVR and detour to Cottingham Road."]
[null,null,"Close access to existing US 20 from truck stop Sta 979+00 +/-."]
[null,null,"Maintain local access at Sta 1029+50 and 1036+50."]
[]
[null,null,"Construction:"]
[null,null,"Construct remainder of NCR West Sta 6931+50 to 6936+00."]
[null,null,"Construct NCR East Sta 7966+50 to 7974+50."]
[null,null,"Construct South Frontage Road (SFR) Sta 2025+50 to 2032+75."]
[null,null,"Obliterate existing NCR west of SVR."]
[]
[null,null,"Stage 3A"]
[null,null,"Traffic:"]
[null,null,"Maintain 4 lane traffic on existing US 20 except as noted below."]
[null,null,"West End Pre-stage: Reduce EB and WB US 20 traffic to 1-lane during off peak hours for construction of detour pavement.  Following"]
[null,null,"pre-stage work, shift US 20 EB to new detour, shift US 20 WB to existing EB lanes via median crossing detour."]
[null,null,"East End Pre-stage: Reduce WB US 20 traffic to 1-lane during off peak hours for construction of detour pavement.  Following pre-stage"]
[null,null,"work, shift US 20 WB to new detour."]
[null,null,"Close existing North Cascade Road (NCR) east of SVR and detour south to a location to be determined in final design."]
[null,null,"Maintain local access on existing SFR via existing access point at Sta 1014+00+/-."]
[null,null,"Maintain local right in/right out access near east end south of US 20 via existing access point at Sta 1036+50+/-."]
[null,null,"Open Landfill Road from Landfill to Seippel Road via detour pavement and staged construction at west end."]
[null,null,"Close existing access from US 20 to landfill."]
[]
[null,null,"Construction:"]
[null,null,"West End Pre-Stage: Construct EB US 20 detour and WB US 20 median crossing detour pavement."]
[null,null,"Construct new WB US 20 from 943+00 to 955+00."]
[null,null,"East End Pre-Stage: Construct WB US 20 detour."]
[null,null,"Construct new US 20 WB Sta 1027+00 to 1040+50."]
[null,null,"Construct detour/shoulder strengthening for existing EB US 20 right side Sta 978+50 to 998+50 and temporary intersection at Sta"]
[null,null,"1001+00+/-."]
[null,null,"Construct remainder of NCR East Sta 7972+50 to 7997+00."]
[null,null,"Construct SFR from Sta 1993+02 to 1997+00."]
[]
[null,null,"Stage 3B"]
[null,null,"Traffic:"]
[null,null,"Shift WB US 20 traffic to new WB lanes."]
[null,null,"Open WB entrance and exit ramps with access to Cottingham Road and NFR."]
[null,null,"Maintain EB US 20 on existing and detour pavement."]
[null,null,"Maintain SVR EB US20 right in/right out access only (i.e. no access to WB US 20)."]
[null,null,"Open NCR East"]
[null,null,"Open temporary intersection on US 20 Sta 1001+00+/- providing access to NCR East and existing SFR via detour."]
[null,null,"Close local access on existing SFR at Sta 1014+00+/-."]
[null,null,"Maintain local EB US 20 right in/right out access near east end via existing access point at Sta 1036+50+/-."]
[]
[null,null,"Construction:"]
[null,null,"Construct new EB 20 from Sta 943+00 to 959+00,  Sta 984+00 to 999+75, and Sta 1017+75 to 1028+50."]
[null,null,"Construct additional detour pavement in median Sta 1017+00+/- to 1050+00+/-."]
[]
[null,null,"Stage 3C"]
[null,null,"Traffic:"]
[null,null,"Shift EB US 20 traffic to new EB lanes and median detour pavement at east end."]
[null,null,"Close SVR and detour traffic east on NCR East, SFR and detour pavement to temporary intersection at Sta 1001+00."]
[null,null,"Maintain existing SFR traffic via detour pavement to temporary intersection at Sta 1001+00 and NCR East."]
[null,null,"Maintain local EB US 20 right in/right out access near east end south of US 20 via existing access point at Sta 1036+50+/-."]
[]
[null,null,"Construction:"]
[null,null,"Construct EB exit and entrance ramps."]
[null,null,"Construct remainder of SVR Sta 5961+00 to 5968+00."]
[null,null,"Construct remainder of SFR from Sta 1997+00 to 2025+50."]
[]
[null,null,"Stage 3D"]
[null,null,"Traffic:"]
[null,null,"Open SVR Interchange"]
[null,null,"Open SVR"]
[null,null,"Open SFR"]
[null,null,"Close temporary intersection at Sta 1001+00."]
[null,null,"Close local access near east end south of US 20 at Sta 1036+50+/-."]
[]
[null,null,"Construction:"]
[null,null,"Construct EB US 20 Sta 1028+50 to 1040+50."]
[]
[null,null,"Stage 4"]
[null,null,"Traffic:"]
[null,null,"Place EB US 20 traffic on new pavement at east end."]
[]
[null,null,"Construction:"]
[null,null,"Construct median shoulder at east end."]

{"sheet":"108_26A","index":6,"n_rows":146,"n_cols":1,"rows_kept":146,"cut":false,"hidden":false,"merged":[[2,0,3,0],[92,0,93,0]]}
["108-26A"]
["2008-08-01"]
["STAGING NOTES"]
[]
[{"$f":"IF(OFFSET(DE108_26A!$C$18,ROWS($C$18:C18)-1,COLUMNS($C$18:C18)-1)<>\"\",OFFSET(DE108_26A!$C$18,ROWS($C$18:C18)-1,COLUMNS($C$18:C18)-1),\"\")","v":"Stage 1A"}]
[{"$f":"IF(OFFSET(DE108_26A!$C$18,ROWS($C$18:C19)-1,COLUMNS($C$18:C19)-1)<>\"\",OFFSET(DE108_26A!$C$18,ROWS($C$18:C19)-1,COLUMNS($C$18:C19)-1),\"\")","v":"Traffic:"}]
[{"$f":"IF(OFFSET(DE108_26A!$C$18,ROWS($C$18:C20)-1,COLUMNS($C$18:C20)-1)<>\"\",OFFSET(DE108_26A!$C$18,ROWS($C$18:C20)-1,COLUMNS($C$18:C20)-1),\"\")","v":"Maintain traffic on existing US 20."}]
[{"$f":"IF(OFFSET(DE108_26A!$C$18,ROWS($C$18:C21)-1,COLUMNS($C$18:C21)-1)<>\"\",OFFSET(DE108_26A!$C$18,ROWS($C$18:C21)-1,COLUMNS($C$18:C21)-1),\"\")","v":"Close Cottingham Road and detour traffic north to Seippel Road then east to US 20."}]
[{"$f":"IF(OFFSET(DE108_26A!$C$18,ROWS($C$18:C22)-1,COLUMNS($C$18:C22)-1)<>\"\",OFFSET(DE108_26A!$C$18,ROWS($C$18:C22)-1,COLUMNS($C$18:C22)-1),\"\")","v":"Maintain access to from US 20."}]
[{"$f":"IF(OFFSET(DE108_26A!$C$18,ROWS($C$18:C23)-1,COLUMNS($C$18:C23)-1)<>\"\",OFFSET(DE108_26A!$C$18,ROWS($C$18:C23)-1,COLUMNS($C$18:C23)-1),\"\")","v":"Maintain access to Landfill and parcels to the east via existing US 20 access."}]
[{"$f":"IF(OFFSET(DE108_26A!$C$18,ROWS($C$18:C24)-1,COLUMNS($C$18:C24)-1)<>\"\",OFFSET(DE108_26A!$C$18,ROWS($C$18:C24)-1,COLUMNS($C$18:C24)-1),\"\")","v":""}]
[{"$f":"IF(OFFSET(DE108_26A!$C$18,ROWS($C$18:C25)-1,COLUMNS($C$18:C25)-1)<>\"\",OFFSET(DE108_26A!$C$18,ROWS($C$18:C25)-1,COLUMNS($C$18:C25)-1),\"\")","v":"Construction:"}]
[{"$f":"IF(OFFSET(DE108_26A!$C$18,ROWS($C$18:C26)-1,COLUMNS($C$18:C26)-1)<>\"\",OFFSET(DE108_26A!$C$18,ROWS($C$18:C26)-1,COLUMNS($C$18:C26)-1),\"\")","v":"Construct relocated Cottingham Road from Sta 8931+65 to Sta 8961+00 (just west of Higley Drive)."}]
[{"$f":"IF(OFFSET(DE108_26A!$C$18,ROWS($C$18:C27)-1,COLUMNS($C$18:C27)-1)<>\"\",OFFSET(DE108_26A!$C$18,ROWS($C$18:C27)-1,COLUMNS($C$18:C27)-1),\"\")","v":"Construct Cottingham Road Connector."}]
[{"$f":"IF(OFFSET(DE108_26A!$C$18,ROWS($C$18:C28)-1,COLUMNS($C$18:C28)-1)<>\"\",OFFSET(DE108_26A!$C$18,ROWS($C$18:C28)-1,COLUMNS($C$18:C28)-1),\"\")","v":"Construct Landfill Road but defer tie-in portion at west end until bridge and road is ready to open. "}]
[{"$f":"IF(OFFSET(DE108_26A!$C$18,ROWS($C$18:C29)-1,COLUMNS($C$18:C29)-1)<>\"\",OFFSET(DE108_26A!$C$18,ROWS($C$18:C29)-1,COLUMNS($C$18:C29)-1),\"\")","v":"Construct Landfill Road Bridge over Catfish Creek."}]
[{"$f":"IF(OFFSET(DE108_26A!$C$18,ROWS($C$18:C30)-1,COLUMNS($C$18:C30)-1)<>\"\",OFFSET(DE108_26A!$C$18,ROWS($C$18:C30)-1,COLUMNS($C$18:C30)-1),\"\")","v":"Construct Chesterfield Drive from Barrington Drive to Stone Valley Drive."}]
[{"$f":"IF(OFFSET(DE108_26A!$C$18,ROWS($C$18:C31)-1,COLUMNS($C$18:C31)-1)<>\"\",OFFSET(DE108_26A!$C$18,ROWS($C$18:C31)-1,COLUMNS($C$18:C31)-1),\"\")","v":""}]
[{"$f":"IF(OFFSET(DE108_26A!$C$18,ROWS($C$18:C32)-1,COLUMNS($C$18:C32)-1)<>\"\",OFFSET(DE108_26A!$C$18,ROWS($C$18:C32)-1,COLUMNS($C$18:C32)-1),\"\")","v":"Stage 1B"}]
[{"$f":"IF(OFFSET(DE108_26A!$C$18,ROWS($C$18:C33)-1,COLUMNS($C$18:C33)-1)<>\"\",OFFSET(DE108_26A!$C$18,ROWS($C$18:C33)-1,COLUMNS($C$18:C33)-1),\"\")","v":"Traffic:"}]
[{"$f":"IF(OFFSET(DE108_26A!$C$18,ROWS($C$18:C34)-1,COLUMNS($C$18:C34)-1)<>\"\",OFFSET(DE108_26A!$C$18,ROWS($C$18:C34)-1,COLUMNS($C$18:C34)-1),\"\")","v":"Maintain traffic on existing US 20, existing SVR, existing North Cascade Road (NCR), Barrington Lakes Road and Stone Valley Drive."}]
[{"$f":"IF(OFFSET(DE108_26A!$C$18,ROWS($C$18:C35)-1,COLUMNS($C$18:C35)-1)<>\"\",OFFSET(DE108_26A!$C$18,ROWS($C$18:C35)-1,COLUMNS($C$18:C35)-1),\"\")","v":"Open existing US 20 & Cottingham Road intersection with access to relocated Cottingham Road."}]
[{"$f":"IF(OFFSET(DE108_26A!$C$18,ROWS($C$18:C36)-1,COLUMNS($C$18:C36)-1)<>\"\",OFFSET(DE108_26A!$C$18,ROWS($C$18:C36)-1,COLUMNS($C$18:C36)-1),\"\")","v":"Open relocated Cottingham Road to Cypress Drive."}]
[{"$f":"IF(OFFSET(DE108_26A!$C$18,ROWS($C$18:C37)-1,COLUMNS($C$18:C37)-1)<>\"\",OFFSET(DE108_26A!$C$18,ROWS($C$18:C37)-1,COLUMNS($C$18:C37)-1),\"\")","v":"Open Landfill Road from existing landfill access to just west of new bridge for local access."}]
[{"$f":"IF(OFFSET(DE108_26A!$C$18,ROWS($C$18:C38)-1,COLUMNS($C$18:C38)-1)<>\"\",OFFSET(DE108_26A!$C$18,ROWS($C$18:C38)-1,COLUMNS($C$18:C38)-1),\"\")","v":"Close access to parcels from US 20 east of landfill. "}]
[{"$f":"IF(OFFSET(DE108_26A!$C$18,ROWS($C$18:C39)-1,COLUMNS($C$18:C39)-1)<>\"\",OFFSET(DE108_26A!$C$18,ROWS($C$18:C39)-1,COLUMNS($C$18:C39)-1),\"\")","v":"Open Chesterfield Drive."}]
[{"$f":"IF(OFFSET(DE108_26A!$C$18,ROWS($C$18:C40)-1,COLUMNS($C$18:C40)-1)<>\"\",OFFSET(DE108_26A!$C$18,ROWS($C$18:C40)-1,COLUMNS($C$18:C40)-1),\"\")","v":"Close Higley Drive to US 20."}]
[{"$f":"IF(OFFSET(DE108_26A!$C$18,ROWS($C$18:C41)-1,COLUMNS($C$18:C41)-1)<>\"\",OFFSET(DE108_26A!$C$18,ROWS($C$18:C41)-1,COLUMNS($C$18:C41)-1),\"\")","v":"Maintain local access north of proposed North Frontage Road (NFR) via US 20 with staged entrance construction to North Frontage Road.  No"}]
[{"$f":"IF(OFFSET(DE108_26A!$C$18,ROWS($C$18:C42)-1,COLUMNS($C$18:C42)-1)<>\"\",OFFSET(DE108_26A!$C$18,ROWS($C$18:C42)-1,COLUMNS($C$18:C42)-1),\"\")","v":"access directly to US 20 following completion of NFR."}]
[{"$f":"IF(OFFSET(DE108_26A!$C$18,ROWS($C$18:C43)-1,COLUMNS($C$18:C43)-1)<>\"\",OFFSET(DE108_26A!$C$18,ROWS($C$18:C43)-1,COLUMNS($C$18:C43)-1),\"\")","v":"Maintain local access north of proposed Tower Drive via US 20 with staged entrance construction to Tower Drive.  No access directly to US"}]
[{"$f":"IF(OFFSET(DE108_26A!$C$18,ROWS($C$18:C44)-1,COLUMNS($C$18:C44)-1)<>\"\",OFFSET(DE108_26A!$C$18,ROWS($C$18:C44)-1,COLUMNS($C$18:C44)-1),\"\")","v":"20 following completion of Tower Drive."}]
[{"$f":"IF(OFFSET(DE108_26A!$C$18,ROWS($C$18:C45)-1,COLUMNS($C$18:C45)-1)<>\"\",OFFSET(DE108_26A!$C$18,ROWS($C$18:C45)-1,COLUMNS($C$18:C45)-1),\"\")","v":""}]
[{"$f":"IF(OFFSET(DE108_26A!$C$18,ROWS($C$18:C46)-1,COLUMNS($C$18:C46)-1)<>\"\",OFFSET(DE108_26A!$C$18,ROWS($C$18:C46)-1,COLUMNS($C$18:C46)-1),\"\")","v":"Construction:"}]
[{"$f":"IF(OFFSET(DE108_26A!$C$18,ROWS($C$18:C47)-1,COLUMNS($C$18:C47)-1)<>\"\",OFFSET(DE108_26A!$C$18,ROWS($C$18:C47)-1,COLUMNS($C$18:C47)-1),\"\")","v":"Continue construction of Landfill Road bridge."}]
[{"$f":"IF(OFFSET(DE108_26A!$C$18,ROWS($C$18:C48)-1,COLUMNS($C$18:C48)-1)<>\"\",OFFSET(DE108_26A!$C$18,ROWS($C$18:C48)-1,COLUMNS($C$18:C48)-1),\"\")","v":"Construct US 20 WB Sta 955+00 to 1027+50."}]
[{"$f":"IF(OFFSET(DE108_26A!$C$18,ROWS($C$18:C49)-1,COLUMNS($C$18:C49)-1)<>\"\",OFFSET(DE108_26A!$C$18,ROWS($C$18:C49)-1,COLUMNS($C$18:C49)-1),\"\")","v":"Construct US 20 EB Sta 959+00 to 984+00; Sta 999+75 to 1017+75."}]
[{"$f":"IF(OFFSET(DE108_26A!$C$18,ROWS($C$18:C50)-1,COLUMNS($C$18:C50)-1)<>\"\",OFFSET(DE108_26A!$C$18,ROWS($C$18:C50)-1,COLUMNS($C$18:C50)-1),\"\")","v":"Construct WB entrance and exit ramps."}]
[{"$f":"IF(OFFSET(DE108_26A!$C$18,ROWS($C$18:C51)-1,COLUMNS($C$18:C51)-1)<>\"\",OFFSET(DE108_26A!$C$18,ROWS($C$18:C51)-1,COLUMNS($C$18:C51)-1),\"\")","v":"Construct relocated Cottingham Road Sta 8961+00 to 8976+00."}]
[{"$f":"IF(OFFSET(DE108_26A!$C$18,ROWS($C$18:C52)-1,COLUMNS($C$18:C52)-1)<>\"\",OFFSET(DE108_26A!$C$18,ROWS($C$18:C52)-1,COLUMNS($C$18:C52)-1),\"\")","v":"Construct NFR Sta 9976+24 to 10024+45."}]
[{"$f":"IF(OFFSET(DE108_26A!$C$18,ROWS($C$18:C53)-1,COLUMNS($C$18:C53)-1)<>\"\",OFFSET(DE108_26A!$C$18,ROWS($C$18:C53)-1,COLUMNS($C$18:C53)-1),\"\")","v":"Construct Tower Drive Sta 400+00 to 420+00."}]
[{"$f":"IF(OFFSET(DE108_26A!$C$18,ROWS($C$18:C54)-1,COLUMNS($C$18:C54)-1)<>\"\",OFFSET(DE108_26A!$C$18,ROWS($C$18:C54)-1,COLUMNS($C$18:C54)-1),\"\")","v":"Construct SVR Sta 5968+00 to 5976+24."}]
[{"$f":"IF(OFFSET(DE108_26A!$C$18,ROWS($C$18:C55)-1,COLUMNS($C$18:C55)-1)<>\"\",OFFSET(DE108_26A!$C$18,ROWS($C$18:C55)-1,COLUMNS($C$18:C55)-1),\"\")","v":"Construct SVR Bridge over relocated US 20."}]
[{"$f":"IF(OFFSET(DE108_26A!$C$18,ROWS($C$18:C56)-1,COLUMNS($C$18:C56)-1)<>\"\",OFFSET(DE108_26A!$C$18,ROWS($C$18:C56)-1,COLUMNS($C$18:C56)-1),\"\")","v":""}]
[{"$f":"IF(OFFSET(DE108_26A!$C$18,ROWS($C$18:C57)-1,COLUMNS($C$18:C57)-1)<>\"\",OFFSET(DE108_26A!$C$18,ROWS($C$18:C57)-1,COLUMNS($C$18:C57)-1),\"\")","v":"Stage 2A"}]
[{"$f":"IF(OFFSET(DE108_26A!$C$18,ROWS($C$18:C58)-1,COLUMNS($C$18:C58)-1)<>\"\",OFFSET(DE108_26A!$C$18,ROWS($C$18:C58)-1,COLUMNS($C$18:C58)-1),\"\")","v":"Traffic:"}]
[{"$f":"IF(OFFSET(DE108_26A!$C$18,ROWS($C$18:C59)-1,COLUMNS($C$18:C59)-1)<>\"\",OFFSET(DE108_26A!$C$18,ROWS($C$18:C59)-1,COLUMNS($C$18:C59)-1),\"\")","v":"Maintain traffic on existing US 20, and existing North Cascade Road (NCR) east and west of SVR."}]
[{"$f":"IF(OFFSET(DE108_26A!$C$18,ROWS($C$18:C60)-1,COLUMNS($C$18:C60)-1)<>\"\",OFFSET(DE108_26A!$C$18,ROWS($C$18:C60)-1,COLUMNS($C$18:C60)-1),\"\")","v":"Close SVR and detour southeast to a location to be determined in final design."}]
[{"$f":"IF(OFFSET(DE108_26A!$C$18,ROWS($C$18:C61)-1,COLUMNS($C$18:C61)-1)<>\"\",OFFSET(DE108_26A!$C$18,ROWS($C$18:C61)-1,COLUMNS($C$18:C61)-1),\"\")","v":"Maintain local access via staged entrance construction."}]
[{"$f":"IF(OFFSET(DE108_26A!$C$18,ROWS($C$18:C62)-1,COLUMNS($C$18:C62)-1)<>\"\",OFFSET(DE108_26A!$C$18,ROWS($C$18:C62)-1,COLUMNS($C$18:C62)-1),\"\")","v":""}]
[{"$f":"IF(OFFSET(DE108_26A!$C$18,ROWS($C$18:C63)-1,COLUMNS($C$18:C63)-1)<>\"\",OFFSET(DE108_26A!$C$18,ROWS($C$18:C63)-1,COLUMNS($C$18:C63)-1),\"\")","v":"Construction:"}]
[{"$f":"IF(OFFSET(DE108_26A!$C$18,ROWS($C$18:C64)-1,COLUMNS($C$18:C64)-1)<>\"\",OFFSET(DE108_26A!$C$18,ROWS($C$18:C64)-1,COLUMNS($C$18:C64)-1),\"\")","v":"Construct SVR Sta 5954+50 to 5961+00."}]
[{"$f":"IF(OFFSET(DE108_26A!$C$18,ROWS($C$18:C65)-1,COLUMNS($C$18:C65)-1)<>\"\",OFFSET(DE108_26A!$C$18,ROWS($C$18:C65)-1,COLUMNS($C$18:C65)-1),\"\")","v":"Construct NCR West Sta 6936+00 to SVR."}]
[{"$f":"IF(OFFSET(DE108_26A!$C$18,ROWS($C$18:C66)-1,COLUMNS($C$18:C66)-1)<>\"\",OFFSET(DE108_26A!$C$18,ROWS($C$18:C66)-1,COLUMNS($C$18:C66)-1),\"\")","v":"Construct NCR East from SVR to Sta 7966+50 and Sta 7974+50 to 7993+00."}]
[{"$f":"IF(OFFSET(DE108_26A!$C$18,ROWS($C$18:C67)-1,COLUMNS($C$18:C67)-1)<>\"\",OFFSET(DE108_26A!$C$18,ROWS($C$18:C67)-1,COLUMNS($C$18:C67)-1),\"\")","v":""}]
[{"$f":"IF(OFFSET(DE108_26A!$C$18,ROWS($C$18:C68)-1,COLUMNS($C$18:C68)-1)<>\"\",OFFSET(DE108_26A!$C$18,ROWS($C$18:C68)-1,COLUMNS($C$18:C68)-1),\"\")","v":"Stage 2B"}]
[{"$f":"IF(OFFSET(DE108_26A!$C$18,ROWS($C$18:C69)-1,COLUMNS($C$18:C69)-1)<>\"\",OFFSET(DE108_26A!$C$18,ROWS($C$18:C69)-1,COLUMNS($C$18:C69)-1),\"\")","v":"Traffic:"}]
[{"$f":"IF(OFFSET(DE108_26A!$C$18,ROWS($C$18:C70)-1,COLUMNS($C$18:C70)-1)<>\"\",OFFSET(DE108_26A!$C$18,ROWS($C$18:C70)-1,COLUMNS($C$18:C70)-1),\"\")","v":"Maintain traffic on existing US 20."}]
[{"$f":"IF(OFFSET(DE108_26A!$C$18,ROWS($C$18:C71)-1,COLUMNS($C$18:C71)-1)<>\"\",OFFSET(DE108_26A!$C$18,ROWS($C$18:C71)-1,COLUMNS($C$18:C71)-1),\"\")","v":"Maintain existing NCR connection to US 20."}]
[{"$f":"IF(OFFSET(DE108_26A!$C$18,ROWS($C$18:C72)-1,COLUMNS($C$18:C72)-1)<>\"\",OFFSET(DE108_26A!$C$18,ROWS($C$18:C72)-1,COLUMNS($C$18:C72)-1),\"\")","v":"Open SVR and NCR West to traffic."}]
[{"$f":"IF(OFFSET(DE108_26A!$C$18,ROWS($C$18:C73)-1,COLUMNS($C$18:C73)-1)<>\"\",OFFSET(DE108_26A!$C$18,ROWS($C$18:C73)-1,COLUMNS($C$18:C73)-1),\"\")","v":"Open NCR East from SVR to Sta 7966+50 and Sta 7974+50 to 7993+00 for local access."}]
[{"$f":"IF(OFFSET(DE108_26A!$C$18,ROWS($C$18:C74)-1,COLUMNS($C$18:C74)-1)<>\"\",OFFSET(DE108_26A!$C$18,ROWS($C$18:C74)-1,COLUMNS($C$18:C74)-1),\"\")","v":"Close existing NCR west of SVR and detour to Cottingham Road."}]
[{"$f":"IF(OFFSET(DE108_26A!$C$18,ROWS($C$18:C75)-1,COLUMNS($C$18:C75)-1)<>\"\",OFFSET(DE108_26A!$C$18,ROWS($C$18:C75)-1,COLUMNS($C$18:C75)-1),\"\")","v":"Close access to existing US 20 from truck stop Sta 979+00 +/-."}]
[{"$f":"IF(OFFSET(DE108_26A!$C$18,ROWS($C$18:C76)-1,COLUMNS($C$18:C76)-1)<>\"\",OFFSET(DE108_26A!$C$18,ROWS($C$18:C76)-1,COLUMNS($C$18:C76)-1),\"\")","v":"Maintain local access at Sta 1029+50 and 1036+50."}]
[{"$f":"IF(OFFSET(DE108_26A!$C$18,ROWS($C$18:C77)-1,COLUMNS($C$18:C77)-1)<>\"\",OFFSET(DE108_26A!$C$18,ROWS($C$18:C77)-1,COLUMNS($C$18:C77)-1),\"\")","v":""}]
[{"$f":"IF(OFFSET(DE108_26A!$C$18,ROWS($C$18:C78)-1,COLUMNS($C$18:C78)-1)<>\"\",OFFSET(DE108_26A!$C$18,ROWS($C$18:C78)-1,COLUMNS($C$18:C78)-1),\"\")","v":"Construction:"}]
[{"$f":"IF(OFFSET(DE108_26A!$C$18,ROWS($C$18:C79)-1,COLUMNS($C$18:C79)-1)<>\"\",OFFSET(DE108_26A!$C$18,ROWS($C$18:C79)-1,COLUMNS($C$18:C79)-1),\"\")","v":"Construct remainder of NCR West Sta 6931+50 to 6936+00."}]
[{"$f":"IF(OFFSET(DE108_26A!$C$18,ROWS($C$18:C80)-1,COLUMNS($C$18:C80)-1)<>\"\",OFFSET(DE108_26A!$C$18,ROWS($C$18:C80)-1,COLUMNS($C$18:C80)-1),\"\")","v":"Construct NCR East Sta 7966+50 to 7974+50."}]
[{"$f":"IF(OFFSET(DE108_26A!$C$18,ROWS($C$18:C81)-1,COLUMNS($C$18:C81)-1)<>\"\",OFFSET(DE108_26A!$C$18,ROWS($C$18:C81)-1,COLUMNS($C$18:C81)-1),\"\")","v":"Construct South Frontage Road (SFR) Sta 2025+50 to 2032+75."}]
[{"$f":"IF(OFFSET(DE108_26A!$C$18,ROWS($C$18:C82)-1,COLUMNS($C$18:C82)-1)<>\"\",OFFSET(DE108_26A!$C$18,ROWS($C$18:C82)-1,COLUMNS($C$18:C82)-1),\"\")","v":"Obliterate existing NCR west of SVR."}]
[{"$f":"IF(OFFSET(DE108_26A!$C$18,ROWS($C$18:C83)-1,COLUMNS($C$18:C83)-1)<>\"\",OFFSET(DE108_26A!$C$18,ROWS($C$18:C83)-1,COLUMNS($C$18:C83)-1),\"\")","v":""}]
[{"$f":"IF(OFFSET(DE108_26A!$C$18,ROWS($C$18:C84)-1,COLUMNS($C$18:C84)-1)<>\"\",OFFSET(DE108_26A!$C$18,ROWS($C$18:C84)-1,COLUMNS($C$18:C84)-1),\"\")","v":"Stage 3A"}]
[{"$f":"IF(OFFSET(DE108_26A!$C$18,ROWS($C$18:C85)-1,COLUMNS($C$18:C85)-1)<>\"\",OFFSET(DE108_26A!$C$18,ROWS($C$18:C85)-1,COLUMNS($C$18:C85)-1),\"\")","v":"Traffic:"}]
[{"$f":"IF(OFFSET(DE108_26A!$C$18,ROWS($C$18:C86)-1,COLUMNS($C$18:C86)-1)<>\"\",OFFSET(DE108_26A!$C$18,ROWS($C$18:C86)-1,COLUMNS($C$18:C86)-1),\"\")","v":"Maintain 4 lane traffic on existing US 20 except as noted below."}]
[{"$f":"IF(OFFSET(DE108_26A!$C$18,ROWS($C$18:C87)-1,COLUMNS($C$18:C87)-1)<>\"\",OFFSET(DE108_26A!$C$18,ROWS($C$18:C87)-1,COLUMNS($C$18:C87)-1),\"\")","v":"West End Pre-stage: Reduce EB and WB US 20 traffic to 1-lane during off peak hours for construction of detour pavement.  Following"}]
[{"$f":"IF(OFFSET(DE108_26A!$C$18,ROWS($C$18:C88)-1,COLUMNS($C$18:C88)-1)<>\"\",OFFSET(DE108_26A!$C$18,ROWS($C$18:C88)-1,COLUMNS($C$18:C88)-1),\"\")","v":"pre-stage work, shift US 20 EB to new detour, shift US 20 WB to existing EB lanes via median crossing detour."}]
[{"$f":"IF(OFFSET(DE108_26A!$C$18,ROWS($C$18:C89)-1,COLUMNS($C$18:C89)-1)<>\"\",OFFSET(DE108_26A!$C$18,ROWS($C$18:C89)-1,COLUMNS($C$18:C89)-1),\"\")","v":"East End Pre-stage: Reduce WB US 20 traffic to 1-lane during off peak hours for construction of detour pavement.  Following pre-stage"}]
[{"$f":"IF(OFFSET(DE108_26A!$C$18,ROWS($C$18:C90)-1,COLUMNS($C$18:C90)-1)<>\"\",OFFSET(DE108_26A!$C$18,ROWS($C$18:C90)-1,COLUMNS($C$18:C90)-1),\"\")","v":"work, shift US 20 WB to new detour."}]
[{"$f":"IF(OFFSET(DE108_26A!$C$18,ROWS($C$18:C91)-1,COLUMNS($C$18:C91)-1)<>\"\",OFFSET(DE108_26A!$C$18,ROWS($C$18:C91)-1,COLUMNS($C$18:C91)-1),\"\")","v":"Close existing North Cascade Road (NCR) east of SVR and detour south to a location to be determined in final design."}]
[{"$f":"IF(OFFSET(DE108_26A!$C$18,ROWS($C$18:C92)-1,COLUMNS($C$18:C92)-1)<>\"\",OFFSET(DE108_26A!$C$18,ROWS($C$18:C92)-1,COLUMNS($C$18:C92)-1),\"\")","v":"Maintain local access on existing SFR via existing access point at Sta 1014+00+/-."}]
[{"$f":"IF(OFFSET(DE108_26A!$C$18,ROWS($C$18:C93)-1,COLUMNS($C$18:C93)-1)<>\"\",OFFSET(DE108_26A!$C$18,ROWS($C$18:C93)-1,COLUMNS($C$18:C93)-1),\"\")","v":"Maintain local right in/right out access near east end south of US 20 via existing access point at Sta 1036+50+/-."}]
[{"$f":"IF(OFFSET(DE108_26A!$C$18,ROWS($C$18:C94)-1,COLUMNS($C$18:C94)-1)<>\"\",OFFSET(DE108_26A!$C$18,ROWS($C$18:C94)-1,COLUMNS($C$18:C94)-1),\"\")","v":"Open Landfill Road from Landfill to Seippel Road via detour pavement and staged construction at west end."}]
[{"$f":"IF(OFFSET(DE108_26A!$C$18,ROWS($C$18:C95)-1,COLUMNS($C$18:C95)-1)<>\"\",OFFSET(DE108_26A!$C$18,ROWS($C$18:C95)-1,COLUMNS($C$18:C95)-1),\"\")","v":"Close existing access from US 20 to landfill."}]
[{"$f":"IF(OFFSET(DE108_26A!$C$18,ROWS($C$18:C96)-1,COLUMNS($C$18:C96)-1)<>\"\",OFFSET(DE108_26A!$C$18,ROWS($C$18:C96)-1,COLUMNS($C$18:C96)-1),\"\")","v":""}]
[{"$f":"IF(OFFSET(DE108_26A!$C$18,ROWS($C$18:C97)-1,COLUMNS($C$18:C97)-1)<>\"\",OFFSET(DE108_26A!$C$18,ROWS($C$18:C97)-1,COLUMNS($C$18:C97)-1),\"\")","v":"Construction:"}]
[{"$f":"IF(OFFSET(DE108_26A!$C$18,ROWS($C$18:C98)-1,COLUMNS($C$18:C98)-1)<>\"\",OFFSET(DE108_26A!$C$18,ROWS($C$18:C98)-1,COLUMNS($C$18:C98)-1),\"\")","v":"West End Pre-Stage: Construct EB US 20 detour and WB US 20 median crossing detour pavement."}]
[{"$f":"IF(OFFSET(DE108_26A!$C$18,ROWS($C$18:C99)-1,COLUMNS($C$18:C99)-1)<>\"\",OFFSET(DE108_26A!$C$18,ROWS($C$18:C99)-1,COLUMNS($C$18:C99)-1),\"\")","v":"Construct new WB US 20 from 943+00 to 955+00."}]
[{"$f":"IF(OFFSET(DE108_26A!$C$18,ROWS($C$18:C100)-1,COLUMNS($C$18:C100)-1)<>\"\",OFFSET(DE108_26A!$C$18,ROWS($C$18:C100)-1,COLUMNS($C$18:C100)-1),\"\")","v":"East End Pre-Stage: Construct WB US 20 detour."}]
[{"$f":"IF(OFFSET(DE108_26A!$C$18,ROWS($C$18:C101)-1,COLUMNS($C$18:C101)-1)<>\"\",OFFSET(DE108_26A!$C$18,ROWS($C$18:C101)-1,COLUMNS($C$18:C101)-1),\"\")","v":"Construct new US 20 WB Sta 1027+00 to 1040+50."}]
[{"$f":"IF(OFFSET(DE108_26A!$C$18,ROWS($C$18:C102)-1,COLUMNS($C$18:C102)-1)<>\"\",OFFSET(DE108_26A!$C$18,ROWS($C$18:C102)-1,COLUMNS($C$18:C102)-1),\"\")","v":"Construct detour/shoulder strengthening for existing EB US 20 right side Sta 978+50 to 998+50 and temporary intersection at Sta"}]
[{"$f":"IF(OFFSET(DE108_26A!$C$18,ROWS($C$18:C103)-1,COLUMNS($C$18:C103)-1)<>\"\",OFFSET(DE108_26A!$C$18,ROWS($C$18:C103)-1,COLUMNS($C$18:C103)-1),\"\")","v":"1001+00+/-."}]
["108-26A"]
["2008-08-01"]
["STAGING NOTES"]
[]
[{"$f":"IF(OFFSET(DE108_26A!$C$104,ROWS($C$104:C104)-1,COLUMNS($C$104:C104)-1)<>\"\",OFFSET(DE108_26A!$C$104,ROWS($C$104:C104)-1,COLUMNS($C$104:C104)-1),\"\")","v":"Construct remainder of NCR East Sta 7972+50 to 7997+00."}]
[{"$f":"IF(OFFSET(DE108_26A!$C$104,ROWS($C$104:C105)-1,COLUMNS($C$104:C105)-1)<>\"\",OFFSET(DE108_26A!$C$104,ROWS($C$104:C105)-1,COLUMNS($C$104:C105)-1),\"\")","v":"Construct SFR from Sta 1993+02 to 1997+00."}]
[{"$f":"IF(OFFSET(DE108_26A!$C$104,ROWS($C$104:C106)-1,COLUMNS($C$104:C106)-1)<>\"\",OFFSET(DE108_26A!$C$104,ROWS($C$104:C106)-1,COLUMNS($C$104:C106)-1),\"\")","v":""}]
[{"$f":"IF(OFFSET(DE108_26A!$C$104,ROWS($C$104:C107)-1,COLUMNS($C$104:C107)-1)<>\"\",OFFSET(DE108_26A!$C$104,ROWS($C$104:C107)-1,COLUMNS($C$104:C107)-1),\"\")","v":"Stage 3B"}]
[{"$f":"IF(OFFSET(DE108_26A!$C$104,ROWS($C$104:C108)-1,COLUMNS($C$104:C108)-1)<>\"\",OFFSET(DE108_26A!$C$104,ROWS($C$104:C108)-1,COLUMNS($C$104:C108)-1),\"\")","v":"Traffic:"}]
[{"$f":"IF(OFFSET(DE108_26A!$C$104,ROWS($C$104:C109)-1,COLUMNS($C$104:C109)-1)<>\"\",OFFSET(DE108_26A!$C$104,ROWS($C$104:C109)-1,COLUMNS($C$104:C109)-1),\"\")","v":"Shift WB US 20 traffic to new WB lanes."}]
[{"$f":"IF(OFFSET(DE108_26A!$C$104,ROWS($C$104:C110)-1,COLUMNS($C$104:C110)-1)<>\"\",OFFSET(DE108_26A!$C$104,ROWS($C$104:C110)-1,COLUMNS($C$104:C110)-1),\"\")","v":"Open WB entrance and exit ramps with access to Cottingham Road and NFR."}]
[{"$f":"IF(OFFSET(DE108_26A!$C$104,ROWS($C$104:C111)-1,COLUMNS($C$104:C111)-1)<>\"\",OFFSET(DE108_26A!$C$104,ROWS($C$104:C111)-1,COLUMNS($C$104:C111)-1),\"\")","v":"Maintain EB US 20 on existing and detour pavement."}]
[{"$f":"IF(OFFSET(DE108_26A!$C$104,ROWS($C$104:C112)-1,COLUMNS($C$104:C112)-1)<>\"\",OFFSET(DE108_26A!$C$104,ROWS($C$104:C112)-1,COLUMNS($C$104:C112)-1),\"\")","v":"Maintain SVR EB US20 right in/right out access only (i.e. no access to WB US 20)."}]
[{"$f":"IF(OFFSET(DE108_26A!$C$104,ROWS($C$104:C113)-1,COLUMNS($C$104:C113)-1)<>\"\",OFFSET(DE108_26A!$C$104,ROWS($C$104:C113)-1,COLUMNS($C$104:C113)-1),\"\")","v":"Open NCR East"}]
[{"$f":"IF(OFFSET(DE108_26A!$C$104,ROWS($C$104:C114)-1,COLUMNS($C$104:C114)-1)<>\"\",OFFSET(DE108_26A!$C$104,ROWS($C$104:C114)-1,COLUMNS($C$104:C114)-1),\"\")","v":"Open temporary intersection on US 20 Sta 1001+00+/- providing access to NCR East and existing SFR via detour."}]
[{"$f":"IF(OFFSET(DE108_26A!$C$104,ROWS($C$104:C115)-1,COLUMNS($C$104:C115)-1)<>\"\",OFFSET(DE108_26A!$C$104,ROWS($C$104:C115)-1,COLUMNS($C$104:C115)-1),\"\")","v":"Close local access on existing SFR at Sta 1014+00+/-."}]
[{"$f":"IF(OFFSET(DE108_26A!$C$104,ROWS($C$104:C116)-1,COLUMNS($C$104:C116)-1)<>\"\",OFFSET(DE108_26A!$C$104,ROWS($C$104:C116)-1,COLUMNS($C$104:C116)-1),\"\")","v":"Maintain local EB US 20 right in/right out access near east end via existing access point at Sta 1036+50+/-."}]
[{"$f":"IF(OFFSET(DE108_26A!$C$104,ROWS($C$104:C117)-1,COLUMNS($C$104:C117)-1)<>\"\",OFFSET(DE108_26A!$C$104,ROWS($C$104:C117)-1,COLUMNS($C$104:C117)-1),\"\")","v":""}]
[{"$f":"IF(OFFSET(DE108_26A!$C$104,ROWS($C$104:C118)-1,COLUMNS($C$104:C118)-1)<>\"\",OFFSET(DE108_26A!$C$104,ROWS($C$104:C118)-1,COLUMNS($C$104:C118)-1),\"\")","v":"Construction:"}]
[{"$f":"IF(OFFSET(DE108_26A!$C$104,ROWS($C$104:C119)-1,COLUMNS($C$104:C119)-1)<>\"\",OFFSET(DE108_26A!$C$104,ROWS($C$104:C119)-1,COLUMNS($C$104:C119)-1),\"\")","v":"Construct new EB 20 from Sta 943+00 to 959+00,  Sta 984+00 to 999+75, and Sta 1017+75 to 1028+50."}]
[{"$f":"IF(OFFSET(DE108_26A!$C$104,ROWS($C$104:C120)-1,COLUMNS($C$104:C120)-1)<>\"\",OFFSET(DE108_26A!$C$104,ROWS($C$104:C120)-1,COLUMNS($C$104:C120)-1),\"\")","v":"Construct additional detour pavement in median Sta 1017+00+/- to 1050+00+/-."}]
[{"$f":"IF(OFFSET(DE108_26A!$C$104,ROWS($C$104:C121)-1,COLUMNS($C$104:C121)-1)<>\"\",OFFSET(DE108_26A!$C$104,ROWS($C$104:C121)-1,COLUMNS($C$104:C121)-1),\"\")","v":""}]
[{"$f":"IF(OFFSET(DE108_26A!$C$104,ROWS($C$104:C122)-1,COLUMNS($C$104:C122)-1)<>\"\",OFFSET(DE108_26A!$C$104,ROWS($C$104:C122)-1,COLUMNS($C$104:C122)-1),\"\")","v":"Stage 3C"}]
[{"$f":"IF(OFFSET(DE108_26A!$C$104,ROWS($C$104:C123)-1,COLUMNS($C$104:C123)-1)<>\"\",OFFSET(DE108_26A!$C$104,ROWS($C$104:C123)-1,COLUMNS($C$104:C123)-1),\"\")","v":"Traffic:"}]
[{"$f":"IF(OFFSET(DE108_26A!$C$104,ROWS($C$104:C124)-1,COLUMNS($C$104:C124)-1)<>\"\",OFFSET(DE108_26A!$C$104,ROWS($C$104:C124)-1,COLUMNS($C$104:C124)-1),\"\")","v":"Shift EB US 20 traffic to new EB lanes and median detour pavement at east end."}]
[{"$f":"IF(OFFSET(DE108_26A!$C$104,ROWS($C$104:C125)-1,COLUMNS($C$104:C125)-1)<>\"\",OFFSET(DE108_26A!$C$104,ROWS($C$104:C125)-1,COLUMNS($C$104:C125)-1),\"\")","v":"Close SVR and detour traffic east on NCR East, SFR and detour pavement to temporary intersection at Sta 1001+00."}]
[{"$f":"IF(OFFSET(DE108_26A!$C$104,ROWS($C$104:C126)-1,COLUMNS($C$104:C126)-1)<>\"\",OFFSET(DE108_26A!$C$104,ROWS($C$104:C126)-1,COLUMNS($C$104:C126)-1),\"\")","v":"Maintain existing SFR traffic via detour pavement to temporary intersection at Sta 1001+00 and NCR East."}]
[{"$f":"IF(OFFSET(DE108_26A!$C$104,ROWS($C$104:C127)-1,COLUMNS($C$104:C127)-1)<>\"\",OFFSET(DE108_26A!$C$104,ROWS($C$104:C127)-1,COLUMNS($C$104:C127)-1),\"\")","v":"Maintain local EB US 20 right in/right out access near east end south of US 20 via existing access point at Sta 1036+50+/-."}]
[{"$f":"IF(OFFSET(DE108_26A!$C$104,ROWS($C$104:C128)-1,COLUMNS($C$104:C128)-1)<>\"\",OFFSET(DE108_26A!$C$104,ROWS($C$104:C128)-1,COLUMNS($C$104:C128)-1),\"\")","v":""}]
[{"$f":"IF(OFFSET(DE108_26A!$C$104,ROWS($C$104:C129)-1,COLUMNS($C$104:C129)-1)<>\"\",OFFSET(DE108_26A!$C$104,ROWS($C$104:C129)-1,COLUMNS($C$104:C129)-1),\"\")","v":"Construction:"}]
[{"$f":"IF(OFFSET(DE108_26A!$C$104,ROWS($C$104:C130)-1,COLUMNS($C$104:C130)-1)<>\"\",OFFSET(DE108_26A!$C$104,ROWS($C$104:C130)-1,COLUMNS($C$104:C130)-1),\"\")","v":"Construct EB exit and entrance ramps."}]
[{"$f":"IF(OFFSET(DE108_26A!$C$104,ROWS($C$104:C131)-1,COLUMNS($C$104:C131)-1)<>\"\",OFFSET(DE108_26A!$C$104,ROWS($C$104:C131)-1,COLUMNS($C$104:C131)-1),\"\")","v":"Construct remainder of SVR Sta 5961+00 to 5968+00."}]
[{"$f":"IF(OFFSET(DE108_26A!$C$104,ROWS($C$104:C132)-1,COLUMNS($C$104:C132)-1)<>\"\",OFFSET(DE108_26A!$C$104,ROWS($C$104:C132)-1,COLUMNS($C$104:C132)-1),\"\")","v":"Construct remainder of SFR from Sta 1997+00 to 2025+50."}]
[{"$f":"IF(OFFSET(DE108_26A!$C$104,ROWS($C$104:C133)-1,COLUMNS($C$104:C133)-1)<>\"\",OFFSET(DE108_26A!$C$104,ROWS($C$104:C133)-1,COLUMNS($C$104:C133)-1),\"\")","v":""}]
[{"$f":"IF(OFFSET(DE108_26A!$C$104,ROWS($C$104:C134)-1,COLUMNS($C$104:C134)-1)<>\"\",OFFSET(DE108_26A!$C$104,ROWS($C$104:C134)-1,COLUMNS($C$104:C134)-1),\"\")","v":"Stage 3D"}]
[{"$f":"IF(OFFSET(DE108_26A!$C$104,ROWS($C$104:C135)-1,COLUMNS($C$104:C135)-1)<>\"\",OFFSET(DE108_26A!$C$104,ROWS($C$104:C135)-1,COLUMNS($C$104:C135)-1),\"\")","v":"Traffic:"}]
[{"$f":"IF(OFFSET(DE108_26A!$C$104,ROWS($C$104:C136)-1,COLUMNS($C$104:C136)-1)<>\"\",OFFSET(DE108_26A!$C$104,ROWS($C$104:C136)-1,COLUMNS($C$104:C136)-1),\"\")","v":"Open SVR Interchange"}]
[{"$f":"IF(OFFSET(DE108_26A!$C$104,ROWS($C$104:C137)-1,COLUMNS($C$104:C137)-1)<>\"\",OFFSET(DE108_26A!$C$104,ROWS($C$104:C137)-1,COLUMNS($C$104:C137)-1),\"\")","v":"Open SVR"}]
[{"$f":"IF(OFFSET(DE108_26A!$C$104,ROWS($C$104:C138)-1,COLUMNS($C$104:C138)-1)<>\"\",OFFSET(DE108_26A!$C$104,ROWS($C$104:C138)-1,COLUMNS($C$104:C138)-1),\"\")","v":"Open SFR"}]
[{"$f":"IF(OFFSET(DE108_26A!$C$104,ROWS($C$104:C139)-1,COLUMNS($C$104:C139)-1)<>\"\",OFFSET(DE108_26A!$C$104,ROWS($C$104:C139)-1,COLUMNS($C$104:C139)-1),\"\")","v":"Close temporary intersection at Sta 1001+00."}]
[{"$f":"IF(OFFSET(DE108_26A!$C$104,ROWS($C$104:C140)-1,COLUMNS($C$104:C140)-1)<>\"\",OFFSET(DE108_26A!$C$104,ROWS($C$104:C140)-1,COLUMNS($C$104:C140)-1),\"\")","v":"Close local access near east end south of US 20 at Sta 1036+50+/-."}]
[{"$f":"IF(OFFSET(DE108_26A!$C$104,ROWS($C$104:C141)-1,COLUMNS($C$104:C141)-1)<>\"\",OFFSET(DE108_26A!$C$104,ROWS($C$104:C141)-1,COLUMNS($C$104:C141)-1),\"\")","v":""}]
[{"$f":"IF(OFFSET(DE108_26A!$C$104,ROWS($C$104:C142)-1,COLUMNS($C$104:C142)-1)<>\"\",OFFSET(DE108_26A!$C$104,ROWS($C$104:C142)-1,COLUMNS($C$104:C142)-1),\"\")","v":"Construction:"}]
[{"$f":"IF(OFFSET(DE108_26A!$C$104,ROWS($C$104:C143)-1,COLUMNS($C$104:C143)-1)<>\"\",OFFSET(DE108_26A!$C$104,ROWS($C$104:C143)-1,COLUMNS($C$104:C143)-1),\"\")","v":"Construct EB US 20 Sta 1028+50 to 1040+50."}]
[{"$f":"IF(OFFSET(DE108_26A!$C$104,ROWS($C$104:C144)-1,COLUMNS($C$104:C144)-1)<>\"\",OFFSET(DE108_26A!$C$104,ROWS($C$104:C144)-1,COLUMNS($C$104:C144)-1),\"\")","v":""}]
[{"$f":"IF(OFFSET(DE108_26A!$C$104,ROWS($C$104:C145)-1,COLUMNS($C$104:C145)-1)<>\"\",OFFSET(DE108_26A!$C$104,ROWS($C$104:C145)-1,COLUMNS($C$104:C145)-1),\"\")","v":"Stage 4"}]
[{"$f":"IF(OFFSET(DE108_26A!$C$104,ROWS($C$104:C146)-1,COLUMNS($C$104:C146)-1)<>\"\",OFFSET(DE108_26A!$C$104,ROWS($C$104:C146)-1,COLUMNS($C$104:C146)-1),\"\")","v":"Traffic:"}]
[{"$f":"IF(OFFSET(DE108_26A!$C$104,ROWS($C$104:C147)-1,COLUMNS($C$104:C147)-1)<>\"\",OFFSET(DE108_26A!$C$104,ROWS($C$104:C147)-1,COLUMNS($C$104:C147)-1),\"\")","v":"Place EB US 20 traffic on new pavement at east end."}]
[{"$f":"IF(OFFSET(DE108_26A!$C$104,ROWS($C$104:C148)-1,COLUMNS($C$104:C148)-1)<>\"\",OFFSET(DE108_26A!$C$104,ROWS($C$104:C148)-1,COLUMNS($C$104:C148)-1),\"\")","v":""}]
[{"$f":"IF(OFFSET(DE108_26A!$C$104,ROWS($C$104:C149)-1,COLUMNS($C$104:C149)-1)<>\"\",OFFSET(DE108_26A!$C$104,ROWS($C$104:C149)-1,COLUMNS($C$104:C149)-1),\"\")","v":"Construction:"}]
[{"$f":"IF(OFFSET(DE108_26A!$C$104,ROWS($C$104:C150)-1,COLUMNS($C$104:C150)-1)<>\"\",OFFSET(DE108_26A!$C$104,ROWS($C$104:C150)-1,COLUMNS($C$104:C150)-1),\"\")","v":"Construct median shoulder at east end."}]
[{"$f":"IF(OFFSET(DE108_26A!$C$104,ROWS($C$104:C151)-1,COLUMNS($C$104:C151)-1)<>\"\",OFFSET(DE108_26A!$C$104,ROWS($C$104:C151)-1,COLUMNS($C$104:C151)-1),\"\")","v":""}]
[{"$f":"IF(OFFSET(DE108_26A!$C$104,ROWS($C$104:C152)-1,COLUMNS($C$104:C152)-1)<>\"\",OFFSET(DE108_26A!$C$104,ROWS($C$104:C152)-1,COLUMNS($C$104:C152)-1),\"\")","v":""}]
[{"$f":"IF(OFFSET(DE108_26A!$C$104,ROWS($C$104:C153)-1,COLUMNS($C$104:C153)-1)<>\"\",OFFSET(DE108_26A!$C$104,ROWS($C$104:C153)-1,COLUMNS($C$104:C153)-1),\"\")","v":""}]
[{"$f":"IF(OFFSET(DE108_26A!$C$104,ROWS($C$104:C154)-1,COLUMNS($C$104:C154)-1)<>\"\",OFFSET(DE108_26A!$C$104,ROWS($C$104:C154)-1,COLUMNS($C$104:C154)-1),\"\")","v":""}]
[{"$f":"IF(OFFSET(DE108_26A!$C$104,ROWS($C$104:C155)-1,COLUMNS($C$104:C155)-1)<>\"\",OFFSET(DE108_26A!$C$104,ROWS($C$104:C155)-1,COLUMNS($C$104:C155)-1),\"\")","v":""}]

{"sheet":"Index","index":7,"n_rows":164,"n_cols":15,"rows_kept":164,"cut":false,"hidden":false,"merged":[]}
["100-0A","1997-10-28","4.5.1","ADAIR",null,"Live English File Path","Z:\\IADOTE\\v8i\\RoadDesignDetails\\ExcelTabs\\",null,"Brian R. Smith","bsmith2","Methods","ROADWAY DESIGN",null,"108_26A(1)","='108_26A'!$A$1:$A$90"]
["100-1A","1997-07-15","05/21/13","ADAMS",null,"Live Metric File Path","Z:\\IADOTE\\v8i\\RoadDesignDetails\\ExcelTabs\\MetricTabs\\",null,"Khyle B. Clute","kclute","Methods","ROADWAY DESIGN",null,"108_26A(2)","='108_26A'!$A$91:$A$146"]
["100-1C","2012-04-17","J","ALLAMAKEE",null,"Index File Path","Z:\\IADOTE\\v8i\\RoadDesignDetails\\Indexes\\",null,"Thomas M. Hamski","thamski","Methods","ROADWAY DESIGN"]
["100-1D","2005-10-18",null,"APPANOOSE",null,"Index File Name","TNT_EnglishIndexes.xlsx",null,"Wesley L. Mayberry","wmayber","Methods","ROADWAY DESIGN"]
["100-4A","2002-10-29",null,"AUDUBON",null,"Last Revision English File Path","Z:\\IADOTE\\v8i\\RoadDesignDetails\\Old_Details\\ExcelTabs\\",null,"John M. Narigon","jnarigo","Methods","ROADWAY DESIGN"]
["100-7","2012-10-16",null,"BENTON",null,"Last Revision Metric File Path","Z:\\IADOTE\\v8i\\RoadDesignDetails\\Old_Details\\ExcelTabs\\MetricTabs\\",null,"Christopher Poole","cpoole","Methods","ROADWAY DESIGN"]
["100-10","2011-10-18",null,"BLACK HAWK",null,"Seed Path","Z:\\IADOTE\\v8i\\HDR\\seed_files\\Spreadsheets\\ExcelTabulations.xltm",null,"Daniel J. Harness","dharnes","Methods","ROADWAY DESIGN"]
["100-11","2008-08-01",null,"BOONE",null,"VersionCheck Path","Z:\\IADOTE\\v8i\\HDR\\seed_files\\Spreadsheets\\ExcelTabulations.xlsm",null,"R.D. Skogerboe","dskoger","Road1","ROADWAY DESIGN"]
["100-12","2008-08-01",null,"BREMER",null,"Standard Road Plan Path","Z:\\IADOTE\\v8i\\RoadDesignDetails\\Indexes\\SRP_EnglishIndex.xls",null,"Jason R. Strum","jstrum","Road1","ROADWAY DESIGN"]
["100-12A","2008-08-01",null,"BUCHANAN",null,"Last Revision Standard Road Plan Path","Z:\\IADOTE\\v8i\\RoadDesignDetails\\Indexes\\Old_Indexes\\SRP_EnglishIndex.xls",null,"Robert A. Schoenrock","rschoen","Road1","ROADWAY DESIGN"]
["100-13","2010-04-20",null,"BUENA VISTA",null,"AddIn Path","Z:\\IADOTE\\v8i\\HDR\\seed_files\\Spreadsheets\\ExcelTabulations.xlam",null,"Stacy M. Ryan","sryan","Road1","ROADWAY DESIGN"]
["100-14","2010-04-20",null,"BUTLER",null,"Old Files Path","Z:\\IADOTE\\v8i\\RoadDesignDetails\\Old_Details\\ExcelTabs\\",null,"Nathan A. Thede","nthede","Road1","ROADWAY DESIGN"]
["100-15","2010-04-20",null,"CALHOUN",null,null,null,null,"Yanxiao Jia","yjia","Road2","ROADWAY DESIGN"]
["100-16","2010-10-19",null,"CARROLL",null,null,null,null,"Ryan R. Miller","rmille3","Road2","ROADWAY DESIGN"]
["100-17","2010-04-20",null,"CASS",null,null,null,null,"Jason M. Holst","jholst","Road2","ROADWAY DESIGN"]
["100-18","2010-04-20",null,"CEDAR",null,null,null,null,"Dustin T. Skogerboe","dskoge2","Road2","ROADWAY DESIGN"]
["100-19","2012-10-16",null,"CERRO GORDO",null,null,null,null,"Dung T. Ta","dta","Road2","ROADWAY DESIGN"]
["100-20","2008-08-01",null,"CHEROKEE",null,null,null,null,"Paul W. Flattery","pflatte","Road3","ROADWAY DESIGN"]
["100-21","2008-08-01",null,"CHICKASAW",null,null,null,null,"Kelly C. Bell","kbell","Road3","ROADWAY DESIGN"]
["100-22","2008-08-01",null,"CLARKE",null,null,null,null,"Angela K. Johnson","ajohns1","Road3","ROADWAY DESIGN"]
["100-23","2010-10-19",null,"CLAY",null,null,null,null,"Elijah D. Gansen","egansen","Road3","ROADWAY DESIGN"]
["100-24","2013-04-16",null,"CLAYTON",null,null,null,null,"James R. Schoenrock","jschoen","Consultant","ROADWAY DESIGN"]
["100-26","2008-08-01",null,"CLINTON",null,null,null,null,"Randall E. Schlei","rschlie","Consultant","ROADWAY DESIGN"]
["100-27","2009-10-20",null,"CRAWFORD",null,null,null,null,"Mark D. Mastellar","mmastel","Roadside","ROADWAY DESIGN"]
["100-28","2010-10-19",null,"DALLAS",null,null,null,null,"Robert L. Stanley","rstanle","Soils","GEOTECHNICAL DESIGN"]
["101-4","2002-04-30",null,"DAVIS",null,null,null,null,"Stephen J. Megivern","smegive","Soils","GEOTECHNICAL DESIGN"]
["101-5","2002-04-30",null,"DECATUR",null,null,null,null,"Mark A. Dell","mdell","Soils","GEOTECHNICAL DESIGN"]
["101-6","2002-04-30",null,"DELAWARE",null,null,null,null,"David R. Claman","dclaman","Bridge","HYDRAULIC DESIGN"]
["101-7","2002-04-30",null,"DES MOINES",null,null,null,null,"Zachary K. Abrams","zabrams","TrafficAndSafety","ROADWAY DESIGN"]
["101-8","2013-04-16",null,"DICKINSON"]
["101-13","2004-04-20",null,"DUBUQUE"]
["101-16","2009-10-20",null,"EMMET"]
["101-17","2011-04-19",null,"FAYETTE"]
["101-18","2011-04-19",null,"FLOYD"]
["102-3","2013-04-16",null,"FRANKLIN"]
["102-4","2011-10-18",null,"FREMONT"]
["102-5","2012-10-16",null,"GREENE"]
["102-5A","2008-08-01",null,"GRUNDY"]
["102-6C","2011-10-18",null,"GUTHRIE"]
["102-10","2008-08-01",null,"HAMILTON"]
["102-11","2008-08-01",null,"HANCOCK"]
["102-12","2008-08-01",null,"HARDIN"]
["102-14","2012-04-17",null,"HARRISON"]
["102-15","2008-08-01",null,"HENRY"]
["103-1","2010-10-19",null,"HOWARD"]
["103-3","2012-10-16",null,"HUMBOLDT"]
["103-4","2011-04-19",null,"IDA"]
["103-5","2008-08-01",null,"IOWA"]
["103-6","2011-04-19",null,"JACKSON"]
["103-7","2008-08-01",null,"JASPER"]
["104-3","2012-10-16",null,"JEFFERSON"]
["104-4","2009-10-20",null,"JOHNSON"]
["104-5A","2011-10-18",null,"JONES"]
["104-5B","2011-10-18",null,"KEOKUK"]
["104-5C","2012-04-17",null,"KOSSUTH"]
["104-8","2008-08-01",null,"LEE"]
["104-8A","2010-04-20",null,"LINN"]
["104-9","2012-04-17",null,"LOUSIA"]
["104-10","2008-08-01",null,"LUCAS"]
["104-11","2008-08-01",null,"LYON"]
["104-12","2012-10-16",null,"MADISON"]
["104-13","2013-04-16",null,"MAHASKA"]
["105-1","1994-09-27",null,"MARION"]
["105-3","2005-10-18",null,"MARSHALL"]
["105-4","2011-10-18",null,"MILLS"]
["106-1","2008-08-01",null,"MITCHELL"]
["106-2","2008-08-01",null,"MONONA"]
["106-3","2008-08-01",null,"MONROE"]
["106-4","2013-04-16",null,"MONTGOMERY"]
["106-5","2008-08-01",null,"MUSCATINE"]
["106-7","2008-08-01",null,"O'BRIEN"]
["106-8","2011-04-19",null,"OSCEOLA"]
["107-7","2008-08-01",null,"PAGE"]
["107-22","2013-04-16",null,"PALO ALTO"]
["107-23","2011-10-18",null,"PLYMOUTH"]
["107-24","2008-08-01",null,"POCAHONTAS"]
["107-25","2008-08-01",null,"POLK"]
["107-29","2012-04-17",null,"POTTAWATTAMIE"]
["107-30","2012-04-17",null,"POWESHIEK"]
["107-31","2011-04-19",null,"RINGGOLD"]
["108-1","2008-08-01",null,"SAC"]
["108-2","2008-08-01",null,"SCOTT"]
["108-2A","2008-08-01",null,"SHELBY"]
["108-8A","2010-10-19",null,"SIOUX"]
["108-8B","2011-10-18",null,"STORY"]
["108-8C","2011-10-18",null,"TAMA"]
["108-8D","2010-10-19",null,"TAYLOR"]
["108-9A","2010-04-20",null,"UNION"]
["108-11A","2008-08-01",null,"VAN BUREN"]
["108-12","2008-08-01",null,"WAPELLO"]
["108-13A","2008-08-01",null,"WARREN"]
["108-15","2008-08-01",null,"WASHINGTON"]
["108-16","2010-10-19",null,"WAYNE"]
["108-18","2011-10-18",null,"WEBSTER"]
["108-18B","2012-10-16",null,"WINNEBAGO"]
["108-22","2013-04-16",null,"WINNESHIEK"]
["108-23A","2008-08-01",null,"WOODBURY"]
["108-24","2011-04-19",null,"WORTH"]
["108-26A","2008-08-01",null,"WRIGHT"]
["108-27","2012-10-16"]
["108-28","2008-08-01"]
["108-29","2012-10-16"]
["108-30","2013-04-16"]
["108-33","2013-04-16"]
["108-34","2010-10-19"]
["108-35","2012-04-17"]
["110-1","2013-04-16"]
["110-2","2013-04-16"]
["110-3","2008-08-01"]
["110-4","2008-08-01"]
["110-5","2008-08-01"]
["110-6","2008-08-01"]
["110-7A","2012-04-17"]
["110-7B","2010-10-19"]
["110-8","2008-08-01"]
["110-9","2011-10-18"]
["110-10","2008-08-01"]
["110-11","2008-08-01"]
["110-12A","2013-04-16"]
["110-13","2010-04-20"]
["110-14","2013-04-16"]
["110-15","2013-04-16"]
["110-16","2013-04-16"]
["111-1","2012-04-17"]
["111-2","1989-02-28"]
["111-23","2002-10-29"]
["111-25","2011-10-18"]
["112-3","2013-04-16"]
["112-5","2008-08-01"]
["112-6","2013-04-16"]
["112-7","2010-10-19"]
["112-8","2012-10-16"]
["112-9","2012-04-17"]
["112-10","2011-04-19"]
["113-1","2013-04-16"]
["113-2","2013-04-16"]
["113-3","2011-10-18"]
["113-10","2012-10-16"]
["213-2","2011-10-18"]
["213-3","2011-10-18"]
["231-1","2011-10-18"]
["231-2","2012-10-16"]
["232-3A","2012-10-16"]
["232-3B","2012-10-16"]
["232-3C","2012-10-16"]
["232-3D","2012-10-16"]
["232-4","2011-10-18"]
["232-6","2011-10-18"]
["232-7","2012-10-16"]
["232-9","2011-10-18"]
["232-11","2012-10-16"]
["241-5","2011-10-18"]
["252-1","2012-10-16"]
["253-1","2011-10-18"]
["254-1","2001-10-02"]
["262-3","2012-10-16"]
["262-4","2013-04-16"]
["262-5","2005-10-18"]
["262-6","2005-10-18"]
["263-1","2011-10-18"]
["271-1","2011-10-18"]
["271-2","1985-08-20"]
["271-4","2011-10-18"]
["271-9","1994-09-27"]