{"text_format":"1","workbook":"xlsx","n_sheets":14,"sheets":["ProjectInformation","PrintSheets","DE108_23A","DE108_23B","DE108_26A","DE111_01","108_23A","108_23B","108_26A","111_01","PrintSheetTemplate","Note1","BridgeBlock","Index"],"not_rendered":{"charts":0,"images":8,"macros":1,"external_links":0,"defined_names":8,"comments":0,"pivot_tables":0},"unopened":[],"bounds":{"document_bytes":16777216,"sheet_cells":100000,"rows_first":2000,"rows_last":500,"rows_between":2000,"halvings":0,"cell_chars":16384,"cell_head_chars":4096},"cells_cut":0,"cells_raw":0,"read":"whole","date_system":"1900"}

{"sheet":"ProjectInformation","index":0,"n_rows":11,"n_cols":2,"rows_kept":11,"cut":false,"hidden":false,"merged":[[0,0,0,1],[1,0,1,1],[9,0,9,1],[3,0,4,0]]}
["CPN DATA"]
["INFORMATION ADDED BY DESIGNER"]
["Section Engineer","WHKS & Co."]
["Design Team"]
[]
["County","CLINTON"]
["Project Number","STPN-136-1(73)--2J-23"]
["English or Metric","ENGLISH"]
["Revised"]
["Bridge Block"]
["File No."]

{"sheet":"PrintSheets","index":1,"n_rows":95,"n_cols":179,"rows_kept":95,"cut":false,"hidden":false,"merged":[[93,171,93,178],[94,1,94,178],[93,101,93,106],[93,107,93,118],[93,119,93,148],[93,149,93,158],[93,159,93,164],[93,165,93,170],[93,1,93,7],[93,8,93,14],[93,15,93,21],[93,22,93,30],[93,31,93,64],[93,65,93,100]]}
[" "]
[]
[]
[]
[]
[]
[]
[]
[]
[]
[]
[]
[]
[]
[]
[]
[]
[]
[]
[]
[]
[]
[]
[]
[]
[]
[]
[]
[]
[]
[]
[]
[]
[]
[]
[]
[]
[]
[]
[]
[]
[]
[]
[]
[]
[]
[]
[]
[]
[]
[]
[]
[]
[]
[]
[]
[]
[]
[]
[]
[]
[]
[]
[]
[]
[]
[]
[]
[]
[]
[]
[]
[]
[]
[]
[]
[]
[]
[]
[]
[]
[]
[]
[]
[]
[]
[]
[]
[]
[]
[]
[]
[null,"","","","","","","","","","","","","","","","","","","","","","","","","","","","","","","","","","","","","","","","","","","","","","","","","","","","","","","","","","","","","","","","","","","","","","","","","","","","","","","","","","","","","","","","","","","","","","","","","","","","","","","","","","","","","","","","","","","","","","","","","","","","","","","","","","","","","","","","","","","","","","","","","","","","","","","",null,"","","","","","","","","","","","","","","","","","","","","","","","","",""]
[null,"FILE NO.",null,null,null,null,null,null,{"$f":"IF(ProjectInformation!$B$11<>\"\",ProjectInformation!$B$11,\"\")","v":""},null,null,null,null,null,null,{"$f":"UPPER(ProjectInformation!B8)","v":"ENGLISH"},null,null,null,null,null,null,"DESIGN TEAM",null,null,null,null,null,null,null,null,{"$f":"IF(AND(ProjectInformation!$B$3<>\"\",ProjectInformation!$B$4<>\"\",ProjectInformation!$B$5<>\"\"),ProjectInformation!$B$3&\"\\\"&ProjectInformation!$B$4&\"\\\"&ProjectInformation!$B$5,IF(AND(ProjectInformation!$B$3<>\"\",ProjectInformation!$B$4<>\"\"),ProjectInformation!$B$3&\"\\\"&ProjectInformation!$B$4,IF(ProjectInformation!$B$3<>\"\",ProjectInformation!$B$3,\"\")))","v":"WHKS & Co."},null,null,null,null,null,null,null,null,null,null,null,null,null,null,null,null,null,null,null,null,null,null,null,null,null,null,null,null,null,null,null,null,null,{"$f":"IF(ProjectInformation!$B$6<>\"\",ProjectInformation!$B$6,\"\")","v":"CLINTON"},null,null,null,null,null,null,null,null,null,null,null,null,null,null,null,null,null,null,null,null,null,null,null,null,null,null,null,null,null,null,null,null,null,null,null,"COUNTY",null,null,null,null,null,"PROJECT NUMBER",null,null,null,null,null,null,null,null,null,null,null,{"$f":"IF(ProjectInformation!$B$7<>\"\",ProjectInformation!$B$7,\"\")","v":"STPN-136-1(73)--2J-23"},null,null,null,null,null,null,null,null,null,null,null,null,null,null,null,null,null,null,null,null,null,null,null,null,null,null,null,null,null,"SHEET NUMBER",null,null,null,null,null,null,null,null,null,"J.1",null,null,null,null,null,{"$f":"IF(FP94<>\"\",\"REVISED\",\"\")","v":""},null,null,null,null,null,{"$f":"IF(ProjectInformation!$B$9<>\"\",ProjectInformation!$B$9,\"\")","v":""}]
["","10/29/2019     10:10:07 AM     bchezick     K:\\7805\\SA26 701BT Clinton Culverts\\Design\\DE Sheets\\2313601013j01.xlsm"]

{"sheet":"DE108_23A","index":2,"n_rows":55,"n_cols":5,"rows_kept":55,"cut":false,"hidden":false,"merged":[[14,2,15,2],[16,4,17,4]]}
["TabTitle",{"$f":"C15","v":"TRAFFIC CONTROL PLAN"}]
["Number of Tab Columns",1]
["DE Starter Row Number",18]
["TabSheet Starter Row Number",5]
["TabSheet Header Row Count",4]
["Top Header Cell","E15"]
["Bottom Header Cell","E18"]
["DESheet Row Count",38]
["Fixed Empty Rows",10]
["Usable Empty Rows",0]
["Total Rows Placed",48,"xlLeft(1)",null,{"$f":"IF(C11<>\"\",C11,\"\")","v":"xlLeft(1)"}]
["Total Rows Needed",{"$f":"SUM(B8:B10)","v":48},"General",null,{"$f":"IF(C12<>\"\",C12,\"\")","v":"General"}]
["Last Tab DE Starter Row",18,{"$f":"CELL(\"width\",C13)","v":159},null,{"$f":"CELL(\"width\",E13)","v":0}]
["Last Tab Tabsheet Starter Row",5,"A",null,"a"]
["Last Copy Starter Row",1,"TRAFFIC CONTROL PLAN",null,"108-23A"]
["Tab Loop Number",2,null,null,{"$f":"B17","v":"2008-08-01"}]
["Revision Date","2008-08-01",{"$f":"\"This Data Entry Sheet fills Tab \"&E15&\" effective \"&TEXT(B17,\"mm-dd-yy\")","v":"This Data Entry Sheet fills Tab 108-23A effective 08-01-08"},null,{"$f":"C15","v":"TRAFFIC CONTROL PLAN"}]
["Tabulation Width",2,"Traffic will be reduced to one lane with flaggers for all trenchless installation/extension of culverts utilizing Standard Road Plans"]
["Horizontal Grid Lines","No","TC-1, TC-202, and TC-213. IA 136 will be open to two lanes of traffic during nighttime hours. See Tab. 108-23B for a list of lane closure"]
[null,null,"times. The following culverts will require trenchless installation/extension:"]
[null,null,"     -Sta. 96+34"]
[null,null,"     -Sta. 108+76"]
[null,null,"     -Sta. 383+30"]
[null,null,"     -Sta. 539+60"]
[null,null,"     -Sta. 553+83"]
[null,null,"     -Sta. 571+62"]
[null,null,"     -Sta. 581+05"]
[null,null,"     -Sta. 704+70"]
[null,null,"     -Sta. 743+25"]
[null,null,"     -Sta. 766+09"]
[null,null,"     -Sta. 788+20"]
[null,null,"     -Sta. 830+53"]
[null,null,"     -Sta. 844+27"]
[null,null,"     -Sta. 855+00"]
[null,null,"     -Sta. 878+68"]
[]
[null,null,"Traffic will be reduced to one lane for open cut installation of culverts utilizing Standard Road Plans TC-1, TC-202, and TC-213. Traffic"]
[null,null,"will be staged so that one lane of traffic is open at all times. IA 136 will be open to two lanes of traffic during nighttime hours. See"]
[null,null,"Tab. 108-23B for a list of lane closure times. The following culverts will require open cut installation:"]
[null,null,"     -Sta. 651+43"]
[null,null,"     -Sta. 800+82"]
[null,null,"     -Sta. 817+91"]
[null,null,"     -Sta. 909+07"]
[]
[null,null,"The open cut installation of culverts at Sta. 808+67 and Sta. 838+23 will require a road closure to complete construction."]
[null,null,"IA 136 will be closed utilizing Standard Road Plans TC-1, TC-202, and TC-252, and traffic will be detoured along County Road Z24, F12,"]
[null,null,"and Z36. See Sheet J.2 for additional informations regarding the detour route."]
[]
[null,null,"The open cut installation of the culvert at Sta. 80+14 will require a road closure and temporary traffic signals to complete"]
[null,null,"construction. The West leg of the IA 136 and Z50 intersection will be closed utilizing Standard Road Plans TC-1, TC-202, TC-252, TBR, and"]
[null,null,"temporary traffic signals. Traffic will be detoured along County Road F12 and Z 36. See Sheet J.3 for detour information and Sheet J.4"]
[null,null,"for traffic control device details. Traffic will be detoured between the following dates:"]
[null,null,"May 27, 2019 to September 2, 2019."]
[]
[null,null,"Intake and storm sewer construction at Sta. 685+15 will utilize Standard Road Plans TC-1, TC-202, and TC-216."]

{"sheet":"DE108_23B","index":3,"n_rows":28,"n_cols":101,"rows_kept":28,"cut":false,"hidden":false,"merged":[[18,2,18,50],[19,3,19,26],[19,28,19,50],[28,2,28,50],[14,2,15,20],[14,21,15,50],[14,52,14,100],[15,52,15,100],[16,2,16,13],[16,14,16,50],[16,52,16,70],[16,71,17,100],[17,2,17,50],[17,52,17,63]]}
["TabTitle",{"$f":"V15","v":"TRAFFIC CONTROL CLOSURE TABLE(S)"}]
["Number of Tab Columns",49]
["DE Starter Row Number",19]
["TabSheet Starter Row Number",5]
["TabSheet Header Row Count",4]
["Top Header Cell","BA15"]
["Bottom Header Cell","CW18"]
["DESheet Row Count",10]
["Fixed Empty Rows",1]
["Usable Empty Rows",0]
["Total Rows Placed",11,"xlLeft","xlLeft","xlLeft","xlLeft","xlLeft","xlLeft","xlLeft","xlLeft","xlLeft","xlLeft","xlLeft","xlLeft","xlLeft","xlLeft","xlLeft","xlLeft","xlLeft","xlLeft","xlLeft","xlLeft","xlLeft","xlLeft","xlLeft","xlLeft","xlLeft","xlLeft","xlLeft","xlLeft","xlLeft","xlLeft","xlLeft","xlLeft","xlLeft","xlLeft","xlLeft","xlLeft","xlLeft","xlLeft","xlLeft","xlLeft","xlLeft","xlLeft","xlLeft","xlLeft","xlLeft","xlLeft","xlLeft","xlLeft","xlLeft",null,{"$f":"IF(C11<>\"\",C11,\"\")","v":"xlLeft"},{"$f":"IF(D11<>\"\",D11,\"\")","v":"xlLeft"},"xlLeft","xlLeft","xlLeft","xlLeft","xlLeft","xlLeft","xlLeft","xlLeft","xlLeft","xlLeft","xlLeft","xlLeft","xlLeft","xlLeft","xlLeft",{"$f":"IF(T11<>\"\",T11,\"\")","v":"xlLeft"},"xlLeft","xlLeft","xlLeft","xlLeft","xlLeft","xlLeft","xlLeft","xlLeft","xlLeft","xlLeft","xlLeft","xlLeft","xlLeft","xlLeft","xlLeft",{"$f":"IF(AJ11<>\"\",AJ11,\"\")","v":"xlLeft"},"xlLeft","xlLeft","xlLeft","xlLeft","xlLeft","xlLeft","xlLeft","xlLeft","xlLeft","xlLeft","xlLeft","xlLeft","xlLeft","xlLeft","xlLeft"]
["Total Rows Needed",{"$f":"SUM(B8:B10)","v":11},"General","h:mm","h:mm","h:mm","h:mm","h:mm","h:mm","h:mm","h:mm","h:mm","h:mm","h:mm","h:mm","h:mm","h:mm","h:mm","h:mm","h:mm","h:mm","h:mm","h:mm","h:mm","h:mm","h:mm","h:mm","h:mm","h:mm","h:mm","h:mm","h:mm","h:mm","h:mm","h:mm","h:mm","h:mm","h:mm","h:mm","h:mm","h:mm","h:mm","h:mm","h:mm","h:mm","h:mm","h:mm","h:mm","h:mm","h:mm","h:mm",null,{"$f":"IF(C12<>\"\",C12,\"\")","v":"General"},"h:mm","h:mm","h:mm","h:mm","h:mm","h:mm","h:mm","h:mm","h:mm","h:mm","h:mm","h:mm","h:mm","h:mm","h:mm","h:mm","h:mm","h:mm","h:mm","h:mm","h:mm","h:mm","h:mm","h:mm","h:mm","h:mm","h:mm","h:mm","h:mm","h:mm","h:mm","h:mm","h:mm","h:mm","h:mm","h:mm","h:mm","h:mm","h:mm","h:mm","h:mm","h:mm","h:mm","h:mm","h:mm","h:mm","h:mm","h:mm"]
["Last Tab DE Starter Row",19,{"$f":"CELL(\"width\",C13)","v":6},{"$f":"CELL(\"width\",D13)","v":6},6,5,5,5,5,5,5,5,5,5,5,5,5,5,5,5,5,5,5,6,6,6,6,6,6,5,5,5,5,5,5,5,5,5,5,5,5,5,5,5,5,5,5,6,6,6,6,null,{"$f":"CELL(\"width\",BA13)","v":0},{"$f":"CELL(\"width\",BB13)","v":0},0,0,0,0,0,0,0,0,0,0,0,0,0,0,0,0,0,0,0,0,0,0,0,0,0,0,0,0,0,0,0,0,0,0,0,0,0,0,0,0,0,0,0,0,0,0,0]
["Last Tab Tabsheet Starter Row",5,"A","B","C","D","E","F","G","H","I","J","K","L","M","N","O","P","Q","R","S","T","U","V","W","X","Y","Z","AA","AB","AC","AD","AE","AF","AG","AH","AI","AJ","AK","AL","AM","AN","AO","AP","AQ","AR","AS","AT","AU","AV","AW",null,{"$f":"LOWER(C14)","v":"a"},{"$f":"LOWER(D14)","v":"b"},"c","d","e","f","g","h","i","j","k","l","m","n","o","p","q","r","s","t","u","v","w","x","y","z","aa","ab","ac","ad","ae","af","ag","ah","ai","aj","ak","al","am","an","ao","ap","aq","ar","as","at","au","av","aw"]
["Last Copy Starter Row",1,"* This is to only be used in conjunction with Tabulation 108-23A",null,null,null,null,null,null,null,null,null,null,null,null,null,null,null,null,null,null,"TRAFFIC CONTROL CLOSURE TABLE(S)",null,null,null,null,null,null,null,null,null,null,null,null,null,null,null,null,null,null,null,null,null,null,null,null,null,null,null,null,null,null,"108-23B"]
["Tab Loop Number",2,null,null,null,null,null,null,null,null,null,null,null,null,null,null,null,null,null,null,null,null,null,null,null,null,null,null,null,null,null,null,null,null,null,null,null,null,null,null,null,null,null,null,null,null,null,null,null,null,null,null,{"$f":"B17","v":"2017-10-17"}]
["Revision Date","2017-10-17","Shaded area indicates times that lane closures are not allowed",null,null,null,null,null,null,null,null,null,null,null,null,null,null,null,null,null,null,null,null,null,null,null,null,null,null,null,null,null,null,null,null,null,null,null,null,null,null,null,null,null,null,null,null,null,null,null,null,null,{"$f":"C15","v":"* This is to only be used in conjunction with Tabulation 108-23A"},null,null,null,null,null,null,null,null,null,null,null,null,null,null,null,null,null,null,{"$f":"V15","v":"TRAFFIC CONTROL CLOSURE TABLE(S)"}]
["Tabulation Width",2,{"$f":"\"This Data Entry Sheet fills Tab \"&F15&\" effective \"&TEXT(B17,\"mm-dd-yy\")","v":"This Data Entry Sheet fills Tab  effective 10-17-17"},null,null,null,null,null,null,null,null,null,null,null,null,null,null,null,null,null,null,null,null,null,null,null,null,null,null,null,null,null,null,null,null,null,null,null,null,null,null,null,null,null,null,null,null,null,null,null,null,12,{"$f":"C17","v":"Shaded area indicates times that lane closures are not allowed"}]
["Horizontal Grid Lines","Yes",null,null,null,null,null,null,null,null,null,null,null,null,null,null,null,null,null,null,null,null,null,null,null,null,null,null,null,null,null,null,null,null,null,null,null,null,null,null,null,null,null,null,null,null,null,null,null,null,null,12]
[null,null,null,"AM",null,null,null,null,null,null,null,null,null,null,null,null,null,null,null,null,null,null,null,null,null,null,null,"Noon","PM"]
[null,null,null,{"$f":"TIME(12,0,)","v":"12:00:00"},{"$f":"TIME(12,30,)","v":"12:30:00"},{"$f":"TIME(1,0,)","v":"01:00:00"},{"$f":"TIME(1,30,)","v":"01:30:00"},{"$f":"TIME(2,0,)","v":"02:00:00"},{"$f":"TIME(2,30,)","v":"02:30:00"},{"$f":"TIME(3,0,)","v":"03:00:00"},{"$f":"TIME(3,30,)","v":"03:30:00"},{"$f":"TIME(4,0,)","v":"04:00:00"},{"$f":"TIME(4,30,)","v":"04:30:00"},{"$f":"TIME(5,0,)","v":"05:00:00"},{"$f":"TIME(5,30,)","v":"05:30:00"},{"$f":"TIME(6,0,)","v":"06:00:00"},{"$f":"TIME(6,30,)","v":"06:30:00"},{"$f":"TIME(7,0,)","v":"07:00:00"},{"$f":"TIME(7,30,)","v":"07:30:00"},{"$f":"TIME(8,0,)","v":"08:00:00"},{"$f":"TIME(8,30,)","v":"08:30:00"},{"$f":"TIME(9,0,)","v":"09:00:00"},{"$f":"TIME(9,30,)","v":"09:30:00"},{"$f":"TIME(10,0,)","v":"10:00:00"},{"$f":"TIME(10,30,)","v":"10:30:00"},{"$f":"TIME(11,0,)","v":"11:00:00"},{"$f":"TIME(11,30,)","v":"11:30:00"},{"$f":"TIME(12,0,)","v":"12:00:00"},{"$f":"TIME(12,30,)","v":"12:30:00"},{"$f":"TIME(1,0,)","v":"01:00:00"},{"$f":"TIME(1,30,)","v":"01:30:00"},{"$f":"TIME(2,0,)","v":"02:00:00"},{"$f":"TIME(2,30,)","v":"02:30:00"},{"$f":"TIME(3,0,)","v":"03:00:00"},{"$f":"TIME(3,30,)","v":"03:30:00"},{"$f":"TIME(4,0,)","v":"04:00:00"},{"$f":"TIME(4,30,)","v":"04:30:00"},{"$f":"TIME(5,0,)","v":"05:00:00"},{"$f":"TIME(5,30,)","v":"05:30:00"},{"$f":"TIME(6,0,)","v":"06:00:00"},{"$f":"TIME(6,30,)","v":"06:30:00"},{"$f":"TIME(7,0,)","v":"07:00:00"},{"$f":"TIME(7,30,)","v":"07:30:00"},{"$f":"TIME(8,0,)","v":"08:00:00"},{"$f":"TIME(8,30,)","v":"08:30:00"},{"$f":"TIME(9,0,)","v":"09:00:00"},{"$f":"TIME(9,30,)","v":"09:30:00"},{"$f":"TIME(10,0,)","v":"10:00:00"},{"$f":"TIME(10,30,)","v":"10:30:00"},{"$f":"TIME(11,0,)","v":"11:00:00"},{"$f":"TIME(11,30,)","v":"11:30:00"}]
[null,null,"SUN"]
[null,null,"MON"]
[null,null,"TUE"]
[null,null,"WED"]
[null,null,"THU"]
[null,null,"FRI"]
[null,null,"SAT"]

{"sheet":"DE108_26A","index":4,"n_rows":19,"n_cols":5,"rows_kept":19,"cut":false,"hidden":false,"merged":[[14,2,15,2],[16,4,17,4]]}
["TabTitle",{"$f":"C15","v":"STAGING NOTES"}]
["Number of Tab Columns",1]
["DE Starter Row Number",18]
["TabSheet Starter Row Number",5]
["TabSheet Header Row Count",4]
["Top Header Cell","E15"]
["Bottom Header Cell","E18"]
["DESheet Row Count",0]
["Fixed Empty Rows",10]
["Usable Empty Rows",0]
["Total Rows Placed",0,"xlLeft(1)",null,{"$f":"C11","v":"xlLeft(1)"}]
["Total Rows Needed",{"$f":"SUM(B8:B10)","v":10},"General",null,{"$f":"C12","v":"General"}]
["Last Tab DE Starter Row",0,{"$f":"CELL(\"width\",C13)","v":159},null,{"$f":"CELL(\"width\",E13)","v":0}]
["Last Tab TabSheet Starter Row",0,"A",null,{"$f":"LOWER(C14)","v":"a"}]
["Last Copy Starter Row",0,"STAGING NOTES",null,"108-26A"]
["Tab Loop Number",1,null,null,{"$f":"B17","v":"2008-08-01"}]
["Revision Date","2008-08-01",{"$f":"\"This Data Entry Sheet fills Tab \"&E15&\" effective \"&TEXT(B17,\"mm-dd-yy\")","v":"This Data Entry Sheet fills Tab 108-26A effective 08-01-08"},null,{"$f":"C15","v":"STAGING NOTES"}]
["Tabulation Width",2]
["Horizontal Grid Lines","No"]

{"sheet":"DE111_01","index":5,"n_rows":26,"n_cols":7,"rows_kept":26,"cut":false,"hidden":false,"merged":[[24,6,25,6],[14,2,16,3],[14,5,14,6],[15,5,15,6],[16,5,18,6],[17,2,21,3],[19,5,23,6],[22,2,22,3],[23,2,24,2],[23,3,24,3],[24,5,25,5]]}
["TabTitle",{"$f":"C15","v":"COORDINATED OPERATIONS"}]
["Number of Tab Columns",2]
["DE Starter Row Number",26]
["TabSheet Starter Row Number",13]
["TabSheet Header Row Count",12]
["Top Header Cell","F15"]
["Bottom Header Cell","G26"]
["DESheet Row Count",1]
["Fixed Empty Rows",5]
["Usable Empty Rows",0]
["Total Rows Placed",6,"xlLeft(1)","xlLeft(1)",null,{"$f":"C11","v":"xlLeft(1)"},{"$f":"D11","v":"xlLeft(1)"}]
["Total Rows Needed",{"$f":"SUM(B8:B10)","v":6},"General","General",null,{"$f":"C12","v":"General"},{"$f":"D12","v":"General"}]
["Last Tab DE Starter Row",26,{"$f":"CELL(\"width\",C13)","v":35},{"$f":"CELL(\"width\",D13)","v":37},null,{"$f":"CELL(\"width\",F13)","v":0},{"$f":"CELL(\"width\",G13)","v":0}]
["Last Tab Tabsheet Starter Row",13,"A","B",null,{"$f":"LOWER(C14)","v":"a"},{"$f":"LOWER(D14)","v":"b"}]
["Last Copy Starter Row",1,"COORDINATED OPERATIONS",null,null,"111-01"]
["Tab Loop Number",2,null,null,null,{"$f":"B17","v":"2012-04-17"}]
["Revision Date","2012-04-17",null,null,null,{"$f":"C15","v":"COORDINATED OPERATIONS"}]
["Tabulation Width",1,"Other work in progress during the same period of time will include the construction of the projects listed. Coordinate operations with those of other contractors working within the same area. "]
["Horizontal Grid Lines","Yes"]
[null,null,null,null,null,{"$f":"C18","v":"Other work in progress during the same period of time will include the construction of the projects listed. Coordinate operations with those of other contractors working within the same area. "}]
[]
[]
[null,null,{"$f":"\"This Data Entry Sheet fills Tab \"&F15&\" effective \"&TEXT(B17,\"mm-dd-yy\")","v":"This Data Entry Sheet fills Tab 111-01 effective 04-17-12"}]
[null,null,"Project","Type of Work"]
[null,null,null,null,null,{"$f":"C24","v":"Project"},{"$f":"D24","v":"Type of Work"}]
[null,null,"NONE"]

{"sheet":"108_23A","index":6,"n_rows":52,"n_cols":1,"rows_kept":52,"cut":false,"hidden":false,"merged":[[2,0,3,0]]}
["108-23A"]
["2008-08-01"]
["TRAFFIC CONTROL PLAN"]
[]
[{"$f":"IF(OFFSET(DE108_23A!$C$18,ROWS($C$18:C18)-1,COLUMNS($C$18:C18)-1)<>\"\",OFFSET(DE108_23A!$C$18,ROWS($C$18:C18)-1,COLUMNS($C$18:C18)-1),\"\")","v":"Traffic will be reduced to one lane with flaggers for all trenchless installation/extension of culverts utilizing Standard Road Plans"}]
[{"$f":"IF(OFFSET(DE108_23A!$C$18,ROWS($C$18:C19)-1,COLUMNS($C$18:C19)-1)<>\"\",OFFSET(DE108_23A!$C$18,ROWS($C$18:C19)-1,COLUMNS($C$18:C19)-1),\"\")","v":"TC-1, TC-202, and TC-213. IA 136 will be open to two lanes of traffic during nighttime hours. See Tab. 108-23B for a list of lane closure"}]
[{"$f":"IF(OFFSET(DE108_23A!$C$18,ROWS($C$18:C20)-1,COLUMNS($C$18:C20)-1)<>\"\",OFFSET(DE108_23A!$C$18,ROWS($C$18:C20)-1,COLUMNS($C$18:C20)-1),\"\")","v":"times. The following culverts will require trenchless installation/extension:"}]
[{"$f":"IF(OFFSET(DE108_23A!$C$18,ROWS($C$18:C21)-1,COLUMNS($C$18:C21)-1)<>\"\",OFFSET(DE108_23A!$C$18,ROWS($C$18:C21)-1,COLUMNS($C$18:C21)-1),\"\")","v":"     -Sta. 96+34"}]
[{"$f":"IF(OFFSET(DE108_23A!$C$18,ROWS($C$18:C22)-1,COLUMNS($C$18:C22)-1)<>\"\",OFFSET(DE108_23A!$C$18,ROWS($C$18:C22)-1,COLUMNS($C$18:C22)-1),\"\")","v":"     -Sta. 108+76"}]
[{"$f":"IF(OFFSET(DE108_23A!$C$18,ROWS($C$18:C23)-1,COLUMNS($C$18:C23)-1)<>\"\",OFFSET(DE108_23A!$C$18,ROWS($C$18:C23)-1,COLUMNS($C$18:C23)-1),\"\")","v":"     -Sta. 383+30"}]
[{"$f":"IF(OFFSET(DE108_23A!$C$18,ROWS($C$18:C24)-1,COLUMNS($C$18:C24)-1)<>\"\",OFFSET(DE108_23A!$C$18,ROWS($C$18:C24)-1,COLUMNS($C$18:C24)-1),\"\")","v":"     -Sta. 539+60"}]
[{"$f":"IF(OFFSET(DE108_23A!$C$18,ROWS($C$18:C25)-1,COLUMNS($C$18:C25)-1)<>\"\",OFFSET(DE108_23A!$C$18,ROWS($C$18:C25)-1,COLUMNS($C$18:C25)-1),\"\")","v":"     -Sta. 553+83"}]
[{"$f":"IF(OFFSET(DE108_23A!$C$18,ROWS($C$18:C26)-1,COLUMNS($C$18:C26)-1)<>\"\",OFFSET(DE108_23A!$C$18,ROWS($C$18:C26)-1,COLUMNS($C$18:C26)-1),\"\")","v":"     -Sta. 571+62"}]
[{"$f":"IF(OFFSET(DE108_23A!$C$18,ROWS($C$18:C27)-1,COLUMNS($C$18:C27)-1)<>\"\",OFFSET(DE108_23A!$C$18,ROWS($C$18:C27)-1,COLUMNS($C$18:C27)-1),\"\")","v":"     -Sta. 581+05"}]
[{"$f":"IF(OFFSET(DE108_23A!$C$18,ROWS($C$18:C28)-1,COLUMNS($C$18:C28)-1)<>\"\",OFFSET(DE108_23A!$C$18,ROWS($C$18:C28)-1,COLUMNS($C$18:C28)-1),\"\")","v":"     -Sta. 704+70"}]
[{"$f":"IF(OFFSET(DE108_23A!$C$18,ROWS($C$18:C29)-1,COLUMNS($C$18:C29)-1)<>\"\",OFFSET(DE108_23A!$C$18,ROWS($C$18:C29)-1,COLUMNS($C$18:C29)-1),\"\")","v":"     -Sta. 743+25"}]
[{"$f":"IF(OFFSET(DE108_23A!$C$18,ROWS($C$18:C30)-1,COLUMNS($C$18:C30)-1)<>\"\",OFFSET(DE108_23A!$C$18,ROWS($C$18:C30)-1,COLUMNS($C$18:C30)-1),\"\")","v":"     -Sta. 766+09"}]
[{"$f":"IF(OFFSET(DE108_23A!$C$18,ROWS($C$18:C31)-1,COLUMNS($C$18:C31)-1)<>\"\",OFFSET(DE108_23A!$C$18,ROWS($C$18:C31)-1,COLUMNS($C$18:C31)-1),\"\")","v":"     -Sta. 788+20"}]
[{"$f":"IF(OFFSET(DE108_23A!$C$18,ROWS($C$18:C32)-1,COLUMNS($C$18:C32)-1)<>\"\",OFFSET(DE108_23A!$C$18,ROWS($C$18:C32)-1,COLUMNS($C$18:C32)-1),\"\")","v":"     -Sta. 830+53"}]
[{"$f":"IF(OFFSET(DE108_23A!$C$18,ROWS($C$18:C33)-1,COLUMNS($C$18:C33)-1)<>\"\",OFFSET(DE108_23A!$C$18,ROWS($C$18:C33)-1,COLUMNS($C$18:C33)-1),\"\")","v":"     -Sta. 844+27"}]
[{"$f":"IF(OFFSET(DE108_23A!$C$18,ROWS($C$18:C34)-1,COLUMNS($C$18:C34)-1)<>\"\",OFFSET(DE108_23A!$C$18,ROWS($C$18:C34)-1,COLUMNS($C$18:C34)-1),\"\")","v":"     -Sta. 855+00"}]
[{"$f":"IF(OFFSET(DE108_23A!$C$18,ROWS($C$18:C35)-1,COLUMNS($C$18:C35)-1)<>\"\",OFFSET(DE108_23A!$C$18,ROWS($C$18:C35)-1,COLUMNS($C$18:C35)-1),\"\")","v":"     -Sta. 878+68"}]
[{"$f":"IF(OFFSET(DE108_23A!$C$18,ROWS($C$18:C36)-1,COLUMNS($C$18:C36)-1)<>\"\",OFFSET(DE108_23A!$C$18,ROWS($C$18:C36)-1,COLUMNS($C$18:C36)-1),\"\")","v":""}]
[{"$f":"IF(OFFSET(DE108_23A!$C$18,ROWS($C$18:C37)-1,COLUMNS($C$18:C37)-1)<>\"\",OFFSET(DE108_23A!$C$18,ROWS($C$18:C37)-1,COLUMNS($C$18:C37)-1),\"\")","v":"Traffic will be reduced to one lane for open cut installation of culverts utilizing Standard Road Plans TC-1, TC-202, and TC-213. Traffic"}]
[{"$f":"IF(OFFSET(DE108_23A!$C$18,ROWS($C$18:C38)-1,COLUMNS($C$18:C38)-1)<>\"\",OFFSET(DE108_23A!$C$18,ROWS($C$18:C38)-1,COLUMNS($C$18:C38)-1),\"\")","v":"will be staged so that one lane of traffic is open at all times. IA 136 will be open to two lanes of traffic during nighttime hours. See"}]
[{"$f":"IF(OFFSET(DE108_23A!$C$18,ROWS($C$18:C39)-1,COLUMNS($C$18:C39)-1)<>\"\",OFFSET(DE108_23A!$C$18,ROWS($C$18:C39)-1,COLUMNS($C$18:C39)-1),\"\")","v":"Tab. 108-23B for a list of lane closure times. The following culverts will require open cut installation:"}]
[{"$f":"IF(OFFSET(DE108_23A!$C$18,ROWS($C$18:C40)-1,COLUMNS($C$18:C40)-1)<>\"\",OFFSET(DE108_23A!$C$18,ROWS($C$18:C40)-1,COLUMNS($C$18:C40)-1),\"\")","v":"     -Sta. 651+43"}]
[{"$f":"IF(OFFSET(DE108_23A!$C$18,ROWS($C$18:C41)-1,COLUMNS($C$18:C41)-1)<>\"\",OFFSET(DE108_23A!$C$18,ROWS($C$18:C41)-1,COLUMNS($C$18:C41)-1),\"\")","v":"     -Sta. 800+82"}]
[{"$f":"IF(OFFSET(DE108_23A!$C$18,ROWS($C$18:C42)-1,COLUMNS($C$18:C42)-1)<>\"\",OFFSET(DE108_23A!$C$18,ROWS($C$18:C42)-1,COLUMNS($C$18:C42)-1),\"\")","v":"     -Sta. 817+91"}]
[{"$f":"IF(OFFSET(DE108_23A!$C$18,ROWS($C$18:C43)-1,COLUMNS($C$18:C43)-1)<>\"\",OFFSET(DE108_23A!$C$18,ROWS($C$18:C43)-1,COLUMNS($C$18:C43)-1),\"\")","v":"     -Sta. 909+07"}]
[{"$f":"IF(OFFSET(DE108_23A!$C$18,ROWS($C$18:C44)-1,COLUMNS($C$18:C44)-1)<>\"\",OFFSET(DE108_23A!$C$18,ROWS($C$18:C44)-1,COLUMNS($C$18:C44)-1),\"\")","v":""}]
[{"$f":"IF(OFFSET(DE108_23A!$C$18,ROWS($C$18:C45)-1,COLUMNS($C$18:C45)-1)<>\"\",OFFSET(DE108_23A!$C$18,ROWS($C$18:C45)-1,COLUMNS($C$18:C45)-1),\"\")","v":"The open cut installation of culverts at Sta. 808+67 and Sta. 838+23 will require a road closure to complete construction."}]
[{"$f":"IF(OFFSET(DE108_23A!$C$18,ROWS($C$18:C46)-1,COLUMNS($C$18:C46)-1)<>\"\",OFFSET(DE108_23A!$C$18,ROWS($C$18:C46)-1,COLUMNS($C$18:C46)-1),\"\")","v":"IA 136 will be closed utilizing Standard Road Plans TC-1, TC-202, and TC-252, and traffic will be detoured along County Road Z24, F12,"}]
[{"$f":"IF(OFFSET(DE108_23A!$C$18,ROWS($C$18:C47)-1,COLUMNS($C$18:C47)-1)<>\"\",OFFSET(DE108_23A!$C$18,ROWS($C$18:C47)-1,COLUMNS($C$18:C47)-1),\"\")","v":"and Z36. See Sheet J.2 for additional informations regarding the detour route."}]
[{"$f":"IF(OFFSET(DE108_23A!$C$18,ROWS($C$18:C48)-1,COLUMNS($C$18:C48)-1)<>\"\",OFFSET(DE108_23A!$C$18,ROWS($C$18:C48)-1,COLUMNS($C$18:C48)-1),\"\")","v":""}]
[{"$f":"IF(OFFSET(DE108_23A!$C$18,ROWS($C$18:C49)-1,COLUMNS($C$18:C49)-1)<>\"\",OFFSET(DE108_23A!$C$18,ROWS($C$18:C49)-1,COLUMNS($C$18:C49)-1),\"\")","v":"The open cut installation of the culvert at Sta. 80+14 will require a road closure and temporary traffic signals to complete"}]
[{"$f":"IF(OFFSET(DE108_23A!$C$18,ROWS($C$18:C50)-1,COLUMNS($C$18:C50)-1)<>\"\",OFFSET(DE108_23A!$C$18,ROWS($C$18:C50)-1,COLUMNS($C$18:C50)-1),\"\")","v":"construction. The West leg of the IA 136 and Z50 intersection will be closed utilizing Standard Road Plans TC-1, TC-202, TC-252, TBR, and"}]
[{"$f":"IF(OFFSET(DE108_23A!$C$18,ROWS($C$18:C51)-1,COLUMNS($C$18:C51)-1)<>\"\",OFFSET(DE108_23A!$C$18,ROWS($C$18:C51)-1,COLUMNS($C$18:C51)-1),\"\")","v":"temporary traffic signals. Traffic will be detoured along County Road F12 and Z 36. See Sheet J.3 for detour information and Sheet J.4"}]
[{"$f":"IF(OFFSET(DE108_23A!$C$18,ROWS($C$18:C52)-1,COLUMNS($C$18:C52)-1)<>\"\",OFFSET(DE108_23A!$C$18,ROWS($C$18:C52)-1,COLUMNS($C$18:C52)-1),\"\")","v":"for traffic control device details. Traffic will be detoured between the following dates:"}]
[{"$f":"IF(OFFSET(DE108_23A!$C$18,ROWS($C$18:C53)-1,COLUMNS($C$18:C53)-1)<>\"\",OFFSET(DE108_23A!$C$18,ROWS($C$18:C53)-1,COLUMNS($C$18:C53)-1),\"\")","v":"May 27, 2019 to September 2, 2019."}]
[{"$f":"IF(OFFSET(DE108_23A!$C$18,ROWS($C$18:C54)-1,COLUMNS($C$18:C54)-1)<>\"\",OFFSET(DE108_23A!$C$18,ROWS($C$18:C54)-1,COLUMNS($C$18:C54)-1),\"\")","v":""}]
[{"$f":"IF(OFFSET(DE108_23A!$C$18,ROWS($C$18:C55)-1,COLUMNS($C$18:C55)-1)<>\"\",OFFSET(DE108_23A!$C$18,ROWS($C$18:C55)-1,COLUMNS($C$18:C55)-1),\"\")","v":"Intake and storm sewer construction at Sta. 685+15 will utilize Standard Road Plans TC-1, TC-202, and TC-216."}]
[{"$f":"IF(OFFSET(DE108_23A!$C$18,ROWS($C$18:C56)-1,COLUMNS($C$18:C56)-1)<>\"\",OFFSET(DE108_23A!$C$18,ROWS($C$18:C56)-1,COLUMNS($C$18:C56)-1),\"\")","v":""}]
[{"$f":"IF(OFFSET(DE108_23A!$C$18,ROWS($C$18:C57)-1,COLUMNS($C$18:C57)-1)<>\"\",OFFSET(DE108_23A!$C$18,ROWS($C$18:C57)-1,COLUMNS($C$18:C57)-1),\"\")","v":""}]
[{"$f":"IF(OFFSET(DE108_23A!$C$18,ROWS($C$18:C58)-1,COLUMNS($C$18:C58)-1)<>\"\",OFFSET(DE108_23A!$C$18,ROWS($C$18:C58)-1,COLUMNS($C$18:C58)-1),\"\")","v":""}]
[{"$f":"IF(OFFSET(DE108_23A!$C$18,ROWS($C$18:C59)-1,COLUMNS($C$18:C59)-1)<>\"\",OFFSET(DE108_23A!$C$18,ROWS($C$18:C59)-1,COLUMNS($C$18:C59)-1),\"\")","v":""}]
[{"$f":"IF(OFFSET(DE108_23A!$C$18,ROWS($C$18:C60)-1,COLUMNS($C$18:C60)-1)<>\"\",OFFSET(DE108_23A!$C$18,ROWS($C$18:C60)-1,COLUMNS($C$18:C60)-1),\"\")","v":""}]
[{"$f":"IF(OFFSET(DE108_23A!$C$18,ROWS($C$18:C61)-1,COLUMNS($C$18:C61)-1)<>\"\",OFFSET(DE108_23A!$C$18,ROWS($C$18:C61)-1,COLUMNS($C$18:C61)-1),\"\")","v":""}]
[{"$f":"IF(OFFSET(DE108_23A!$C$18,ROWS($C$18:C62)-1,COLUMNS($C$18:C62)-1)<>\"\",OFFSET(DE108_23A!$C$18,ROWS($C$18:C62)-1,COLUMNS($C$18:C62)-1),\"\")","v":""}]
[{"$f":"IF(OFFSET(DE108_23A!$C$18,ROWS($C$18:C63)-1,COLUMNS($C$18:C63)-1)<>\"\",OFFSET(DE108_23A!$C$18,ROWS($C$18:C63)-1,COLUMNS($C$18:C63)-1),\"\")","v":""}]
[{"$f":"IF(OFFSET(DE108_23A!$C$18,ROWS($C$18:C64)-1,COLUMNS($C$18:C64)-1)<>\"\",OFFSET(DE108_23A!$C$18,ROWS($C$18:C64)-1,COLUMNS($C$18:C64)-1),\"\")","v":""}]
[{"$f":"IF(OFFSET(DE108_23A!$C$18,ROWS($C$18:C65)-1,COLUMNS($C$18:C65)-1)<>\"\",OFFSET(DE108_23A!$C$18,ROWS($C$18:C65)-1,COLUMNS($C$18:C65)-1),\"\")","v":""}]

{"sheet":"108_23B","index":7,"n_rows":15,"n_cols":49,"rows_kept":15,"cut":false,"hidden":false,"merged":[[14,0,14,48],[5,1,5,24],[5,26,5,48],[0,0,0,48],[1,0,1,48],[2,0,2,18],[2,19,3,48],[3,0,3,11],[4,0,4,48]]}
["108-23B"]
["2017-10-17"]
["* This is to only be used in conjunction with Tabulation 108-23A",null,null,null,null,null,null,null,null,null,null,null,null,null,null,null,null,null,null,"TRAFFIC CONTROL CLOSURE TABLE(S)"]
["Shaded area indicates times that lane closures are not allowed"]
[{"$f":"IF(OFFSET(DE108_23B!$C$19,ROWS($C$19:C19)-1,COLUMNS($C$19:C19)-1)<>\"\",OFFSET(DE108_23B!$C$19,ROWS($C$19:C19)-1,COLUMNS($C$19:C19)-1),\"\")","v":""}]
[{"$f":"IF(OFFSET(DE108_23B!$C$19,ROWS($C$19:C20)-1,COLUMNS($C$19:C20)-1)<>\"\",OFFSET(DE108_23B!$C$19,ROWS($C$19:C20)-1,COLUMNS($C$19:C20)-1),\"\")","v":""},{"$f":"IF(OFFSET(DE108_23B!$D$19,ROWS($D$19:D20)-1,COLUMNS($D$19:D20)-1)<>\"\",OFFSET(DE108_23B!$D$19,ROWS($D$19:D20)-1,COLUMNS($D$19:D20)-1),\"\")","v":"AM"},null,null,null,null,null,null,null,null,null,null,null,null,null,null,null,null,null,null,null,null,null,null,null,{"$f":"IF(OFFSET(DE108_23B!$AB$19,ROWS($AB$19:AB20)-1,COLUMNS($AB$19:AB20)-1)<>\"\",OFFSET(DE108_23B!$AB$19,ROWS($AB$19:AB20)-1,COLUMNS($AB$19:AB20)-1),\"\")","v":"Noon"},{"$f":"IF(OFFSET(DE108_23B!$AC$19,ROWS($AC$19:AC20)-1,COLUMNS($AC$19:AC20)-1)<>\"\",OFFSET(DE108_23B!$AC$19,ROWS($AC$19:AC20)-1,COLUMNS($AC$19:AC20)-1),\"\")","v":"PM"}]
[{"$f":"IF(OFFSET(DE108_23B!$C$19,ROWS($C$19:C21)-1,COLUMNS($C$19:C21)-1)<>\"\",OFFSET(DE108_23B!$C$19,ROWS($C$19:C21)-1,COLUMNS($C$19:C21)-1),\"\")","v":""},{"$f":"IF(OFFSET(DE108_23B!$D$19,ROWS($D$19:D21)-1,COLUMNS($D$19:D21)-1)<>\"\",OFFSET(DE108_23B!$D$19,ROWS($D$19:D21)-1,COLUMNS($D$19:D21)-1),\"\")","v":"12:00:00"},{"$f":"IF(OFFSET(DE108_23B!$E$19,ROWS($E$19:E21)-1,COLUMNS($E$19:E21)-1)<>\"\",OFFSET(DE108_23B!$E$19,ROWS($E$19:E21)-1,COLUMNS($E$19:E21)-1),\"\")","v":"12:30:00"},{"$f":"IF(OFFSET(DE108_23B!$F$19,ROWS($F$19:F21)-1,COLUMNS($F$19:F21)-1)<>\"\",OFFSET(DE108_23B!$F$19,ROWS($F$19:F21)-1,COLUMNS($F$19:F21)-1),\"\")","v":"01:00:00"},{"$f":"IF(OFFSET(DE108_23B!$G$19,ROWS($G$19:G21)-1,COLUMNS($G$19:G21)-1)<>\"\",OFFSET(DE108_23B!$G$19,ROWS($G$19:G21)-1,COLUMNS($G$19:G21)-1),\"\")","v":"01:30:00"},{"$f":"IF(OFFSET(DE108_23B!$H$19,ROWS($H$19:H21)-1,COLUMNS($H$19:H21)-1)<>\"\",OFFSET(DE108_23B!$H$19,ROWS($H$19:H21)-1,COLUMNS($H$19:H21)-1),\"\")","v":"02:00:00"},{"$f":"IF(OFFSET(DE108_23B!$I$19,ROWS($I$19:I21)-1,COLUMNS($I$19:I21)-1)<>\"\",OFFSET(DE108_23B!$I$19,ROWS($I$19:I21)-1,COLUMNS($I$19:I21)-1),\"\")","v":"02:30:00"},{"$f":"IF(OFFSET(DE108_23B!$J$19,ROWS($J$19:J21)-1,COLUMNS($J$19:J21)-1)<>\"\",OFFSET(DE108_23B!$J$19,ROWS($J$19:J21)-1,COLUMNS($J$19:J21)-1),\"\")","v":"03:00:00"},{"$f":"IF(OFFSET(DE108_23B!$K$19,ROWS($K$19:K21)-1,COLUMNS($K$19:K21)-1)<>\"\",OFFSET(DE108_23B!$K$19,ROWS($K$19:K21)-1,COLUMNS($K$19:K21)-1),\"\")","v":"03:30:00"},{"$f":"IF(OFFSET(DE108_23B!$L$19,ROWS($L$19:L21)-1,COLUMNS($L$19:L21)-1)<>\"\",OFFSET(DE108_23B!$L$19,ROWS($L$19:L21)-1,COLUMNS($L$19:L21)-1),\"\")","v":"04:00:00"},{"$f":"IF(OFFSET(DE108_23B!$M$19,ROWS($M$19:M21)-1,COLUMNS($M$19:M21)-1)<>\"\",OFFSET(DE108_23B!$M$19,ROWS($M$19:M21)-1,COLUMNS($M$19:M21)-1),\"\")","v":"04:30:00"},{"$f":"IF(OFFSET(DE108_23B!$N$19,ROWS($N$19:N21)-1,COLUMNS($N$19:N21)-1)<>\"\",OFFSET(DE108_23B!$N$19,ROWS($N$19:N21)-1,COLUMNS($N$19:N21)-1),\"\")","v":"05:00:00"},{"$f":"IF(OFFSET(DE108_23B!$O$19,ROWS($O$19:O21)-1,COLUMNS($O$19:O21)-1)<>\"\",OFFSET(DE108_23B!$O$19,ROWS($O$19:O21)-1,COLUMNS($O$19:O21)-1),\"\")","v":"05:30:00"},{"$f":"IF(OFFSET(DE108_23B!$P$19,ROWS($P$19:P21)-1,COLUMNS($P$19:P21)-1)<>\"\",OFFSET(DE108_23B!$P$19,ROWS($P$19:P21)-1,COLUMNS($P$19:P21)-1),\"\")","v":"06:00:00"},{"$f":"IF(OFFSET(DE108_23B!$Q$19,ROWS($Q$19:Q21)-1,COLUMNS($Q$19:Q21)-1)<>\"\",OFFSET(DE108_23B!$Q$19,ROWS($Q$19:Q21)-1,COLUMNS($Q$19:Q21)-1),\"\")","v":"06:30:00"},{"$f":"IF(OFFSET(DE108_23B!$R$19,ROWS($R$19:R21)-1,COLUMNS($R$19:R21)-1)<>\"\",OFFSET(DE108_23B!$R$19,ROWS($R$19:R21)-1,COLUMNS($R$19:R21)-1),\"\")","v":"07:00:00"},{"$f":"IF(OFFSET(DE108_23B!$S$19,ROWS($S$19:S21)-1,COLUMNS($S$19:S21)-1)<>\"\",OFFSET(DE108_23B!$S$19,ROWS($S$19:S21)-1,COLUMNS($S$19:S21)-1),\"\")","v":"07:30:00"},{"$f":"IF(OFFSET(DE108_23B!$T$19,ROWS($T$19:T21)-1,COLUMNS($T$19:T21)-1)<>\"\",OFFSET(DE108_23B!$T$19,ROWS($T$19:T21)-1,COLUMNS($T$19:T21)-1),\"\")","v":"08:00:00"},{"$f":"IF(OFFSET(DE108_23B!$U$19,ROWS($U$19:U21)-1,COLUMNS($U$19:U21)-1)<>\"\",OFFSET(DE108_23B!$U$19,ROWS($U$19:U21)-1,COLUMNS($U$19:U21)-1),\"\")","v":"08:30:00"},{"$f":"IF(OFFSET(DE108_23B!$V$19,ROWS($V$19:V21)-1,COLUMNS($V$19:V21)-1)<>\"\",OFFSET(DE108_23B!$V$19,ROWS($V$19:V21)-1,COLUMNS($V$19:V21)-1),\"\")","v":"09:00:00"},{"$f":"IF(OFFSET(DE108_23B!$W$19,ROWS($W$19:W21)-1,COLUMNS($W$19:W21)-1)<>\"\",OFFSET(DE108_23B!$W$19,ROWS($W$19:W21)-1,COLUMNS($W$19:W21)-1),\"\")","v":"09:30:00"},{"$f":"IF(OFFSET(DE108_23B!$X$19,ROWS($X$19:X21)-1,COLUMNS($X$19:X21)-1)<>\"\",OFFSET(DE108_23B!$X$19,ROWS($X$19:X21)-1,COLUMNS($X$19:X21)-1),\"\")","v":"10:00:00"},{"$f":"IF(OFFSET(DE108_23B!$Y$19,ROWS($Y$19:Y21)-1,COLUMNS($Y$19:Y21)-1)<>\"\",OFFSET(DE108_23B!$Y$19,ROWS($Y$19:Y21)-1,COLUMNS($Y$19:Y21)-1),\"\")","v":"10:30:00"},{"$f":"IF(OFFSET(DE108_23B!$Z$19,ROWS($Z$19:Z21)-1,COLUMNS($Z$19:Z21)-1)<>\"\",OFFSET(DE108_23B!$Z$19,ROWS($Z$19:Z21)-1,COLUMNS($Z$19:Z21)-1),\"\")","v":"11:00:00"},{"$f":"IF(OFFSET(DE108_23B!$AA$19,ROWS($AA$19:AA21)-1,COLUMNS($AA$19:AA21)-1)<>\"\",OFFSET(DE108_23B!$AA$19,ROWS($AA$19:AA21)-1,COLUMNS($AA$19:AA21)-1),\"\")","v":"11:30:00"},{"$f":"IF(OFFSET(DE108_23B!$AB$19,ROWS($AB$19:AB21)-1,COLUMNS($AB$19:AB21)-1)<>\"\",OFFSET(DE108_23B!$AB$19,ROWS($AB$19:AB21)-1,COLUMNS($AB$19:AB21)-1),\"\")","v":"12:00:00"},{"$f":"IF(OFFSET(DE108_23B!$AC$19,ROWS($AC$19:AC21)-1,COLUMNS($AC$19:AC21)-1)<>\"\",OFFSET(DE108_23B!$AC$19,ROWS($AC$19:AC21)-1,COLUMNS($AC$19:AC21)-1),\"\")","v":"12:30:00"},{"$f":"IF(OFFSET(DE108_23B!$AD$19,ROWS($AD$19:AD21)-1,COLUMNS($AD$19:AD21)-1)<>\"\",OFFSET(DE108_23B!$AD$19,ROWS($AD$19:AD21)-1,COLUMNS($AD$19:AD21)-1),\"\")","v":"01:00:00"},{"$f":"IF(OFFSET(DE108_23B!$AE$19,ROWS($AE$19:AE21)-1,COLUMNS($AE$19:AE21)-1)<>\"\",OFFSET(DE108_23B!$AE$19,ROWS($AE$19:AE21)-1,COLUMNS($AE$19:AE21)-1),\"\")","v":"01:30:00"},{"$f":"IF(OFFSET(DE108_23B!$AF$19,ROWS($AF$19:AF21)-1,COLUMNS($AF$19:AF21)-1)<>\"\",OFFSET(DE108_23B!$AF$19,ROWS($AF$19:AF21)-1,COLUMNS($AF$19:AF21)-1),\"\")","v":"02:00:00"},{"$f":"IF(OFFSET(DE108_23B!$AG$19,ROWS($AG$19:AG21)-1,COLUMNS($AG$19:AG21)-1)<>\"\",OFFSET(DE108_23B!$AG$19,ROWS($AG$19:AG21)-1,COLUMNS($AG$19:AG21)-1),\"\")","v":"02:30:00"},{"$f":"IF(OFFSET(DE108_23B!$AH$19,ROWS($AH$19:AH21)-1,COLUMNS($AH$19:AH21)-1)<>\"\",OFFSET(DE108_23B!$AH$19,ROWS($AH$19:AH21)-1,COLUMNS($AH$19:AH21)-1),\"\")","v":"03:00:00"},{"$f":"IF(OFFSET(DE108_23B!$AI$19,ROWS($AI$19:AI21)-1,COLUMNS($AI$19:AI21)-1)<>\"\",OFFSET(DE108_23B!$AI$19,ROWS($AI$19:AI21)-1,COLUMNS($AI$19:AI21)-1),\"\")","v":"03:30:00"},{"$f":"IF(OFFSET(DE108_23B!$AJ$19,ROWS($AJ$19:AJ21)-1,COLUMNS($AJ$19:AJ21)-1)<>\"\",OFFSET(DE108_23B!$AJ$19,ROWS($AJ$19:AJ21)-1,COLUMNS($AJ$19:AJ21)-1),\"\")","v":"04:00:00"},{"$f":"IF(OFFSET(DE108_23B!$AK$19,ROWS($AK$19:AK21)-1,COLUMNS($AK$19:AK21)-1)<>\"\",OFFSET(DE108_23B!$AK$19,ROWS($AK$19:AK21)-1,COLUMNS($AK$19:AK21)-1),\"\")","v":"04:30:00"},{"$f":"IF(OFFSET(DE108_23B!$AL$19,ROWS($AL$19:AL21)-1,COLUMNS($AL$19:AL21)-1)<>\"\",OFFSET(DE108_23B!$AL$19,ROWS($AL$19:AL21)-1,COLUMNS($AL$19:AL21)-1),\"\")","v":"05:00:00"},{"$f":"IF(OFFSET(DE108_23B!$AM$19,ROWS($AM$19:AM21)-1,COLUMNS($AM$19:AM21)-1)<>\"\",OFFSET(DE108_23B!$AM$19,ROWS($AM$19:AM21)-1,COLUMNS($AM$19:AM21)-1),\"\")","v":"05:30:00"},{"$f":"IF(OFFSET(DE108_23B!$AN$19,ROWS($AN$19:AN21)-1,COLUMNS($AN$19:AN21)-1)<>\"\",OFFSET(DE108_23B!$AN$19,ROWS($AN$19:AN21)-1,COLUMNS($AN$19:AN21)-1),\"\")","v":"06:00:00"},{"$f":"IF(OFFSET(DE108_23B!$AO$19,ROWS($AO$19:AO21)-1,COLUMNS($AO$19:AO21)-1)<>\"\",OFFSET(DE108_23B!$AO$19,ROWS($AO$19:AO21)-1,COLUMNS($AO$19:AO21)-1),\"\")","v":"06:30:00"},{"$f":"IF(OFFSET(DE108_23B!$AP$19,ROWS($AP$19:AP21)-1,COLUMNS($AP$19:AP21)-1)<>\"\",OFFSET(DE108_23B!$AP$19,ROWS($AP$19:AP21)-1,COLUMNS($AP$19:AP21)-1),\"\")","v":"07:00:00"},{"$f":"IF(OFFSET(DE108_23B!$AQ$19,ROWS($AQ$19:AQ21)-1,COLUMNS($AQ$19:AQ21)-1)<>\"\",OFFSET(DE108_23B!$AQ$19,ROWS($AQ$19:AQ21)-1,COLUMNS($AQ$19:AQ21)-1),\"\")","v":"07:30:00"},{"$f":"IF(OFFSET(DE108_23B!$AR$19,ROWS($AR$19:AR21)-1,COLUMNS($AR$19:AR21)-1)<>\"\",OFFSET(DE108_23B!$AR$19,ROWS($AR$19:AR21)-1,COLUMNS($AR$19:AR21)-1),\"\")","v":"08:00:00"},{"$f":"IF(OFFSET(DE108_23B!$AS$19,ROWS($AS$19:AS21)-1,COLUMNS($AS$19:AS21)-1)<>\"\",OFFSET(DE108_23B!$AS$19,ROWS($AS$19:AS21)-1,COLUMNS($AS$19:AS21)-1),\"\")","v":"08:30:00"},{"$f":"IF(OFFSET(DE108_23B!$AT$19,ROWS($AT$19:AT21)-1,COLUMNS($AT$19:AT21)-1)<>\"\",OFFSET(DE108_23B!$AT$19,ROWS($AT$19:AT21)-1,COLUMNS($AT$19:AT21)-1),\"\")","v":"09:00:00"},{"$f":"IF(OFFSET(DE108_23B!$AU$19,ROWS($AU$19:AU21)-1,COLUMNS($AU$19:AU21)-1)<>\"\",OFFSET(DE108_23B!$AU$19,ROWS($AU$19:AU21)-1,COLUMNS($AU$19:AU21)-1),\"\")","v":"09:30:00"},{"$f":"IF(OFFSET(DE108_23B!$AV$19,ROWS($AV$19:AV21)-1,COLUMNS($AV$19:AV21)-1)<>\"\",OFFSET(DE108_23B!$AV$19,ROWS($AV$19:AV21)-1,COLUMNS($AV$19:AV21)-1),\"\")","v":"10:00:00"},{"$f":"IF(OFFSET(DE108_23B!$AW$19,ROWS($AW$19:AW21)-1,COLUMNS($AW$19:AW21)-1)<>\"\",OFFSET(DE108_23B!$AW$19,ROWS($AW$19:AW21)-1,COLUMNS($AW$19:AW21)-1),\"\")","v":"10:30:00"},{"$f":"IF(OFFSET(DE108_23B!$AX$19,ROWS($AX$19:AX21)-1,COLUMNS($AX$19:AX21)-1)<>\"\",OFFSET(DE108_23B!$AX$19,ROWS($AX$19:AX21)-1,COLUMNS($AX$19:AX21)-1),\"\")","v":"11:00:00"},{"$f":"IF(OFFSET(DE108_23B!$AY$19,ROWS($AY$19:AY21)-1,COLUMNS($AY$19:AY21)-1)<>\"\",OFFSET(DE108_23B!$AY$19,ROWS($AY$19:AY21)-1,COLUMNS($AY$19:AY21)-1),\"\")","v":"11:30:00"}]
[{"$f":"IF(OFFSET(DE108_23B!$C$19,ROWS($C$19:C22)-1,COLUMNS($C$19:C22)-1)<>\"\",OFFSET(DE108_23B!$C$19,ROWS($C$19:C22)-1,COLUMNS($C$19:C22)-1),\"\")","v":"SUN"},{"$f":"IF(OFFSET(DE108_23B!$D$19,ROWS($D$19:D22)-1,COLUMNS($D$19:D22)-1)<>\"\",OFFSET(DE108_23B!$D$19,ROWS($D$19:D22)-1,COLUMNS($D$19:D22)-1),\"\")","v":""},{"$f":"IF(OFFSET(DE108_23B!$E$19,ROWS($E$19:E22)-1,COLUMNS($E$19:E22)-1)<>\"\",OFFSET(DE108_23B!$E$19,ROWS($E$19:E22)-1,COLUMNS($E$19:E22)-1),\"\")","v":""},{"$f":"IF(OFFSET(DE108_23B!$F$19,ROWS($F$19:F22)-1,COLUMNS($F$19:F22)-1)<>\"\",OFFSET(DE108_23B!$F$19,ROWS($F$19:F22)-1,COLUMNS($F$19:F22)-1),\"\")","v":""},{"$f":"IF(OFFSET(DE108_23B!$G$19,ROWS($G$19:G22)-1,COLUMNS($G$19:G22)-1)<>\"\",OFFSET(DE108_23B!$G$19,ROWS($G$19:G22)-1,COLUMNS($G$19:G22)-1),\"\")","v":""},{"$f":"IF(OFFSET(DE108_23B!$H$19,ROWS($H$19:H22)-1,COLUMNS($H$19:H22)-1)<>\"\",OFFSET(DE108_23B!$H$19,ROWS($H$19:H22)-1,COLUMNS($H$19:H22)-1),\"\")","v":""},{"$f":"IF(OFFSET(DE108_23B!$I$19,ROWS($I$19:I22)-1,COLUMNS($I$19:I22)-1)<>\"\",OFFSET(DE108_23B!$I$19,ROWS($I$19:I22)-1,COLUMNS($I$19:I22)-1),\"\")","v":""},{"$f":"IF(OFFSET(DE108_23B!$J$19,ROWS($J$19:J22)-1,COLUMNS($J$19:J22)-1)<>\"\",OFFSET(DE108_23B!$J$19,ROWS($J$19:J22)-1,COLUMNS($J$19:J22)-1),\"\")","v":""},{"$f":"IF(OFFSET(DE108_23B!$K$19,ROWS($K$19:K22)-1,COLUMNS($K$19:K22)-1)<>\"\",OFFSET(DE108_23B!$K$19,ROWS($K$19:K22)-1,COLUMNS($K$19:K22)-1),\"\")","v":""},{"$f":"IF(OFFSET(DE108_23B!$L$19,ROWS($L$19:L22)-1,COLUMNS($L$19:L22)-1)<>\"\",OFFSET(DE108_23B!$L$19,ROWS($L$19:L22)-1,COLUMNS($L$19:L22)-1),\"\")","v":""},{"$f":"IF(OFFSET(DE108_23B!$M$19,ROWS($M$19:M22)-1,COLUMNS($M$19:M22)-1)<>\"\",OFFSET(DE108_23B!$M$19,ROWS($M$19:M22)-1,COLUMNS($M$19:M22)-1),\"\")","v":""},{"$f":"IF(OFFSET(DE108_23B!$N$19,ROWS($N$19:N22)-1,COLUMNS($N$19:N22)-1)<>\"\",OFFSET(DE108_23B!$N$19,ROWS($N$19:N22)-1,COLUMNS($N$19:N22)-1),\"\")","v":""},{"$f":"IF(OFFSET(DE108_23B!$O$19,ROWS($O$19:O22)-1,COLUMNS($O$19:O22)-1)<>\"\",OFFSET(DE108_23B!$O$19,ROWS($O$19:O22)-1,COLUMNS($O$19:O22)-1),\"\")","v":""},{"$f":"IF(OFFSET(DE108_23B!$P$19,ROWS($P$19:P22)-1,COLUMNS($P$19:P22)-1)<>\"\",OFFSET(DE108_23B!$P$19,ROWS($P$19:P22)-1,COLUMNS($P$19:P22)-1),\"\")","v":""},{"$f":"IF(OFFSET(DE108_23B!$Q$19,ROWS($Q$19:Q22)-1,COLUMNS($Q$19:Q22)-1)<>\"\",OFFSET(DE108_23B!$Q$19,ROWS($Q$19:Q22)-1,COLUMNS($Q$19:Q22)-1),\"\")","v":""},{"$f":"IF(OFFSET(DE108_23B!$R$19,ROWS($R$19:R22)-1,COLUMNS($R$19:R22)-1)<>\"\",OFFSET(DE108_23B!$R$19,ROWS($R$19:R22)-1,COLUMNS($R$19:R22)-1),\"\")","v":""},{"$f":"IF(OFFSET(DE108_23B!$S$19,ROWS($S$19:S22)-1,COLUMNS($S$19:S22)-1)<>\"\",OFFSET(DE108_23B!$S$19,ROWS($S$19:S22)-1,COLUMNS($S$19:S22)-1),\"\")","v":""},{"$f":"IF(OFFSET(DE108_23B!$T$19,ROWS($T$19:T22)-1,COLUMNS($T$19:T22)-1)<>\"\",OFFSET(DE108_23B!$T$19,ROWS($T$19:T22)-1,COLUMNS($T$19:T22)-1),\"\")","v":""},{"$f":"IF(OFFSET(DE108_23B!$U$19,ROWS($U$19:U22)-1,COLUMNS($U$19:U22)-1)<>\"\",OFFSET(DE108_23B!$U$19,ROWS($U$19:U22)-1,COLUMNS($U$19:U22)-1),\"\")","v":""},{"$f":"IF(OFFSET(DE108_23B!$V$19,ROWS($V$19:V22)-1,COLUMNS($V$19:V22)-1)<>\"\",OFFSET(DE108_23B!$V$19,ROWS($V$19:V22)-1,COLUMNS($V$19:V22)-1),\"\")","v":""},{"$f":"IF(OFFSET(DE108_23B!$W$19,ROWS($W$19:W22)-1,COLUMNS($W$19:W22)-1)<>\"\",OFFSET(DE108_23B!$W$19,ROWS($W$19:W22)-1,COLUMNS($W$19:W22)-1),\"\")","v":""},{"$f":"IF(OFFSET(DE108_23B!$X$19,ROWS($X$19:X22)-1,COLUMNS($X$19:X22)-1)<>\"\",OFFSET(DE108_23B!$X$19,ROWS($X$19:X22)-1,COLUMNS($X$19:X22)-1),\"\")","v":""},{"$f":"IF(OFFSET(DE108_23B!$Y$19,ROWS($Y$19:Y22)-1,COLUMNS($Y$19:Y22)-1)<>\"\",OFFSET(DE108_23B!$Y$19,ROWS($Y$19:Y22)-1,COLUMNS($Y$19:Y22)-1),\"\")","v":""},{"$f":"IF(OFFSET(DE108_23B!$Z$19,ROWS($Z$19:Z22)-1,COLUMNS($Z$19:Z22)-1)<>\"\",OFFSET(DE108_23B!$Z$19,ROWS($Z$19:Z22)-1,COLUMNS($Z$19:Z22)-1),\"\")","v":""},{"$f":"IF(OFFSET(DE108_23B!$AA$19,ROWS($AA$19:AA22)-1,COLUMNS($AA$19:AA22)-1)<>\"\",OFFSET(DE108_23B!$AA$19,ROWS($AA$19:AA22)-1,COLUMNS($AA$19:AA22)-1),\"\")","v":""},{"$f":"IF(OFFSET(DE108_23B!$AB$19,ROWS($AB$19:AB22)-1,COLUMNS($AB$19:AB22)-1)<>\"\",OFFSET(DE108_23B!$AB$19,ROWS($AB$19:AB22)-1,COLUMNS($AB$19:AB22)-1),\"\")","v":""},{"$f":"IF(OFFSET(DE108_23B!$AC$19,ROWS($AC$19:AC22)-1,COLUMNS($AC$19:AC22)-1)<>\"\",OFFSET(DE108_23B!$AC$19,ROWS($AC$19:AC22)-1,COLUMNS($AC$19:AC22)-1),\"\")","v":""},{"$f":"IF(OFFSET(DE108_23B!$AD$19,ROWS($AD$19:AD22)-1,COLUMNS($AD$19:AD22)-1)<>\"\",OFFSET(DE108_23B!$AD$19,ROWS($AD$19:AD22)-1,COLUMNS($AD$19:AD22)-1),\"\")","v":""},{"$f":"IF(OFFSET(DE108_23B!$AE$19,ROWS($AE$19:AE22)-1,COLUMNS($AE$19:AE22)-1)<>\"\",OFFSET(DE108_23B!$AE$19,ROWS($AE$19:AE22)-1,COLUMNS($AE$19:AE22)-1),\"\")","v":""},{"$f":"IF(OFFSET(DE108_23B!$AF$19,ROWS($AF$19:AF22)-1,COLUMNS($AF$19:AF22)-1)<>\"\",OFFSET(DE108_23B!$AF$19,ROWS($AF$19:AF22)-1,COLUMNS($AF$19:AF22)-1),\"\")","v":""},{"$f":"IF(OFFSET(DE108_23B!$AG$19,ROWS($AG$19:AG22)-1,COLUMNS($AG$19:AG22)-1)<>\"\",OFFSET(DE108_23B!$AG$19,ROWS($AG$19:AG22)-1,COLUMNS($AG$19:AG22)-1),\"\")","v":""},{"$f":"IF(OFFSET(DE108_23B!$AH$19,ROWS($AH$19:AH22)-1,COLUMNS($AH$19:AH22)-1)<>\"\",OFFSET(DE108_23B!$AH$19,ROWS($AH$19:AH22)-1,COLUMNS($AH$19:AH22)-1),\"\")","v":""},{"$f":"IF(OFFSET(DE108_23B!$AI$19,ROWS($AI$19:AI22)-1,COLUMNS($AI$19:AI22)-1)<>\"\",OFFSET(DE108_23B!$AI$19,ROWS($AI$19:AI22)-1,COLUMNS($AI$19:AI22)-1),\"\")","v":""},{"$f":"IF(OFFSET(DE108_23B!$AJ$19,ROWS($AJ$19:AJ22)-1,COLUMNS($AJ$19:AJ22)-1)<>\"\",OFFSET(DE108_23B!$AJ$19,ROWS($AJ$19:AJ22)-1,COLUMNS($AJ$19:AJ22)-1),\"\")","v":""},{"$f":"IF(OFFSET(DE108_23B!$AK$19,ROWS($AK$19:AK22)-1,COLUMNS($AK$19:AK22)-1)<>\"\",OFFSET(DE108_23B!$AK$19,ROWS($AK$19:AK22)-1,COLUMNS($AK$19:AK22)-1),\"\")","v":""},{"$f":"IF(OFFSET(DE108_23B!$AL$19,ROWS($AL$19:AL22)-1,COLUMNS($AL$19:AL22)-1)<>\"\",OFFSET(DE108_23B!$AL$19,ROWS($AL$19:AL22)-1,COLUMNS($AL$19:AL22)-1),\"\")","v":""},{"$f":"IF(OFFSET(DE108_23B!$AM$19,ROWS($AM$19:AM22)-1,COLUMNS($AM$19:AM22)-1)<>\"\",OFFSET(DE108_23B!$AM$19,ROWS($AM$19:AM22)-1,COLUMNS($AM$19:AM22)-1),\"\")","v":""},{"$f":"IF(OFFSET(DE108_23B!$AN$19,ROWS($AN$19:AN22)-1,COLUMNS($AN$19:AN22)-1)<>\"\",OFFSET(DE108_23B!$AN$19,ROWS($AN$19:AN22)-1,COLUMNS($AN$19:AN22)-1),\"\")","v":""},{"$f":"IF(OFFSET(DE108_23B!$AO$19,ROWS($AO$19:AO22)-1,COLUMNS($AO$19:AO22)-1)<>\"\",OFFSET(DE108_23B!$AO$19,ROWS($AO$19:AO22)-1,COLUMNS($AO$19:AO22)-1),\"\")","v":""},{"$f":"IF(OFFSET(DE108_23B!$AP$19,ROWS($AP$19:AP22)-1,COLUMNS($AP$19:AP22)-1)<>\"\",OFFSET(DE108_23B!$AP$19,ROWS($AP$19:AP22)-1,COLUMNS($AP$19:AP22)-1),\"\")","v":""},{"$f":"IF(OFFSET(DE108_23B!$AQ$19,ROWS($AQ$19:AQ22)-1,COLUMNS($AQ$19:AQ22)-1)<>\"\",OFFSET(DE108_23B!$AQ$19,ROWS($AQ$19:AQ22)-1,COLUMNS($AQ$19:AQ22)-1),\"\")","v":""},{"$f":"IF(OFFSET(DE108_23B!$AR$19,ROWS($AR$19:AR22)-1,COLUMNS($AR$19:AR22)-1)<>\"\",OFFSET(DE108_23B!$AR$19,ROWS($AR$19:AR22)-1,COLUMNS($AR$19:AR22)-1),\"\")","v":""},{"$f":"IF(OFFSET(DE108_23B!$AS$19,ROWS($AS$19:AS22)-1,COLUMNS($AS$19:AS22)-1)<>\"\",OFFSET(DE108_23B!$AS$19,ROWS($AS$19:AS22)-1,COLUMNS($AS$19:AS22)-1),\"\")","v":""},{"$f":"IF(OFFSET(DE108_23B!$AT$19,ROWS($AT$19:AT22)-1,COLUMNS($AT$19:AT22)-1)<>\"\",OFFSET(DE108_23B!$AT$19,ROWS($AT$19:AT22)-1,COLUMNS($AT$19:AT22)-1),\"\")","v":""},{"$f":"IF(OFFSET(DE108_23B!$AU$19,ROWS($AU$19:AU22)-1,COLUMNS($AU$19:AU22)-1)<>\"\",OFFSET(DE108_23B!$AU$19,ROWS($AU$19:AU22)-1,COLUMNS($AU$19:AU22)-1),\"\")","v":""},{"$f":"IF(OFFSET(DE108_23B!$AV$19,ROWS($AV$19:AV22)-1,COLUMNS($AV$19:AV22)-1)<>\"\",OFFSET(DE108_23B!$AV$19,ROWS($AV$19:AV22)-1,COLUMNS($AV$19:AV22)-1),\"\")","v":""},{"$f":"IF(OFFSET(DE108_23B!$AW$19,ROWS($AW$19:AW22)-1,COLUMNS($AW$19:AW22)-1)<>\"\",OFFSET(DE108_23B!$AW$19,ROWS($AW$19:AW22)-1,COLUMNS($AW$19:AW22)-1),\"\")","v":""},{"$f":"IF(OFFSET(DE108_23B!$AX$19,ROWS($AX$19:AX22)-1,COLUMNS($AX$19:AX22)-1)<>\"\",OFFSET(DE108_23B!$AX$19,ROWS($AX$19:AX22)-1,COLUMNS($AX$19:AX22)-1),\"\")","v":""},{"$f":"IF(OFFSET(DE108_23B!$AY$19,ROWS($AY$19:AY22)-1,COLUMNS($AY$19:AY22)-1)<>\"\",OFFSET(DE108_23B!$AY$19,ROWS($AY$19:AY22)-1,COLUMNS($AY$19:AY22)-1),\"\")","v":""}]
[{"$f":"IF(OFFSET(DE108_23B!$C$19,ROWS($C$19:C23)-1,COLUMNS($C$19:C23)-1)<>\"\",OFFSET(DE108_23B!$C$19,ROWS($C$19:C23)-1,COLUMNS($C$19:C23)-1),\"\")","v":"MON"},{"$f":"IF(OFFSET(DE108_23B!$D$19,ROWS($D$19:D23)-1,COLUMNS($D$19:D23)-1)<>\"\",OFFSET(DE108_23B!$D$19,ROWS($D$19:D23)-1,COLUMNS($D$19:D23)-1),\"\")","v":""},{"$f":"IF(OFFSET(DE108_23B!$E$19,ROWS($E$19:E23)-1,COLUMNS($E$19:E23)-1)<>\"\",OFFSET(DE108_23B!$E$19,ROWS($E$19:E23)-1,COLUMNS($E$19:E23)-1),\"\")","v":""},{"$f":"IF(OFFSET(DE108_23B!$F$19,ROWS($F$19:F23)-1,COLUMNS($F$19:F23)-1)<>\"\",OFFSET(DE108_23B!$F$19,ROWS($F$19:F23)-1,COLUMNS($F$19:F23)-1),\"\")","v":""},{"$f":"IF(OFFSET(DE108_23B!$G$19,ROWS($G$19:G23)-1,COLUMNS($G$19:G23)-1)<>\"\",OFFSET(DE108_23B!$G$19,ROWS($G$19:G23)-1,COLUMNS($G$19:G23)-1),\"\")","v":""},{"$f":"IF(OFFSET(DE108_23B!$H$19,ROWS($H$19:H23)-1,COLUMNS($H$19:H23)-1)<>\"\",OFFSET(DE108_23B!$H$19,ROWS($H$19:H23)-1,COLUMNS($H$19:H23)-1),\"\")","v":""},{"$f":"IF(OFFSET(DE108_23B!$I$19,ROWS($I$19:I23)-1,COLUMNS($I$19:I23)-1)<>\"\",OFFSET(DE108_23B!$I$19,ROWS($I$19:I23)-1,COLUMNS($I$19:I23)-1),\"\")","v":""},{"$f":"IF(OFFSET(DE108_23B!$J$19,ROWS($J$19:J23)-1,COLUMNS($J$19:J23)-1)<>\"\",OFFSET(DE108_23B!$J$19,ROWS($J$19:J23)-1,COLUMNS($J$19:J23)-1),\"\")","v":""},{"$f":"IF(OFFSET(DE108_23B!$K$19,ROWS($K$19:K23)-1,COLUMNS($K$19:K23)-1)<>\"\",OFFSET(DE108_23B!$K$19,ROWS($K$19:K23)-1,COLUMNS($K$19:K23)-1),\"\")","v":""},{"$f":"IF(OFFSET(DE108_23B!$L$19,ROWS($L$19:L23)-1,COLUMNS($L$19:L23)-1)<>\"\",OFFSET(DE108_23B!$L$19,ROWS($L$19:L23)-1,COLUMNS($L$19:L23)-1),\"\")","v":""},{"$f":"IF(OFFSET(DE108_23B!$M$19,ROWS($M$19:M23)-1,COLUMNS($M$19:M23)-1)<>\"\",OFFSET(DE108_23B!$M$19,ROWS($M$19:M23)-1,COLUMNS($M$19:M23)-1),\"\")","v":""},{"$f":"IF(OFFSET(DE108_23B!$N$19,ROWS($N$19:N23)-1,COLUMNS($N$19:N23)-1)<>\"\",OFFSET(DE108_23B!$N$19,ROWS($N$19:N23)-1,COLUMNS($N$19:N23)-1),\"\")","v":""},{"$f":"IF(OFFSET(DE108_23B!$O$19,ROWS($O$19:O23)-1,COLUMNS($O$19:O23)-1)<>\"\",OFFSET(DE108_23B!$O$19,ROWS($O$19:O23)-1,COLUMNS($O$19:O23)-1),\"\")","v":""},{"$f":"IF(OFFSET(DE108_23B!$P$19,ROWS($P$19:P23)-1,COLUMNS($P$19:P23)-1)<>\"\",OFFSET(DE108_23B!$P$19,ROWS($P$19:P23)-1,COLUMNS($P$19:P23)-1),\"\")","v":""},{"$f":"IF(OFFSET(DE108_23B!$Q$19,ROWS($Q$19:Q23)-1,COLUMNS($Q$19:Q23)-1)<>\"\",OFFSET(DE108_23B!$Q$19,ROWS($Q$19:Q23)-1,COLUMNS($Q$19:Q23)-1),\"\")","v":""},{"$f":"IF(OFFSET(DE108_23B!$R$19,ROWS($R$19:R23)-1,COLUMNS($R$19:R23)-1)<>\"\",OFFSET(DE108_23B!$R$19,ROWS($R$19:R23)-1,COLUMNS($R$19:R23)-1),\"\")","v":""},{"$f":"IF(OFFSET(DE108_23B!$S$19,ROWS($S$19:S23)-1,COLUMNS($S$19:S23)-1)<>\"\",OFFSET(DE108_23B!$S$19,ROWS($S$19:S23)-1,COLUMNS($S$19:S23)-1),\"\")","v":""},{"$f":"IF(OFFSET(DE108_23B!$T$19,ROWS($T$19:T23)-1,COLUMNS($T$19:T23)-1)<>\"\",OFFSET(DE108_23B!$T$19,ROWS($T$19:T23)-1,COLUMNS($T$19:T23)-1),\"\")","v":""},{"$f":"IF(OFFSET(DE108_23B!$U$19,ROWS($U$19:U23)-1,COLUMNS($U$19:U23)-1)<>\"\",OFFSET(DE108_23B!$U$19,ROWS($U$19:U23)-1,COLUMNS($U$19:U23)-1),\"\")","v":""},{"$f":"IF(OFFSET(DE108_23B!$V$19,ROWS($V$19:V23)-1,COLUMNS($V$19:V23)-1)<>\"\",OFFSET(DE108_23B!$V$19,ROWS($V$19:V23)-1,COLUMNS($V$19:V23)-1),\"\")","v":""},{"$f":"IF(OFFSET(DE108_23B!$W$19,ROWS($W$19:W23)-1,COLUMNS($W$19:W23)-1)<>\"\",OFFSET(DE108_23B!$W$19,ROWS($W$19:W23)-1,COLUMNS($W$19:W23)-1),\"\")","v":""},{"$f":"IF(OFFSET(DE108_23B!$X$19,ROWS($X$19:X23)-1,COLUMNS($X$19:X23)-1)<>\"\",OFFSET(DE108_23B!$X$19,ROWS($X$19:X23)-1,COLUMNS($X$19:X23)-1),\"\")","v":""},{"$f":"IF(OFFSET(DE108_23B!$Y$19,ROWS($Y$19:Y23)-1,COLUMNS($Y$19:Y23)-1)<>\"\",OFFSET(DE108_23B!$Y$19,ROWS($Y$19:Y23)-1,COLUMNS($Y$19:Y23)-1),\"\")","v":""},{"$f":"IF(OFFSET(DE108_23B!$Z$19,ROWS($Z$19:Z23)-1,COLUMNS($Z$19:Z23)-1)<>\"\",OFFSET(DE108_23B!$Z$19,ROWS($Z$19:Z23)-1,COLUMNS($Z$19:Z23)-1),\"\")","v":""},{"$f":"IF(OFFSET(DE108_23B!$AA$19,ROWS($AA$19:AA23)-1,COLUMNS($AA$19:AA23)-1)<>\"\",OFFSET(DE108_23B!$AA$19,ROWS($AA$19:AA23)-1,COLUMNS($AA$19:AA23)-1),\"\")","v":""},{"$f":"IF(OFFSET(DE108_23B!$AB$19,ROWS($AB$19:AB23)-1,COLUMNS($AB$19:AB23)-1)<>\"\",OFFSET(DE108_23B!$AB$19,ROWS($AB$19:AB23)-1,COLUMNS($AB$19:AB23)-1),\"\")","v":""},{"$f":"IF(OFFSET(DE108_23B!$AC$19,ROWS($AC$19:AC23)-1,COLUMNS($AC$19:AC23)-1)<>\"\",OFFSET(DE108_23B!$AC$19,ROWS($AC$19:AC23)-1,COLUMNS($AC$19:AC23)-1),\"\")","v":""},{"$f":"IF(OFFSET(DE108_23B!$AD$19,ROWS($AD$19:AD23)-1,COLUMNS($AD$19:AD23)-1)<>\"\",OFFSET(DE108_23B!$AD$19,ROWS($AD$19:AD23)-1,COLUMNS($AD$19:AD23)-1),\"\")","v":""},{"$f":"IF(OFFSET(DE108_23B!$AE$19,ROWS($AE$19:AE23)-1,COLUMNS($AE$19:AE23)-1)<>\"\",OFFSET(DE108_23B!$AE$19,ROWS($AE$19:AE23)-1,COLUMNS($AE$19:AE23)-1),\"\")","v":""},{"$f":"IF(OFFSET(DE108_23B!$AF$19,ROWS($AF$19:AF23)-1,COLUMNS($AF$19:AF23)-1)<>\"\",OFFSET(DE108_23B!$AF$19,ROWS($AF$19:AF23)-1,COLUMNS($AF$19:AF23)-1),\"\")","v":""},{"$f":"IF(OFFSET(DE108_23B!$AG$19,ROWS($AG$19:AG23)-1,COLUMNS($AG$19:AG23)-1)<>\"\",OFFSET(DE108_23B!$AG$19,ROWS($AG$19:AG23)-1,COLUMNS($AG$19:AG23)-1),\"\")","v":""},{"$f":"IF(OFFSET(DE108_23B!$AH$19,ROWS($AH$19:AH23)-1,COLUMNS($AH$19:AH23)-1)<>\"\",OFFSET(DE108_23B!$AH$19,ROWS($AH$19:AH23)-1,COLUMNS($AH$19:AH23)-1),\"\")","v":""},{"$f":"IF(OFFSET(DE108_23B!$AI$19,ROWS($AI$19:AI23)-1,COLUMNS($AI$19:AI23)-1)<>\"\",OFFSET(DE108_23B!$AI$19,ROWS($AI$19:AI23)-1,COLUMNS($AI$19:AI23)-1),\"\")","v":""},{"$f":"IF(OFFSET(DE108_23B!$AJ$19,ROWS($AJ$19:AJ23)-1,COLUMNS($AJ$19:AJ23)-1)<>\"\",OFFSET(DE108_23B!$AJ$19,ROWS($AJ$19:AJ23)-1,COLUMNS($AJ$19:AJ23)-1),\"\")","v":""},{"$f":"IF(OFFSET(DE108_23B!$AK$19,ROWS($AK$19:AK23)-1,COLUMNS($AK$19:AK23)-1)<>\"\",OFFSET(DE108_23B!$AK$19,ROWS($AK$19:AK23)-1,COLUMNS($AK$19:AK23)-1),\"\")","v":""},{"$f":"IF(OFFSET(DE108_23B!$AL$19,ROWS($AL$19:AL23)-1,COLUMNS($AL$19:AL23)-1)<>\"\",OFFSET(DE108_23B!$AL$19,ROWS($AL$19:AL23)-1,COLUMNS($AL$19:AL23)-1),\"\")","v":""},{"$f":"IF(OFFSET(DE108_23B!$AM$19,ROWS($AM$19:AM23)-1,COLUMNS($AM$19:AM23)-1)<>\"\",OFFSET(DE108_23B!$AM$19,ROWS($AM$19:AM23)-1,COLUMNS($AM$19:AM23)-1),\"\")","v":""},{"$f":"IF(OFFSET(DE108_23B!$AN$19,ROWS($AN$19:AN23)-1,COLUMNS($AN$19:AN23)-1)<>\"\",OFFSET(DE108_23B!$AN$19,ROWS($AN$19:AN23)-1,COLUMNS($AN$19:AN23)-1),\"\")","v":""},{"$f":"IF(OFFSET(DE108_23B!$AO$19,ROWS($AO$19:AO23)-1,COLUMNS($AO$19:AO23)-1)<>\"\",OFFSET(DE108_23B!$AO$19,ROWS($AO$19:AO23)-1,COLUMNS($AO$19:AO23)-1),\"\")","v":""},{"$f":"IF(OFFSET(DE108_23B!$AP$19,ROWS($AP$19:AP23)-1,COLUMNS($AP$19:AP23)-1)<>\"\",OFFSET(DE108_23B!$AP$19,ROWS($AP$19:AP23)-1,COLUMNS($AP$19:AP23)-1),\"\")","v":""},{"$f":"IF(OFFSET(DE108_23B!$AQ$19,ROWS($AQ$19:AQ23)-1,COLUMNS($AQ$19:AQ23)-1)<>\"\",OFFSET(DE108_23B!$AQ$19,ROWS($AQ$19:AQ23)-1,COLUMNS($AQ$19:AQ23)-1),\"\")","v":""},{"$f":"IF(OFFSET(DE108_23B!$AR$19,ROWS($AR$19:AR23)-1,COLUMNS($AR$19:AR23)-1)<>\"\",OFFSET(DE108_23B!$AR$19,ROWS($AR$19:AR23)-1,COLUMNS($AR$19:AR23)-1),\"\")","v":""},{"$f":"IF(OFFSET(DE108_23B!$AS$19,ROWS($AS$19:AS23)-1,COLUMNS($AS$19:AS23)-1)<>\"\",OFFSET(DE108_23B!$AS$19,ROWS($AS$19:AS23)-1,COLUMNS($AS$19:AS23)-1),\"\")","v":""},{"$f":"IF(OFFSET(DE108_23B!$AT$19,ROWS($AT$19:AT23)-1,COLUMNS($AT$19:AT23)-1)<>\"\",OFFSET(DE108_23B!$AT$19,ROWS($AT$19:AT23)-1,COLUMNS($AT$19:AT23)-1),\"\")","v":""},{"$f":"IF(OFFSET(DE108_23B!$AU$19,ROWS($AU$19:AU23)-1,COLUMNS($AU$19:AU23)-1)<>\"\",OFFSET(DE108_23B!$AU$19,ROWS($AU$19:AU23)-1,COLUMNS($AU$19:AU23)-1),\"\")","v":""},{"$f":"IF(OFFSET(DE108_23B!$AV$19,ROWS($AV$19:AV23)-1,COLUMNS($AV$19:AV23)-1)<>\"\",OFFSET(DE108_23B!$AV$19,ROWS($AV$19:AV23)-1,COLUMNS($AV$19:AV23)-1),\"\")","v":""},{"$f":"IF(OFFSET(DE108_23B!$AW$19,ROWS($AW$19:AW23)-1,COLUMNS($AW$19:AW23)-1)<>\"\",OFFSET(DE108_23B!$AW$19,ROWS($AW$19:AW23)-1,COLUMNS($AW$19:AW23)-1),\"\")","v":""},{"$f":"IF(OFFSET(DE108_23B!$AX$19,ROWS($AX$19:AX23)-1,COLUMNS($AX$19:AX23)-1)<>\"\",OFFSET(DE108_23B!$AX$19,ROWS($AX$19:AX23)-1,COLUMNS($AX$19:AX23)-1),\"\")","v":""},{"$f":"IF(OFFSET(DE108_23B!$AY$19,ROWS($AY$19:AY23)-1,COLUMNS($AY$19:AY23)-1)<>\"\",OFFSET(DE108_23B!$AY$19,ROWS($AY$19:AY23)-1,COLUMNS($AY$19:AY23)-1),\"\")","v":""}]
[{"$f":"IF(OFFSET(DE108_23B!$C$19,ROWS($C$19:C24)-1,COLUMNS($C$19:C24)-1)<>\"\",OFFSET(DE108_23B!$C$19,ROWS($C$19:C24)-1,COLUMNS($C$19:C24)-1),\"\")","v":"TUE"},{"$f":"IF(OFFSET(DE108_23B!$D$19,ROWS($D$19:D24)-1,COLUMNS($D$19:D24)-1)<>\"\",OFFSET(DE108_23B!$D$19,ROWS($D$19:D24)-1,COLUMNS($D$19:D24)-1),\"\")","v":""},{"$f":"IF(OFFSET(DE108_23B!$E$19,ROWS($E$19:E24)-1,COLUMNS($E$19:E24)-1)<>\"\",OFFSET(DE108_23B!$E$19,ROWS($E$19:E24)-1,COLUMNS($E$19:E24)-1),\"\")","v":""},{"$f":"IF(OFFSET(DE108_23B!$F$19,ROWS($F$19:F24)-1,COLUMNS($F$19:F24)-1)<>\"\",OFFSET(DE108_23B!$F$19,ROWS($F$19:F24)-1,COLUMNS($F$19:F24)-1),\"\")","v":""},{"$f":"IF(OFFSET(DE108_23B!$G$19,ROWS($G$19:G24)-1,COLUMNS($G$19:G24)-1)<>\"\",OFFSET(DE108_23B!$G$19,ROWS($G$19:G24)-1,COLUMNS($G$19:G24)-1),\"\")","v":""},{"$f":"IF(OFFSET(DE108_23B!$H$19,ROWS($H$19:H24)-1,COLUMNS($H$19:H24)-1)<>\"\",OFFSET(DE108_23B!$H$19,ROWS($H$19:H24)-1,COLUMNS($H$19:H24)-1),\"\")","v":""},{"$f":"IF(OFFSET(DE108_23B!$I$19,ROWS($I$19:I24)-1,COLUMNS($I$19:I24)-1)<>\"\",OFFSET(DE108_23B!$I$19,ROWS($I$19:I24)-1,COLUMNS($I$19:I24)-1),\"\")","v":""},{"$f":"IF(OFFSET(DE108_23B!$J$19,ROWS($J$19:J24)-1,COLUMNS($J$19:J24)-1)<>\"\",OFFSET(DE108_23B!$J$19,ROWS($J$19:J24)-1,COLUMNS($J$19:J24)-1),\"\")","v":""},{"$f":"IF(OFFSET(DE108_23B!$K$19,ROWS($K$19:K24)-1,COLUMNS($K$19:K24)-1)<>\"\",OFFSET(DE108_23B!$K$19,ROWS($K$19:K24)-1,COLUMNS($K$19:K24)-1),\"\")","v":""},{"$f":"IF(OFFSET(DE108_23B!$L$19,ROWS($L$19:L24)-1,COLUMNS($L$19:L24)-1)<>\"\",OFFSET(DE108_23B!$L$19,ROWS($L$19:L24)-1,COLUMNS($L$19:L24)-1),\"\")","v":""},{"$f":"IF(OFFSET(DE108_23B!$M$19,ROWS($M$19:M24)-1,COLUMNS($M$19:M24)-1)<>\"\",OFFSET(DE108_23B!$M$19,ROWS($M$19:M24)-1,COLUMNS($M$19:M24)-1),\"\")","v":""},{"$f":"IF(OFFSET(DE108_23B!$N$19,ROWS($N$19:N24)-1,COLUMNS($N$19:N24)-1)<>\"\",OFFSET(DE108_23B!$N$19,ROWS($N$19:N24)-1,COLUMNS($N$19:N24)-1),\"\")","v":""},{"$f":"IF(OFFSET(DE108_23B!$O$19,ROWS($O$19:O24)-1,COLUMNS($O$19:O24)-1)<>\"\",OFFSET(DE108_23B!$O$19,ROWS($O$19:O24)-1,COLUMNS($O$19:O24)-1),\"\")","v":""},{"$f":"IF(OFFSET(DE108_23B!$P$19,ROWS($P$19:P24)-1,COLUMNS($P$19:P24)-1)<>\"\",OFFSET(DE108_23B!$P$19,ROWS($P$19:P24)-1,COLUMNS($P$19:P24)-1),\"\")","v":""},{"$f":"IF(OFFSET(DE108_23B!$Q$19,ROWS($Q$19:Q24)-1,COLUMNS($Q$19:Q24)-1)<>\"\",OFFSET(DE108_23B!$Q$19,ROWS($Q$19:Q24)-1,COLUMNS($Q$19:Q24)-1),\"\")","v":""},{"$f":"IF(OFFSET(DE108_23B!$R$19,ROWS($R$19:R24)-1,COLUMNS($R$19:R24)-1)<>\"\",OFFSET(DE108_23B!$R$19,ROWS($R$19:R24)-1,COLUMNS($R$19:R24)-1),\"\")","v":""},{"$f":"IF(OFFSET(DE108_23B!$S$19,ROWS($S$19:S24)-1,COLUMNS($S$19:S24)-1)<>\"\",OFFSET(DE108_23B!$S$19,ROWS($S$19:S24)-1,COLUMNS($S$19:S24)-1),\"\")","v":""},{"$f":"IF(OFFSET(DE108_23B!$T$19,ROWS($T$19:T24)-1,COLUMNS($T$19:T24)-1)<>\"\",OFFSET(DE108_23B!$T$19,ROWS($T$19:T24)-1,COLUMNS($T$19:T24)-1),\"\")","v":""},{"$f":"IF(OFFSET(DE108_23B!$U$19,ROWS($U$19:U24)-1,COLUMNS($U$19:U24)-1)<>\"\",OFFSET(DE108_23B!$U$19,ROWS($U$19:U24)-1,COLUMNS($U$19:U24)-1),\"\")","v":""},{"$f":"IF(OFFSET(DE108_23B!$V$19,ROWS($V$19:V24)-1,COLUMNS($V$19:V24)-1)<>\"\",OFFSET(DE108_23B!$V$19,ROWS($V$19:V24)-1,COLUMNS($V$19:V24)-1),\"\")","v":""},{"$f":"IF(OFFSET(DE108_23B!$W$19,ROWS($W$19:W24)-1,COLUMNS($W$19:W24)-1)<>\"\",OFFSET(DE108_23B!$W$19,ROWS($W$19:W24)-1,COLUMNS($W$19:W24)-1),\"\")","v":""},{"$f":"IF(OFFSET(DE108_23B!$X$19,ROWS($X$19:X24)-1,COLUMNS($X$19:X24)-1)<>\"\",OFFSET(DE108_23B!$X$19,ROWS($X$19:X24)-1,COLUMNS($X$19:X24)-1),\"\")","v":""},{"$f":"IF(OFFSET(DE108_23B!$Y$19,ROWS($Y$19:Y24)-1,COLUMNS($Y$19:Y24)-1)<>\"\",OFFSET(DE108_23B!$Y$19,ROWS($Y$19:Y24)-1,COLUMNS($Y$19:Y24)-1),\"\")","v":""},{"$f":"IF(OFFSET(DE108_23B!$Z$19,ROWS($Z$19:Z24)-1,COLUMNS($Z$19:Z24)-1)<>\"\",OFFSET(DE108_23B!$Z$19,ROWS($Z$19:Z24)-1,COLUMNS($Z$19:Z24)-1),\"\")","v":""},{"$f":"IF(OFFSET(DE108_23B!$AA$19,ROWS($AA$19:AA24)-1,COLUMNS($AA$19:AA24)-1)<>\"\",OFFSET(DE108_23B!$AA$19,ROWS($AA$19:AA24)-1,COLUMNS($AA$19:AA24)-1),\"\")","v":""},{"$f":"IF(OFFSET(DE108_23B!$AB$19,ROWS($AB$19:AB24)-1,COLUMNS($AB$19:AB24)-1)<>\"\",OFFSET(DE108_23B!$AB$19,ROWS($AB$19:AB24)-1,COLUMNS($AB$19:AB24)-1),\"\")","v":""},{"$f":"IF(OFFSET(DE108_23B!$AC$19,ROWS($AC$19:AC24)-1,COLUMNS($AC$19:AC24)-1)<>\"\",OFFSET(DE108_23B!$AC$19,ROWS($AC$19:AC24)-1,COLUMNS($AC$19:AC24)-1),\"\")","v":""},{"$f":"IF(OFFSET(DE108_23B!$AD$19,ROWS($AD$19:AD24)-1,COLUMNS($AD$19:AD24)-1)<>\"\",OFFSET(DE108_23B!$AD$19,ROWS($AD$19:AD24)-1,COLUMNS($AD$19:AD24)-1),\"\")","v":""},{"$f":"IF(OFFSET(DE108_23B!$AE$19,ROWS($AE$19:AE24)-1,COLUMNS($AE$19:AE24)-1)<>\"\",OFFSET(DE108_23B!$AE$19,ROWS($AE$19:AE24)-1,COLUMNS($AE$19:AE24)-1),\"\")","v":""},{"$f":"IF(OFFSET(DE108_23B!$AF$19,ROWS($AF$19:AF24)-1,COLUMNS($AF$19:AF24)-1)<>\"\",OFFSET(DE108_23B!$AF$19,ROWS($AF$19:AF24)-1,COLUMNS($AF$19:AF24)-1),\"\")","v":""},{"$f":"IF(OFFSET(DE108_23B!$AG$19,ROWS($AG$19:AG24)-1,COLUMNS($AG$19:AG24)-1)<>\"\",OFFSET(DE108_23B!$AG$19,ROWS($AG$19:AG24)-1,COLUMNS($AG$19:AG24)-1),\"\")","v":""},{"$f":"IF(OFFSET(DE108_23B!$AH$19,ROWS($AH$19:AH24)-1,COLUMNS($AH$19:AH24)-1)<>\"\",OFFSET(DE108_23B!$AH$19,ROWS($AH$19:AH24)-1,COLUMNS($AH$19:AH24)-1),\"\")","v":""},{"$f":"IF(OFFSET(DE108_23B!$AI$19,ROWS($AI$19:AI24)-1,COLUMNS($AI$19:AI24)-1)<>\"\",OFFSET(DE108_23B!$AI$19,ROWS($AI$19:AI24)-1,COLUMNS($AI$19:AI24)-1),\"\")","v":""},{"$f":"IF(OFFSET(DE108_23B!$AJ$19,ROWS($AJ$19:AJ24)-1,COLUMNS($AJ$19:AJ24)-1)<>\"\",OFFSET(DE108_23B!$AJ$19,ROWS($AJ$19:AJ24)-1,COLUMNS($AJ$19:AJ24)-1),\"\")","v":""},{"$f":"IF(OFFSET(DE108_23B!$AK$19,ROWS($AK$19:AK24)-1,COLUMNS($AK$19:AK24)-1)<>\"\",OFFSET(DE108_23B!$AK$19,ROWS($AK$19:AK24)-1,COLUMNS($AK$19:AK24)-1),\"\")","v":""},{"$f":"IF(OFFSET(DE108_23B!$AL$19,ROWS($AL$19:AL24)-1,COLUMNS($AL$19:AL24)-1)<>\"\",OFFSET(DE108_23B!$AL$19,ROWS($AL$19:AL24)-1,COLUMNS($AL$19:AL24)-1),\"\")","v":""},{"$f":"IF(OFFSET(DE108_23B!$AM$19,ROWS($AM$19:AM24)-1,COLUMNS($AM$19:AM24)-1)<>\"\",OFFSET(DE108_23B!$AM$19,ROWS($AM$19:AM24)-1,COLUMNS($AM$19:AM24)-1),\"\")","v":""},{"$f":"IF(OFFSET(DE108_23B!$AN$19,ROWS($AN$19:AN24)-1,COLUMNS($AN$19:AN24)-1)<>\"\",OFFSET(DE108_23B!$AN$19,ROWS($AN$19:AN24)-1,COLUMNS($AN$19:AN24)-1),\"\")","v":""},{"$f":"IF(OFFSET(DE108_23B!$AO$19,ROWS($AO$19:AO24)-1,COLUMNS($AO$19:AO24)-1)<>\"\",OFFSET(DE108_23B!$AO$19,ROWS($AO$19:AO24)-1,COLUMNS($AO$19:AO24)-1),\"\")","v":""},{"$f":"IF(OFFSET(DE108_23B!$AP$19,ROWS($AP$19:AP24)-1,COLUMNS($AP$19:AP24)-1)<>\"\",OFFSET(DE108_23B!$AP$19,ROWS($AP$19:AP24)-1,COLUMNS($AP$19:AP24)-1),\"\")","v":""},{"$f":"IF(OFFSET(DE108_23B!$AQ$19,ROWS($AQ$19:AQ24)-1,COLUMNS($AQ$19:AQ24)-1)<>\"\",OFFSET(DE108_23B!$AQ$19,ROWS($AQ$19:AQ24)-1,COLUMNS($AQ$19:AQ24)-1),\"\")","v":""},{"$f":"IF(OFFSET(DE108_23B!$AR$19,ROWS($AR$19:AR24)-1,COLUMNS($AR$19:AR24)-1)<>\"\",OFFSET(DE108_23B!$AR$19,ROWS($AR$19:AR24)-1,COLUMNS($AR$19:AR24)-1),\"\")","v":""},{"$f":"IF(OFFSET(DE108_23B!$AS$19,ROWS($AS$19:AS24)-1,COLUMNS($AS$19:AS24)-1)<>\"\",OFFSET(DE108_23B!$AS$19,ROWS($AS$19:AS24)-1,COLUMNS($AS$19:AS24)-1),\"\")","v":""},{"$f":"IF(OFFSET(DE108_23B!$AT$19,ROWS($AT$19:AT24)-1,COLUMNS($AT$19:AT24)-1)<>\"\",OFFSET(DE108_23B!$AT$19,ROWS($AT$19:AT24)-1,COLUMNS($AT$19:AT24)-1),\"\")","v":""},{"$f":"IF(OFFSET(DE108_23B!$AU$19,ROWS($AU$19:AU24)-1,COLUMNS($AU$19:AU24)-1)<>\"\",OFFSET(DE108_23B!$AU$19,ROWS($AU$19:AU24)-1,COLUMNS($AU$19:AU24)-1),\"\")","v":""},{"$f":"IF(OFFSET(DE108_23B!$AV$19,ROWS($AV$19:AV24)-1,COLUMNS($AV$19:AV24)-1)<>\"\",OFFSET(DE108_23B!$AV$19,ROWS($AV$19:AV24)-1,COLUMNS($AV$19:AV24)-1),\"\")","v":""},{"$f":"IF(OFFSET(DE108_23B!$AW$19,ROWS($AW$19:AW24)-1,COLUMNS($AW$19:AW24)-1)<>\"\",OFFSET(DE108_23B!$AW$19,ROWS($AW$19:AW24)-1,COLUMNS($AW$19:AW24)-1),\"\")","v":""},{"$f":"IF(OFFSET(DE108_23B!$AX$19,ROWS($AX$19:AX24)-1,COLUMNS($AX$19:AX24)-1)<>\"\",OFFSET(DE108_23B!$AX$19,ROWS($AX$19:AX24)-1,COLUMNS($AX$19:AX24)-1),\"\")","v":""},{"$f":"IF(OFFSET(DE108_23B!$AY$19,ROWS($AY$19:AY24)-1,COLUMNS($AY$19:AY24)-1)<>\"\",OFFSET(DE108_23B!$AY$19,ROWS($AY$19:AY24)-1,COLUMNS($AY$19:AY24)-1),\"\")","v":""}]
[{"$f":"IF(OFFSET(DE108_23B!$C$19,ROWS($C$19:C25)-1,COLUMNS($C$19:C25)-1)<>\"\",OFFSET(DE108_23B!$C$19,ROWS($C$19:C25)-1,COLUMNS($C$19:C25)-1),\"\")","v":"WED"},{"$f":"IF(OFFSET(DE108_23B!$D$19,ROWS($D$19:D25)-1,COLUMNS($D$19:D25)-1)<>\"\",OFFSET(DE108_23B!$D$19,ROWS($D$19:D25)-1,COLUMNS($D$19:D25)-1),\"\")","v":""},{"$f":"IF(OFFSET(DE108_23B!$E$19,ROWS($E$19:E25)-1,COLUMNS($E$19:E25)-1)<>\"\",OFFSET(DE108_23B!$E$19,ROWS($E$19:E25)-1,COLUMNS($E$19:E25)-1),\"\")","v":""},{"$f":"IF(OFFSET(DE108_23B!$F$19,ROWS($F$19:F25)-1,COLUMNS($F$19:F25)-1)<>\"\",OFFSET(DE108_23B!$F$19,ROWS($F$19:F25)-1,COLUMNS($F$19:F25)-1),\"\")","v":""},{"$f":"IF(OFFSET(DE108_23B!$G$19,ROWS($G$19:G25)-1,COLUMNS($G$19:G25)-1)<>\"\",OFFSET(DE108_23B!$G$19,ROWS($G$19:G25)-1,COLUMNS($G$19:G25)-1),\"\")","v":""},{"$f":"IF(OFFSET(DE108_23B!$H$19,ROWS($H$19:H25)-1,COLUMNS($H$19:H25)-1)<>\"\",OFFSET(DE108_23B!$H$19,ROWS($H$19:H25)-1,COLUMNS($H$19:H25)-1),\"\")","v":""},{"$f":"IF(OFFSET(DE108_23B!$I$19,ROWS($I$19:I25)-1,COLUMNS($I$19:I25)-1)<>\"\",OFFSET(DE108_23B!$I$19,ROWS($I$19:I25)-1,COLUMNS($I$19:I25)-1),\"\")","v":""},{"$f":"IF(OFFSET(DE108_23B!$J$19,ROWS($J$19:J25)-1,COLUMNS($J$19:J25)-1)<>\"\",OFFSET(DE108_23B!$J$19,ROWS($J$19:J25)-1,COLUMNS($J$19:J25)-1),\"\")","v":""},{"$f":"IF(OFFSET(DE108_23B!$K$19,ROWS($K$19:K25)-1,COLUMNS($K$19:K25)-1)<>\"\",OFFSET(DE108_23B!$K$19,ROWS($K$19:K25)-1,COLUMNS($K$19:K25)-1),\"\")","v":""},{"$f":"IF(OFFSET(DE108_23B!$L$19,ROWS($L$19:L25)-1,COLUMNS($L$19:L25)-1)<>\"\",OFFSET(DE108_23B!$L$19,ROWS($L$19:L25)-1,COLUMNS($L$19:L25)-1),\"\")","v":""},{"$f":"IF(OFFSET(DE108_23B!$M$19,ROWS($M$19:M25)-1,COLUMNS($M$19:M25)-1)<>\"\",OFFSET(DE108_23B!$M$19,ROWS($M$19:M25)-1,COLUMNS($M$19:M25)-1),\"\")","v":""},{"$f":"IF(OFFSET(DE108_23B!$N$19,ROWS($N$19:N25)-1,COLUMNS($N$19:N25)-1)<>\"\",OFFSET(DE108_23B!$N$19,ROWS($N$19:N25)-1,COLUMNS($N$19:N25)-1),\"\")","v":""},{"$f":"IF(OFFSET(DE108_23B!$O$19,ROWS($O$19:O25)-1,COLUMNS($O$19:O25)-1)<>\"\",OFFSET(DE108_23B!$O$19,ROWS($O$19:O25)-1,COLUMNS($O$19:O25)-1),\"\")","v":""},{"$f":"IF(OFFSET(DE108_23B!$P$19,ROWS($P$19:P25)-1,COLUMNS($P$19:P25)-1)<>\"\",OFFSET(DE108_23B!$P$19,ROWS($P$19:P25)-1,COLUMNS($P$19:P25)-1),\"\")","v":""},{"$f":"IF(OFFSET(DE108_23B!$Q$19,ROWS($Q$19:Q25)-1,COLUMNS($Q$19:Q25)-1)<>\"\",OFFSET(DE108_23B!$Q$19,ROWS($Q$19:Q25)-1,COLUMNS($Q$19:Q25)-1),\"\")","v":""},{"$f":"IF(OFFSET(DE108_23B!$R$19,ROWS($R$19:R25)-1,COLUMNS($R$19:R25)-1)<>\"\",OFFSET(DE108_23B!$R$19,ROWS($R$19:R25)-1,COLUMNS($R$19:R25)-1),\"\")","v":""},{"$f":"IF(OFFSET(DE108_23B!$S$19,ROWS($S$19:S25)-1,COLUMNS($S$19:S25)-1)<>\"\",OFFSET(DE108_23B!$S$19,ROWS($S$19:S25)-1,COLUMNS($S$19:S25)-1),\"\")","v":""},{"$f":"IF(OFFSET(DE108_23B!$T$19,ROWS($T$19:T25)-1,COLUMNS($T$19:T25)-1)<>\"\",OFFSET(DE108_23B!$T$19,ROWS($T$19:T25)-1,COLUMNS($T$19:T25)-1),\"\")","v":""},{"$f":"IF(OFFSET(DE108_23B!$U$19,ROWS($U$19:U25)-1,COLUMNS($U$19:U25)-1)<>\"\",OFFSET(DE108_23B!$U$19,ROWS($U$19:U25)-1,COLUMNS($U$19:U25)-1),\"\")","v":""},{"$f":"IF(OFFSET(DE108_23B!$V$19,ROWS($V$19:V25)-1,COLUMNS($V$19:V25)-1)<>\"\",OFFSET(DE108_23B!$V$19,ROWS($V$19:V25)-1,COLUMNS($V$19:V25)-1),\"\")","v":""},{"$f":"IF(OFFSET(DE108_23B!$W$19,ROWS($W$19:W25)-1,COLUMNS($W$19:W25)-1)<>\"\",OFFSET(DE108_23B!$W$19,ROWS($W$19:W25)-1,COLUMNS($W$19:W25)-1),\"\")","v":""},{"$f":"IF(OFFSET(DE108_23B!$X$19,ROWS($X$19:X25)-1,COLUMNS($X$19:X25)-1)<>\"\",OFFSET(DE108_23B!$X$19,ROWS($X$19:X25)-1,COLUMNS($X$19:X25)-1),\"\")","v":""},{"$f":"IF(OFFSET(DE108_23B!$Y$19,ROWS($Y$19:Y25)-1,COLUMNS($Y$19:Y25)-1)<>\"\",OFFSET(DE108_23B!$Y$19,ROWS($Y$19:Y25)-1,COLUMNS($Y$19:Y25)-1),\"\")","v":""},{"$f":"IF(OFFSET(DE108_23B!$Z$19,ROWS($Z$19:Z25)-1,COLUMNS($Z$19:Z25)-1)<>\"\",OFFSET(DE108_23B!$Z$19,ROWS($Z$19:Z25)-1,COLUMNS($Z$19:Z25)-1),\"\")","v":""},{"$f":"IF(OFFSET(DE108_23B!$AA$19,ROWS($AA$19:AA25)-1,COLUMNS($AA$19:AA25)-1)<>\"\",OFFSET(DE108_23B!$AA$19,ROWS($AA$19:AA25)-1,COLUMNS($AA$19:AA25)-1),\"\")","v":""},{"$f":"IF(OFFSET(DE108_23B!$AB$19,ROWS($AB$19:AB25)-1,COLUMNS($AB$19:AB25)-1)<>\"\",OFFSET(DE108_23B!$AB$19,ROWS($AB$19:AB25)-1,COLUMNS($AB$19:AB25)-1),\"\")","v":""},{"$f":"IF(OFFSET(DE108_23B!$AC$19,ROWS($AC$19:AC25)-1,COLUMNS($AC$19:AC25)-1)<>\"\",OFFSET(DE108_23B!$AC$19,ROWS($AC$19:AC25)-1,COLUMNS($AC$19:AC25)-1),\"\")","v":""},{"$f":"IF(OFFSET(DE108_23B!$AD$19,ROWS($AD$19:AD25)-1,COLUMNS($AD$19:AD25)-1)<>\"\",OFFSET(DE108_23B!$AD$19,ROWS($AD$19:AD25)-1,COLUMNS($AD$19:AD25)-1),\"\")","v":""},{"$f":"IF(OFFSET(DE108_23B!$AE$19,ROWS($AE$19:AE25)-1,COLUMNS($AE$19:AE25)-1)<>\"\",OFFSET(DE108_23B!$AE$19,ROWS($AE$19:AE25)-1,COLUMNS($AE$19:AE25)-1),\"\")","v":""},{"$f":"IF(OFFSET(DE108_23B!$AF$19,ROWS($AF$19:AF25)-1,COLUMNS($AF$19:AF25)-1)<>\"\",OFFSET(DE108_23B!$AF$19,ROWS($AF$19:AF25)-1,COLUMNS($AF$19:AF25)-1),\"\")","v":""},{"$f":"IF(OFFSET(DE108_23B!$AG$19,ROWS($AG$19:AG25)-1,COLUMNS($AG$19:AG25)-1)<>\"\",OFFSET(DE108_23B!$AG$19,ROWS($AG$19:AG25)-1,COLUMNS($AG$19:AG25)-1),\"\")","v":""},{"$f":"IF(OFFSET(DE108_23B!$AH$19,ROWS($AH$19:AH25)-1,COLUMNS($AH$19:AH25)-1)<>\"\",OFFSET(DE108_23B!$AH$19,ROWS($AH$19:AH25)-1,COLUMNS($AH$19:AH25)-1),\"\")","v":""},{"$f":"IF(OFFSET(DE108_23B!$AI$19,ROWS($AI$19:AI25)-1,COLUMNS($AI$19:AI25)-1)<>\"\",OFFSET(DE108_23B!$AI$19,ROWS($AI$19:AI25)-1,COLUMNS($AI$19:AI25)-1),\"\")","v":""},{"$f":"IF(OFFSET(DE108_23B!$AJ$19,ROWS($AJ$19:AJ25)-1,COLUMNS($AJ$19:AJ25)-1)<>\"\",OFFSET(DE108_23B!$AJ$19,ROWS($AJ$19:AJ25)-1,COLUMNS($AJ$19:AJ25)-1),\"\")","v":""},{"$f":"IF(OFFSET(DE108_23B!$AK$19,ROWS($AK$19:AK25)-1,COLUMNS($AK$19:AK25)-1)<>\"\",OFFSET(DE108_23B!$AK$19,ROWS($AK$19:AK25)-1,COLUMNS($AK$19:AK25)-1),\"\")","v":""},{"$f":"IF(OFFSET(DE108_23B!$AL$19,ROWS($AL$19:AL25)-1,COLUMNS($AL$19:AL25)-1)<>\"\",OFFSET(DE108_23B!$AL$19,ROWS($AL$19:AL25)-1,COLUMNS($AL$19:AL25)-1),\"\")","v":""},{"$f":"IF(OFFSET(DE108_23B!$AM$19,ROWS($AM$19:AM25)-1,COLUMNS($AM$19:AM25)-1)<>\"\",OFFSET(DE108_23B!$AM$19,ROWS($AM$19:AM25)-1,COLUMNS($AM$19:AM25)-1),\"\")","v":""},{"$f":"IF(OFFSET(DE108_23B!$AN$19,ROWS($AN$19:AN25)-1,COLUMNS($AN$19:AN25)-1)<>\"\",OFFSET(DE108_23B!$AN$19,ROWS($AN$19:AN25)-1,COLUMNS($AN$19:AN25)-1),\"\")","v":""},{"$f":"IF(OFFSET(DE108_23B!$AO$19,ROWS($AO$19:AO25)-1,COLUMNS($AO$19:AO25)-1)<>\"\",OFFSET(DE108_23B!$AO$19,ROWS($AO$19:AO25)-1,COLUMNS($AO$19:AO25)-1),\"\")","v":""},{"$f":"IF(OFFSET(DE108_23B!$AP$19,ROWS($AP$19:AP25)-1,COLUMNS($AP$19:AP25)-1)<>\"\",OFFSET(DE108_23B!$AP$19,ROWS($AP$19:AP25)-1,COLUMNS($AP$19:AP25)-1),\"\")","v":""},{"$f":"IF(OFFSET(DE108_23B!$AQ$19,ROWS($AQ$19:AQ25)-1,COLUMNS($AQ$19:AQ25)-1)<>\"\",OFFSET(DE108_23B!$AQ$19,ROWS($AQ$19:AQ25)-1,COLUMNS($AQ$19:AQ25)-1),\"\")","v":""},{"$f":"IF(OFFSET(DE108_23B!$AR$19,ROWS($AR$19:AR25)-1,COLUMNS($AR$19:AR25)-1)<>\"\",OFFSET(DE108_23B!$AR$19,ROWS($AR$19:AR25)-1,COLUMNS($AR$19:AR25)-1),\"\")","v":""},{"$f":"IF(OFFSET(DE108_23B!$AS$19,ROWS($AS$19:AS25)-1,COLUMNS($AS$19:AS25)-1)<>\"\",OFFSET(DE108_23B!$AS$19,ROWS($AS$19:AS25)-1,COLUMNS($AS$19:AS25)-1),\"\")","v":""},{"$f":"IF(OFFSET(DE108_23B!$AT$19,ROWS($AT$19:AT25)-1,COLUMNS($AT$19:AT25)-1)<>\"\",OFFSET(DE108_23B!$AT$19,ROWS($AT$19:AT25)-1,COLUMNS($AT$19:AT25)-1),\"\")","v":""},{"$f":"IF(OFFSET(DE108_23B!$AU$19,ROWS($AU$19:AU25)-1,COLUMNS($AU$19:AU25)-1)<>\"\",OFFSET(DE108_23B!$AU$19,ROWS($AU$19:AU25)-1,COLUMNS($AU$19:AU25)-1),\"\")","v":""},{"$f":"IF(OFFSET(DE108_23B!$AV$19,ROWS($AV$19:AV25)-1,COLUMNS($AV$19:AV25)-1)<>\"\",OFFSET(DE108_23B!$AV$19,ROWS($AV$19:AV25)-1,COLUMNS($AV$19:AV25)-1),\"\")","v":""},{"$f":"IF(OFFSET(DE108_23B!$AW$19,ROWS($AW$19:AW25)-1,COLUMNS($AW$19:AW25)-1)<>\"\",OFFSET(DE108_23B!$AW$19,ROWS($AW$19:AW25)-1,COLUMNS($AW$19:AW25)-1),\"\")","v":""},{"$f":"IF(OFFSET(DE108_23B!$AX$19,ROWS($AX$19:AX25)-1,COLUMNS($AX$19:AX25)-1)<>\"\",OFFSET(DE108_23B!$AX$19,ROWS($AX$19:AX25)-1,COLUMNS($AX$19:AX25)-1),\"\")","v":""},{"$f":"IF(OFFSET(DE108_23B!$AY$19,ROWS($AY$19:AY25)-1,COLUMNS($AY$19:AY25)-1)<>\"\",OFFSET(DE108_23B!$AY$19,ROWS($AY$19:AY25)-1,COLUMNS($AY$19:AY25)-1),\"\")","v":""}]
[{"$f":"IF(OFFSET(DE108_23B!$C$19,ROWS($C$19:C26)-1,COLUMNS($C$19:C26)-1)<>\"\",OFFSET(DE108_23B!$C$19,ROWS($C$19:C26)-1,COLUMNS($C$19:C26)-1),\"\")","v":"THU"},{"$f":"IF(OFFSET(DE108_23B!$D$19,ROWS($D$19:D26)-1,COLUMNS($D$19:D26)-1)<>\"\",OFFSET(DE108_23B!$D$19,ROWS($D$19:D26)-1,COLUMNS($D$19:D26)-1),\"\")","v":""},{"$f":"IF(OFFSET(DE108_23B!$E$19,ROWS($E$19:E26)-1,COLUMNS($E$19:E26)-1)<>\"\",OFFSET(DE108_23B!$E$19,ROWS($E$19:E26)-1,COLUMNS($E$19:E26)-1),\"\")","v":""},{"$f":"IF(OFFSET(DE108_23B!$F$19,ROWS($F$19:F26)-1,COLUMNS($F$19:F26)-1)<>\"\",OFFSET(DE108_23B!$F$19,ROWS($F$19:F26)-1,COLUMNS($F$19:F26)-1),\"\")","v":""},{"$f":"IF(OFFSET(DE108_23B!$G$19,ROWS($G$19:G26)-1,COLUMNS($G$19:G26)-1)<>\"\",OFFSET(DE108_23B!$G$19,ROWS($G$19:G26)-1,COLUMNS($G$19:G26)-1),\"\")","v":""},{"$f":"IF(OFFSET(DE108_23B!$H$19,ROWS($H$19:H26)-1,COLUMNS($H$19:H26)-1)<>\"\",OFFSET(DE108_23B!$H$19,ROWS($H$19:H26)-1,COLUMNS($H$19:H26)-1),\"\")","v":""},{"$f":"IF(OFFSET(DE108_23B!$I$19,ROWS($I$19:I26)-1,COLUMNS($I$19:I26)-1)<>\"\",OFFSET(DE108_23B!$I$19,ROWS($I$19:I26)-1,COLUMNS($I$19:I26)-1),\"\")","v":""},{"$f":"IF(OFFSET(DE108_23B!$J$19,ROWS($J$19:J26)-1,COLUMNS($J$19:J26)-1)<>\"\",OFFSET(DE108_23B!$J$19,ROWS($J$19:J26)-1,COLUMNS($J$19:J26)-1),\"\")","v":""},{"$f":"IF(OFFSET(DE108_23B!$K$19,ROWS($K$19:K26)-1,COLUMNS($K$19:K26)-1)<>\"\",OFFSET(DE108_23B!$K$19,ROWS($K$19:K26)-1,COLUMNS($K$19:K26)-1),\"\")","v":""},{"$f":"IF(OFFSET(DE108_23B!$L$19,ROWS($L$19:L26)-1,COLUMNS($L$19:L26)-1)<>\"\",OFFSET(DE108_23B!$L$19,ROWS($L$19:L26)-1,COLUMNS($L$19:L26)-1),\"\")","v":""},{"$f":"IF(OFFSET(DE108_23B!$M$19,ROWS($M$19:M26)-1,COLUMNS($M$19:M26)-1)<>\"\",OFFSET(DE108_23B!$M$19,ROWS($M$19:M26)-1,COLUMNS($M$19:M26)-1),\"\")","v":""},{"$f":"IF(OFFSET(DE108_23B!$N$19,ROWS($N$19:N26)-1,COLUMNS($N$19:N26)-1)<>\"\",OFFSET(DE108_23B!$N$19,ROWS($N$19:N26)-1,COLUMNS($N$19:N26)-1),\"\")","v":""},{"$f":"IF(OFFSET(DE108_23B!$O$19,ROWS($O$19:O26)-1,COLUMNS($O$19:O26)-1)<>\"\",OFFSET(DE108_23B!$O$19,ROWS($O$19:O26)-1,COLUMNS($O$19:O26)-1),\"\")","v":""},{"$f":"IF(OFFSET(DE108_23B!$P$19,ROWS($P$19:P26)-1,COLUMNS($P$19:P26)-1)<>\"\",OFFSET(DE108_23B!$P$19,ROWS($P$19:P26)-1,COLUMNS($P$19:P26)-1),\"\")","v":""},{"$f":"IF(OFFSET(DE108_23B!$Q$19,ROWS($Q$19:Q26)-1,COLUMNS($Q$19:Q26)-1)<>\"\",OFFSET(DE108_23B!$Q$19,ROWS($Q$19:Q26)-1,COLUMNS($Q$19:Q26)-1),\"\")","v":""},{"$f":"IF(OFFSET(DE108_23B!$R$19,ROWS($R$19:R26)-1,COLUMNS($R$19:R26)-1)<>\"\",OFFSET(DE108_23B!$R$19,ROWS($R$19:R26)-1,COLUMNS($R$19:R26)-1),\"\")","v":""},{"$f":"IF(OFFSET(DE108_23B!$S$19,ROWS($S$19:S26)-1,COLUMNS($S$19:S26)-1)<>\"\",OFFSET(DE108_23B!$S$19,ROWS($S$19:S26)-1,COLUMNS($S$19:S26)-1),\"\")","v":""},{"$f":"IF(OFFSET(DE108_23B!$T$19,ROWS($T$19:T26)-1,COLUMNS($T$19:T26)-1)<>\"\",OFFSET(DE108_23B!$T$19,ROWS($T$19:T26)-1,COLUMNS($T$19:T26)-1),\"\")","v":""},{"$f":"IF(OFFSET(DE108_23B!$U$19,ROWS($U$19:U26)-1,COLUMNS($U$19:U26)-1)<>\"\",OFFSET(DE108_23B!$U$19,ROWS($U$19:U26)-1,COLUMNS($U$19:U26)-1),\"\")","v":""},{"$f":"IF(OFFSET(DE108_23B!$V$19,ROWS($V$19:V26)-1,COLUMNS($V$19:V26)-1)<>\"\",OFFSET(DE108_23B!$V$19,ROWS($V$19:V26)-1,COLUMNS($V$19:V26)-1),\"\")","v":""},{"$f":"IF(OFFSET(DE108_23B!$W$19,ROWS($W$19:W26)-1,COLUMNS($W$19:W26)-1)<>\"\",OFFSET(DE108_23B!$W$19,ROWS($W$19:W26)-1,COLUMNS($W$19:W26)-1),\"\")","v":""},{"$f":"IF(OFFSET(DE108_23B!$X$19,ROWS($X$19:X26)-1,COLUMNS($X$19:X26)-1)<>\"\",OFFSET(DE108_23B!$X$19,ROWS($X$19:X26)-1,COLUMNS($X$19:X26)-1),\"\")","v":""},{"$f":"IF(OFFSET(DE108_23B!$Y$19,ROWS($Y$19:Y26)-1,COLUMNS($Y$19:Y26)-1)<>\"\",OFFSET(DE108_23B!$Y$19,ROWS($Y$19:Y26)-1,COLUMNS($Y$19:Y26)-1),\"\")","v":""},{"$f":"IF(OFFSET(DE108_23B!$Z$19,ROWS($Z$19:Z26)-1,COLUMNS($Z$19:Z26)-1)<>\"\",OFFSET(DE108_23B!$Z$19,ROWS($Z$19:Z26)-1,COLUMNS($Z$19:Z26)-1),\"\")","v":""},{"$f":"IF(OFFSET(DE108_23B!$AA$19,ROWS($AA$19:AA26)-1,COLUMNS($AA$19:AA26)-1)<>\"\",OFFSET(DE108_23B!$AA$19,ROWS($AA$19:AA26)-1,COLUMNS($AA$19:AA26)-1),\"\")","v":""},{"$f":"IF(OFFSET(DE108_23B!$AB$19,ROWS($AB$19:AB26)-1,COLUMNS($AB$19:AB26)-1)<>\"\",OFFSET(DE108_23B!$AB$19,ROWS($AB$19:AB26)-1,COLUMNS($AB$19:AB26)-1),\"\")","v":""},{"$f":"IF(OFFSET(DE108_23B!$AC$19,ROWS($AC$19:AC26)-1,COLUMNS($AC$19:AC26)-1)<>\"\",OFFSET(DE108_23B!$AC$19,ROWS($AC$19:AC26)-1,COLUMNS($AC$19:AC26)-1),\"\")","v":""},{"$f":"IF(OFFSET(DE108_23B!$AD$19,ROWS($AD$19:AD26)-1,COLUMNS($AD$19:AD26)-1)<>\"\",OFFSET(DE108_23B!$AD$19,ROWS($AD$19:AD26)-1,COLUMNS($AD$19:AD26)-1),\"\")","v":""},{"$f":"IF(OFFSET(DE108_23B!$AE$19,ROWS($AE$19:AE26)-1,COLUMNS($AE$19:AE26)-1)<>\"\",OFFSET(DE108_23B!$AE$19,ROWS($AE$19:AE26)-1,COLUMNS($AE$19:AE26)-1),\"\")","v":""},{"$f":"IF(OFFSET(DE108_23B!$AF$19,ROWS($AF$19:AF26)-1,COLUMNS($AF$19:AF26)-1)<>\"\",OFFSET(DE108_23B!$AF$19,ROWS($AF$19:AF26)-1,COLUMNS($AF$19:AF26)-1),\"\")","v":""},{"$f":"IF(OFFSET(DE108_23B!$AG$19,ROWS($AG$19:AG26)-1,COLUMNS($AG$19:AG26)-1)<>\"\",OFFSET(DE108_23B!$AG$19,ROWS($AG$19:AG26)-1,COLUMNS($AG$19:AG26)-1),\"\")","v":""},{"$f":"IF(OFFSET(DE108_23B!$AH$19,ROWS($AH$19:AH26)-1,COLUMNS($AH$19:AH26)-1)<>\"\",OFFSET(DE108_23B!$AH$19,ROWS($AH$19:AH26)-1,COLUMNS($AH$19:AH26)-1),\"\")","v":""},{"$f":"IF(OFFSET(DE108_23B!$AI$19,ROWS($AI$19:AI26)-1,COLUMNS($AI$19:AI26)-1)<>\"\",OFFSET(DE108_23B!$AI$19,ROWS($AI$19:AI26)-1,COLUMNS($AI$19:AI26)-1),\"\")","v":""},{"$f":"IF(OFFSET(DE108_23B!$AJ$19,ROWS($AJ$19:AJ26)-1,COLUMNS($AJ$19:AJ26)-1)<>\"\",OFFSET(DE108_23B!$AJ$19,ROWS($AJ$19:AJ26)-1,COLUMNS($AJ$19:AJ26)-1),\"\")","v":""},{"$f":"IF(OFFSET(DE108_23B!$AK$19,ROWS($AK$19:AK26)-1,COLUMNS($AK$19:AK26)-1)<>\"\",OFFSET(DE108_23B!$AK$19,ROWS($AK$19:AK26)-1,COLUMNS($AK$19:AK26)-1),\"\")","v":""},{"$f":"IF(OFFSET(DE108_23B!$AL$19,ROWS($AL$19:AL26)-1,COLUMNS($AL$19:AL26)-1)<>\"\",OFFSET(DE108_23B!$AL$19,ROWS($AL$19:AL26)-1,COLUMNS($AL$19:AL26)-1),\"\")","v":""},{"$f":"IF(OFFSET(DE108_23B!$AM$19,ROWS($AM$19:AM26)-1,COLUMNS($AM$19:AM26)-1)<>\"\",OFFSET(DE108_23B!$AM$19,ROWS($AM$19:AM26)-1,COLUMNS($AM$19:AM26)-1),\"\")","v":""},{"$f":"IF(OFFSET(DE108_23B!$AN$19,ROWS($AN$19:AN26)-1,COLUMNS($AN$19:AN26)-1)<>\"\",OFFSET(DE108_23B!$AN$19,ROWS($AN$19:AN26)-1,COLUMNS($AN$19:AN26)-1),\"\")","v":""},{"$f":"IF(OFFSET(DE108_23B!$AO$19,ROWS($AO$19:AO26)-1,COLUMNS($AO$19:AO26)-1)<>\"\",OFFSET(DE108_23B!$AO$19,ROWS($AO$19:AO26)-1,COLUMNS($AO$19:AO26)-1),\"\")","v":""},{"$f":"IF(OFFSET(DE108_23B!$AP$19,ROWS($AP$19:AP26)-1,COLUMNS($AP$19:AP26)-1)<>\"\",OFFSET(DE108_23B!$AP$19,ROWS($AP$19:AP26)-1,COLUMNS($AP$19:AP26)-1),\"\")","v":""},{"$f":"IF(OFFSET(DE108_23B!$AQ$19,ROWS($AQ$19:AQ26)-1,COLUMNS($AQ$19:AQ26)-1)<>\"\",OFFSET(DE108_23B!$AQ$19,ROWS($AQ$19:AQ26)-1,COLUMNS($AQ$19:AQ26)-1),\"\")","v":""},{"$f":"IF(OFFSET(DE108_23B!$AR$19,ROWS($AR$19:AR26)-1,COLUMNS($AR$19:AR26)-1)<>\"\",OFFSET(DE108_23B!$AR$19,ROWS($AR$19:AR26)-1,COLUMNS($AR$19:AR26)-1),\"\")","v":""},{"$f":"IF(OFFSET(DE108_23B!$AS$19,ROWS($AS$19:AS26)-1,COLUMNS($AS$19:AS26)-1)<>\"\",OFFSET(DE108_23B!$AS$19,ROWS($AS$19:AS26)-1,COLUMNS($AS$19:AS26)-1),\"\")","v":""},{"$f":"IF(OFFSET(DE108_23B!$AT$19,ROWS($AT$19:AT26)-1,COLUMNS($AT$19:AT26)-1)<>\"\",OFFSET(DE108_23B!$AT$19,ROWS($AT$19:AT26)-1,COLUMNS($AT$19:AT26)-1),\"\")","v":""},{"$f":"IF(OFFSET(DE108_23B!$AU$19,ROWS($AU$19:AU26)-1,COLUMNS($AU$19:AU26)-1)<>\"\",OFFSET(DE108_23B!$AU$19,ROWS($AU$19:AU26)-1,COLUMNS($AU$19:AU26)-1),\"\")","v":""},{"$f":"IF(OFFSET(DE108_23B!$AV$19,ROWS($AV$19:AV26)-1,COLUMNS($AV$19:AV26)-1)<>\"\",OFFSET(DE108_23B!$AV$19,ROWS($AV$19:AV26)-1,COLUMNS($AV$19:AV26)-1),\"\")","v":""},{"$f":"IF(OFFSET(DE108_23B!$AW$19,ROWS($AW$19:AW26)-1,COLUMNS($AW$19:AW26)-1)<>\"\",OFFSET(DE108_23B!$AW$19,ROWS($AW$19:AW26)-1,COLUMNS($AW$19:AW26)-1),\"\")","v":""},{"$f":"IF(OFFSET(DE108_23B!$AX$19,ROWS($AX$19:AX26)-1,COLUMNS($AX$19:AX26)-1)<>\"\",OFFSET(DE108_23B!$AX$19,ROWS($AX$19:AX26)-1,COLUMNS($AX$19:AX26)-1),\"\")","v":""},{"$f":"IF(OFFSET(DE108_23B!$AY$19,ROWS($AY$19:AY26)-1,COLUMNS($AY$19:AY26)-1)<>\"\",OFFSET(DE108_23B!$AY$19,ROWS($AY$19:AY26)-1,COLUMNS($AY$19:AY26)-1),\"\")","v":""}]
[{"$f":"IF(OFFSET(DE108_23B!$C$19,ROWS($C$19:C27)-1,COLUMNS($C$19:C27)-1)<>\"\",OFFSET(DE108_23B!$C$19,ROWS($C$19:C27)-1,COLUMNS($C$19:C27)-1),\"\")","v":"FRI"},{"$f":"IF(OFFSET(DE108_23B!$D$19,ROWS($D$19:D27)-1,COLUMNS($D$19:D27)-1)<>\"\",OFFSET(DE108_23B!$D$19,ROWS($D$19:D27)-1,COLUMNS($D$19:D27)-1),\"\")","v":""},{"$f":"IF(OFFSET(DE108_23B!$E$19,ROWS($E$19:E27)-1,COLUMNS($E$19:E27)-1)<>\"\",OFFSET(DE108_23B!$E$19,ROWS($E$19:E27)-1,COLUMNS($E$19:E27)-1),\"\")","v":""},{"$f":"IF(OFFSET(DE108_23B!$F$19,ROWS($F$19:F27)-1,COLUMNS($F$19:F27)-1)<>\"\",OFFSET(DE108_23B!$F$19,ROWS($F$19:F27)-1,COLUMNS($F$19:F27)-1),\"\")","v":""},{"$f":"IF(OFFSET(DE108_23B!$G$19,ROWS($G$19:G27)-1,COLUMNS($G$19:G27)-1)<>\"\",OFFSET(DE108_23B!$G$19,ROWS($G$19:G27)-1,COLUMNS($G$19:G27)-1),\"\")","v":""},{"$f":"IF(OFFSET(DE108_23B!$H$19,ROWS($H$19:H27)-1,COLUMNS($H$19:H27)-1)<>\"\",OFFSET(DE108_23B!$H$19,ROWS($H$19:H27)-1,COLUMNS($H$19:H27)-1),\"\")","v":""},{"$f":"IF(OFFSET(DE108_23B!$I$19,ROWS($I$19:I27)-1,COLUMNS($I$19:I27)-1)<>\"\",OFFSET(DE108_23B!$I$19,ROWS($I$19:I27)-1,COLUMNS($I$19:I27)-1),\"\")","v":""},{"$f":"IF(OFFSET(DE108_23B!$J$19,ROWS($J$19:J27)-1,COLUMNS($J$19:J27)-1)<>\"\",OFFSET(DE108_23B!$J$19,ROWS($J$19:J27)-1,COLUMNS($J$19:J27)-1),\"\")","v":""},{"$f":"IF(OFFSET(DE108_23B!$K$19,ROWS($K$19:K27)-1,COLUMNS($K$19:K27)-1)<>\"\",OFFSET(DE108_23B!$K$19,ROWS($K$19:K27)-1,COLUMNS($K$19:K27)-1),\"\")","v":""},{"$f":"IF(OFFSET(DE108_23B!$L$19,ROWS($L$19:L27)-1,COLUMNS($L$19:L27)-1)<>\"\",OFFSET(DE108_23B!$L$19,ROWS($L$19:L27)-1,COLUMNS($L$19:L27)-1),\"\")","v":""},{"$f":"IF(OFFSET(DE108_23B!$M$19,ROWS($M$19:M27)-1,COLUMNS($M$19:M27)-1)<>\"\",OFFSET(DE108_23B!$M$19,ROWS($M$19:M27)-1,COLUMNS($M$19:M27)-1),\"\")","v":""},{"$f":"IF(OFFSET(DE108_23B!$N$19,ROWS($N$19:N27)-1,COLUMNS($N$19:N27)-1)<>\"\",OFFSET(DE108_23B!$N$19,ROWS($N$19:N27)-1,COLUMNS($N$19:N27)-1),\"\")","v":""},{"$f":"IF(OFFSET(DE108_23B!$O$19,ROWS($O$19:O27)-1,COLUMNS($O$19:O27)-1)<>\"\",OFFSET(DE108_23B!$O$19,ROWS($O$19:O27)-1,COLUMNS($O$19:O27)-1),\"\")","v":""},{"$f":"IF(OFFSET(DE108_23B!$P$19,ROWS($P$19:P27)-1,COLUMNS($P$19:P27)-1)<>\"\",OFFSET(DE108_23B!$P$19,ROWS($P$19:P27)-1,COLUMNS($P$19:P27)-1),\"\")","v":""},{"$f":"IF(OFFSET(DE108_23B!$Q$19,ROWS($Q$19:Q27)-1,COLUMNS($Q$19:Q27)-1)<>\"\",OFFSET(DE108_23B!$Q$19,ROWS($Q$19:Q27)-1,COLUMNS($Q$19:Q27)-1),\"\")","v":""},{"$f":"IF(OFFSET(DE108_23B!$R$19,ROWS($R$19:R27)-1,COLUMNS($R$19:R27)-1)<>\"\",OFFSET(DE108_23B!$R$19,ROWS($R$19:R27)-1,COLUMNS($R$19:R27)-1),\"\")","v":""},{"$f":"IF(OFFSET(DE108_23B!$S$19,ROWS($S$19:S27)-1,COLUMNS($S$19:S27)-1)<>\"\",OFFSET(DE108_23B!$S$19,ROWS($S$19:S27)-1,COLUMNS($S$19:S27)-1),\"\")","v":""},{"$f":"IF(OFFSET(DE108_23B!$T$19,ROWS($T$19:T27)-1,COLUMNS($T$19:T27)-1)<>\"\",OFFSET(DE108_23B!$T$19,ROWS($T$19:T27)-1,COLUMNS($T$19:T27)-1),\"\")","v":""},{"$f":"IF(OFFSET(DE108_23B!$U$19,ROWS($U$19:U27)-1,COLUMNS($U$19:U27)-1)<>\"\",OFFSET(DE108_23B!$U$19,ROWS($U$19:U27)-1,COLUMNS($U$19:U27)-1),\"\")","v":""},{"$f":"IF(OFFSET(DE108_23B!$V$19,ROWS($V$19:V27)-1,COLUMNS($V$19:V27)-1)<>\"\",OFFSET(DE108_23B!$V$19,ROWS($V$19:V27)-1,COLUMNS($V$19:V27)-1),\"\")","v":""},{"$f":"IF(OFFSET(DE108_23B!$W$19,ROWS($W$19:W27)-1,COLUMNS($W$19:W27)-1)<>\"\",OFFSET(DE108_23B!$W$19,ROWS($W$19:W27)-1,COLUMNS($W$19:W27)-1),\"\")","v":""},{"$f":"IF(OFFSET(DE108_23B!$X$19,ROWS($X$19:X27)-1,COLUMNS($X$19:X27)-1)<>\"\",OFFSET(DE108_23B!$X$19,ROWS($X$19:X27)-1,COLUMNS($X$19:X27)-1),\"\")","v":""},{"$f":"IF(OFFSET(DE108_23B!$Y$19,ROWS($Y$19:Y27)-1,COLUMNS($Y$19:Y27)-1)<>\"\",OFFSET(DE108_23B!$Y$19,ROWS($Y$19:Y27)-1,COLUMNS($Y$19:Y27)-1),\"\")","v":""},{"$f":"IF(OFFSET(DE108_23B!$Z$19,ROWS($Z$19:Z27)-1,COLUMNS($Z$19:Z27)-1)<>\"\",OFFSET(DE108_23B!$Z$19,ROWS($Z$19:Z27)-1,COLUMNS($Z$19:Z27)-1),\"\")","v":""},{"$f":"IF(OFFSET(DE108_23B!$AA$19,ROWS($AA$19:AA27)-1,COLUMNS($AA$19:AA27)-1)<>\"\",OFFSET(DE108_23B!$AA$19,ROWS($AA$19:AA27)-1,COLUMNS($AA$19:AA27)-1),\"\")","v":""},{"$f":"IF(OFFSET(DE108_23B!$AB$19,ROWS($AB$19:AB27)-1,COLUMNS($AB$19:AB27)-1)<>\"\",OFFSET(DE108_23B!$AB$19,ROWS($AB$19:AB27)-1,COLUMNS($AB$19:AB27)-1),\"\")","v":""},{"$f":"IF(OFFSET(DE108_23B!$AC$19,ROWS($AC$19:AC27)-1,COLUMNS($AC$19:AC27)-1)<>\"\",OFFSET(DE108_23B!$AC$19,ROWS($AC$19:AC27)-1,COLUMNS($AC$19:AC27)-1),\"\")","v":""},{"$f":"IF(OFFSET(DE108_23B!$AD$19,ROWS($AD$19:AD27)-1,COLUMNS($AD$19:AD27)-1)<>\"\",OFFSET(DE108_23B!$AD$19,ROWS($AD$19:AD27)-1,COLUMNS($AD$19:AD27)-1),\"\")","v":""},{"$f":"IF(OFFSET(DE108_23B!$AE$19,ROWS($AE$19:AE27)-1,COLUMNS($AE$19:AE27)-1)<>\"\",OFFSET(DE108_23B!$AE$19,ROWS($AE$19:AE27)-1,COLUMNS($AE$19:AE27)-1),\"\")","v":""},{"$f":"IF(OFFSET(DE108_23B!$AF$19,ROWS($AF$19:AF27)-1,COLUMNS($AF$19:AF27)-1)<>\"\",OFFSET(DE108_23B!$AF$19,ROWS($AF$19:AF27)-1,COLUMNS($AF$19:AF27)-1),\"\")","v":""},{"$f":"IF(OFFSET(DE108_23B!$AG$19,ROWS($AG$19:AG27)-1,COLUMNS($AG$19:AG27)-1)<>\"\",OFFSET(DE108_23B!$AG$19,ROWS($AG$19:AG27)-1,COLUMNS($AG$19:AG27)-1),\"\")","v":""},{"$f":"IF(OFFSET(DE108_23B!$AH$19,ROWS($AH$19:AH27)-1,COLUMNS($AH$19:AH27)-1)<>\"\",OFFSET(DE108_23B!$AH$19,ROWS($AH$19:AH27)-1,COLUMNS($AH$19:AH27)-1),\"\")","v":""},{"$f":"IF(OFFSET(DE108_23B!$AI$19,ROWS($AI$19:AI27)-1,COLUMNS($AI$19:AI27)-1)<>\"\",OFFSET(DE108_23B!$AI$19,ROWS($AI$19:AI27)-1,COLUMNS($AI$19:AI27)-1),\"\")","v":""},{"$f":"IF(OFFSET(DE108_23B!$AJ$19,ROWS($AJ$19:AJ27)-1,COLUMNS($AJ$19:AJ27)-1)<>\"\",OFFSET(DE108_23B!$AJ$19,ROWS($AJ$19:AJ27)-1,COLUMNS($AJ$19:AJ27)-1),\"\")","v":""},{"$f":"IF(OFFSET(DE108_23B!$AK$19,ROWS($AK$19:AK27)-1,COLUMNS($AK$19:AK27)-1)<>\"\",OFFSET(DE108_23B!$AK$19,ROWS($AK$19:AK27)-1,COLUMNS($AK$19:AK27)-1),\"\")","v":""},{"$f":"IF(OFFSET(DE108_23B!$AL$19,ROWS($AL$19:AL27)-1,COLUMNS($AL$19:AL27)-1)<>\"\",OFFSET(DE108_23B!$AL$19,ROWS($AL$19:AL27)-1,COLUMNS($AL$19:AL27)-1),\"\")","v":""},{"$f":"IF(OFFSET(DE108_23B!$AM$19,ROWS($AM$19:AM27)-1,COLUMNS($AM$19:AM27)-1)<>\"\",OFFSET(DE108_23B!$AM$19,ROWS($AM$19:AM27)-1,COLUMNS($AM$19:AM27)-1),\"\")","v":""},{"$f":"IF(OFFSET(DE108_23B!$AN$19,ROWS($AN$19:AN27)-1,COLUMNS($AN$19:AN27)-1)<>\"\",OFFSET(DE108_23B!$AN$19,ROWS($AN$19:AN27)-1,COLUMNS($AN$19:AN27)-1),\"\")","v":""},{"$f":"IF(OFFSET(DE108_23B!$AO$19,ROWS($AO$19:AO27)-1,COLUMNS($AO$19:AO27)-1)<>\"\",OFFSET(DE108_23B!$AO$19,ROWS($AO$19:AO27)-1,COLUMNS($AO$19:AO27)-1),\"\")","v":""},{"$f":"IF(OFFSET(DE108_23B!$AP$19,ROWS($AP$19:AP27)-1,COLUMNS($AP$19:AP27)-1)<>\"\",OFFSET(DE108_23B!$AP$19,ROWS($AP$19:AP27)-1,COLUMNS($AP$19:AP27)-1),\"\")","v":""},{"$f":"IF(OFFSET(DE108_23B!$AQ$19,ROWS($AQ$19:AQ27)-1,COLUMNS($AQ$19:AQ27)-1)<>\"\",OFFSET(DE108_23B!$AQ$19,ROWS($AQ$19:AQ27)-1,COLUMNS($AQ$19:AQ27)-1),\"\")","v":""},{"$f":"IF(OFFSET(DE108_23B!$AR$19,ROWS($AR$19:AR27)-1,COLUMNS($AR$19:AR27)-1)<>\"\",OFFSET(DE108_23B!$AR$19,ROWS($AR$19:AR27)-1,COLUMNS($AR$19:AR27)-1),\"\")","v":""},{"$f":"IF(OFFSET(DE108_23B!$AS$19,ROWS($AS$19:AS27)-1,COLUMNS($AS$19:AS27)-1)<>\"\",OFFSET(DE108_23B!$AS$19,ROWS($AS$19:AS27)-1,COLUMNS($AS$19:AS27)-1),\"\")","v":""},{"$f":"IF(OFFSET(DE108_23B!$AT$19,ROWS($AT$19:AT27)-1,COLUMNS($AT$19:AT27)-1)<>\"\",OFFSET(DE108_23B!$AT$19,ROWS($AT$19:AT27)-1,COLUMNS($AT$19:AT27)-1),\"\")","v":""},{"$f":"IF(OFFSET(DE108_23B!$AU$19,ROWS($AU$19:AU27)-1,COLUMNS($AU$19:AU27)-1)<>\"\",OFFSET(DE108_23B!$AU$19,ROWS($AU$19:AU27)-1,COLUMNS($AU$19:AU27)-1),\"\")","v":""},{"$f":"IF(OFFSET(DE108_23B!$AV$19,ROWS($AV$19:AV27)-1,COLUMNS($AV$19:AV27)-1)<>\"\",OFFSET(DE108_23B!$AV$19,ROWS($AV$19:AV27)-1,COLUMNS($AV$19:AV27)-1),\"\")","v":""},{"$f":"IF(OFFSET(DE108_23B!$AW$19,ROWS($AW$19:AW27)-1,COLUMNS($AW$19:AW27)-1)<>\"\",OFFSET(DE108_23B!$AW$19,ROWS($AW$19:AW27)-1,COLUMNS($AW$19:AW27)-1),\"\")","v":""},{"$f":"IF(OFFSET(DE108_23B!$AX$19,ROWS($AX$19:AX27)-1,COLUMNS($AX$19:AX27)-1)<>\"\",OFFSET(DE108_23B!$AX$19,ROWS($AX$19:AX27)-1,COLUMNS($AX$19:AX27)-1),\"\")","v":""},{"$f":"IF(OFFSET(DE108_23B!$AY$19,ROWS($AY$19:AY27)-1,COLUMNS($AY$19:AY27)-1)<>\"\",OFFSET(DE108_23B!$AY$19,ROWS($AY$19:AY27)-1,COLUMNS($AY$19:AY27)-1),\"\")","v":""}]
[{"$f":"IF(OFFSET(DE108_23B!$C$19,ROWS($C$19:C28)-1,COLUMNS($C$19:C28)-1)<>\"\",OFFSET(DE108_23B!$C$19,ROWS($C$19:C28)-1,COLUMNS($C$19:C28)-1),\"\")","v":"SAT"},{"$f":"IF(OFFSET(DE108_23B!$D$19,ROWS($D$19:D28)-1,COLUMNS($D$19:D28)-1)<>\"\",OFFSET(DE108_23B!$D$19,ROWS($D$19:D28)-1,COLUMNS($D$19:D28)-1),\"\")","v":""},{"$f":"IF(OFFSET(DE108_23B!$E$19,ROWS($E$19:E28)-1,COLUMNS($E$19:E28)-1)<>\"\",OFFSET(DE108_23B!$E$19,ROWS($E$19:E28)-1,COLUMNS($E$19:E28)-1),\"\")","v":""},{"$f":"IF(OFFSET(DE108_23B!$F$19,ROWS($F$19:F28)-1,COLUMNS($F$19:F28)-1)<>\"\",OFFSET(DE108_23B!$F$19,ROWS($F$19:F28)-1,COLUMNS($F$19:F28)-1),\"\")","v":""},{"$f":"IF(OFFSET(DE108_23B!$G$19,ROWS($G$19:G28)-1,COLUMNS($G$19:G28)-1)<>\"\",OFFSET(DE108_23B!$G$19,ROWS($G$19:G28)-1,COLUMNS($G$19:G28)-1),\"\")","v":""},{"$f":"IF(OFFSET(DE108_23B!$H$19,ROWS($H$19:H28)-1,COLUMNS($H$19:H28)-1)<>\"\",OFFSET(DE108_23B!$H$19,ROWS($H$19:H28)-1,COLUMNS($H$19:H28)-1),\"\")","v":""},{"$f":"IF(OFFSET(DE108_23B!$I$19,ROWS($I$19:I28)-1,COLUMNS($I$19:I28)-1)<>\"\",OFFSET(DE108_23B!$I$19,ROWS($I$19:I28)-1,COLUMNS($I$19:I28)-1),\"\")","v":""},{"$f":"IF(OFFSET(DE108_23B!$J$19,ROWS($J$19:J28)-1,COLUMNS($J$19:J28)-1)<>\"\",OFFSET(DE108_23B!$J$19,ROWS($J$19:J28)-1,COLUMNS($J$19:J28)-1),\"\")","v":""},{"$f":"IF(OFFSET(DE108_23B!$K$19,ROWS($K$19:K28)-1,COLUMNS($K$19:K28)-1)<>\"\",OFFSET(DE108_23B!$K$19,ROWS($K$19:K28)-1,COLUMNS($K$19:K28)-1),\"\")","v":""},{"$f":"IF(OFFSET(DE108_23B!$L$19,ROWS($L$19:L28)-1,COLUMNS($L$19:L28)-1)<>\"\",OFFSET(DE108_23B!$L$19,ROWS($L$19:L28)-1,COLUMNS($L$19:L28)-1),\"\")","v":""},{"$f":"IF(OFFSET(DE108_23B!$M$19,ROWS($M$19:M28)-1,COLUMNS($M$19:M28)-1)<>\"\",OFFSET(DE108_23B!$M$19,ROWS($M$19:M28)-1,COLUMNS($M$19:M28)-1),\"\")","v":""},{"$f":"IF(OFFSET(DE108_23B!$N$19,ROWS($N$19:N28)-1,COLUMNS($N$19:N28)-1)<>\"\",OFFSET(DE108_23B!$N$19,ROWS($N$19:N28)-1,COLUMNS($N$19:N28)-1),\"\")","v":""},{"$f":"IF(OFFSET(DE108_23B!$O$19,ROWS($O$19:O28)-1,COLUMNS($O$19:O28)-1)<>\"\",OFFSET(DE108_23B!$O$19,ROWS($O$19:O28)-1,COLUMNS($O$19:O28)-1),\"\")","v":""},{"$f":"IF(OFFSET(DE108_23B!$P$19,ROWS($P$19:P28)-1,COLUMNS($P$19:P28)-1)<>\"\",OFFSET(DE108_23B!$P$19,ROWS($P$19:P28)-1,COLUMNS($P$19:P28)-1),\"\")","v":""},{"$f":"IF(OFFSET(DE108_23B!$Q$19,ROWS($Q$19:Q28)-1,COLUMNS($Q$19:Q28)-1)<>\"\",OFFSET(DE108_23B!$Q$19,ROWS($Q$19:Q28)-1,COLUMNS($Q$19:Q28)-1),\"\")","v":""},{"$f":"IF(OFFSET(DE108_23B!$R$19,ROWS($R$19:R28)-1,COLUMNS($R$19:R28)-1)<>\"\",OFFSET(DE108_23B!$R$19,ROWS($R$19:R28)-1,COLUMNS($R$19:R28)-1),\"\")","v":""},{"$f":"IF(OFFSET(DE108_23B!$S$19,ROWS($S$19:S28)-1,COLUMNS($S$19:S28)-1)<>\"\",OFFSET(DE108_23B!$S$19,ROWS($S$19:S28)-1,COLUMNS($S$19:S28)-1),\"\")","v":""},{"$f":"IF(OFFSET(DE108_23B!$T$19,ROWS($T$19:T28)-1,COLUMNS($T$19:T28)-1)<>\"\",OFFSET(DE108_23B!$T$19,ROWS($T$19:T28)-1,COLUMNS($T$19:T28)-1),\"\")","v":""},{"$f":"IF(OFFSET(DE108_23B!$U$19,ROWS($U$19:U28)-1,COLUMNS($U$19:U28)-1)<>\"\",OFFSET(DE108_23B!$U$19,ROWS($U$19:U28)-1,COLUMNS($U$19:U28)-1),\"\")","v":""},{"$f":"IF(OFFSET(DE108_23B!$V$19,ROWS($V$19:V28)-1,COLUMNS($V$19:V28)-1)<>\"\",OFFSET(DE108_23B!$V$19,ROWS($V$19:V28)-1,COLUMNS($V$19:V28)-1),\"\")","v":""},{"$f":"IF(OFFSET(DE108_23B!$W$19,ROWS($W$19:W28)-1,COLUMNS($W$19:W28)-1)<>\"\",OFFSET(DE108_23B!$W$19,ROWS($W$19:W28)-1,COLUMNS($W$19:W28)-1),\"\")","v":""},{"$f":"IF(OFFSET(DE108_23B!$X$19,ROWS($X$19:X28)-1,COLUMNS($X$19:X28)-1)<>\"\",OFFSET(DE108_23B!$X$19,ROWS($X$19:X28)-1,COLUMNS($X$19:X28)-1),\"\")","v":""},{"$f":"IF(OFFSET(DE108_23B!$Y$19,ROWS($Y$19:Y28)-1,COLUMNS($Y$19:Y28)-1)<>\"\",OFFSET(DE108_23B!$Y$19,ROWS($Y$19:Y28)-1,COLUMNS($Y$19:Y28)-1),\"\")","v":""},{"$f":"IF(OFFSET(DE108_23B!$Z$19,ROWS($Z$19:Z28)-1,COLUMNS($Z$19:Z28)-1)<>\"\",OFFSET(DE108_23B!$Z$19,ROWS($Z$19:Z28)-1,COLUMNS($Z$19:Z28)-1),\"\")","v":""},{"$f":"IF(OFFSET(DE108_23B!$AA$19,ROWS($AA$19:AA28)-1,COLUMNS($AA$19:AA28)-1)<>\"\",OFFSET(DE108_23B!$AA$19,ROWS($AA$19:AA28)-1,COLUMNS($AA$19:AA28)-1),\"\")","v":""},{"$f":"IF(OFFSET(DE108_23B!$AB$19,ROWS($AB$19:AB28)-1,COLUMNS($AB$19:AB28)-1)<>\"\",OFFSET(DE108_23B!$AB$19,ROWS($AB$19:AB28)-1,COLUMNS($AB$19:AB28)-1),\"\")","v":""},{"$f":"IF(OFFSET(DE108_23B!$AC$19,ROWS($AC$19:AC28)-1,COLUMNS($AC$19:AC28)-1)<>\"\",OFFSET(DE108_23B!$AC$19,ROWS($AC$19:AC28)-1,COLUMNS($AC$19:AC28)-1),\"\")","v":""},{"$f":"IF(OFFSET(DE108_23B!$AD$19,ROWS($AD$19:AD28)-1,COLUMNS($AD$19:AD28)-1)<>\"\",OFFSET(DE108_23B!$AD$19,ROWS($AD$19:AD28)-1,COLUMNS($AD$19:AD28)-1),\"\")","v":""},{"$f":"IF(OFFSET(DE108_23B!$AE$19,ROWS($AE$19:AE28)-1,COLUMNS($AE$19:AE28)-1)<>\"\",OFFSET(DE108_23B!$AE$19,ROWS($AE$19:AE28)-1,COLUMNS($AE$19:AE28)-1),\"\")","v":""},{"$f":"IF(OFFSET(DE108_23B!$AF$19,ROWS($AF$19:AF28)-1,COLUMNS($AF$19:AF28)-1)<>\"\",OFFSET(DE108_23B!$AF$19,ROWS($AF$19:AF28)-1,COLUMNS($AF$19:AF28)-1),\"\")","v":""},{"$f":"IF(OFFSET(DE108_23B!$AG$19,ROWS($AG$19:AG28)-1,COLUMNS($AG$19:AG28)-1)<>\"\",OFFSET(DE108_23B!$AG$19,ROWS($AG$19:AG28)-1,COLUMNS($AG$19:AG28)-1),\"\")","v":""},{"$f":"IF(OFFSET(DE108_23B!$AH$19,ROWS($AH$19:AH28)-1,COLUMNS($AH$19:AH28)-1)<>\"\",OFFSET(DE108_23B!$AH$19,ROWS($AH$19:AH28)-1,COLUMNS($AH$19:AH28)-1),\"\")","v":""},{"$f":"IF(OFFSET(DE108_23B!$AI$19,ROWS($AI$19:AI28)-1,COLUMNS($AI$19:AI28)-1)<>\"\",OFFSET(DE108_23B!$AI$19,ROWS($AI$19:AI28)-1,COLUMNS($AI$19:AI28)-1),\"\")","v":""},{"$f":"IF(OFFSET(DE108_23B!$AJ$19,ROWS($AJ$19:AJ28)-1,COLUMNS($AJ$19:AJ28)-1)<>\"\",OFFSET(DE108_23B!$AJ$19,ROWS($AJ$19:AJ28)-1,COLUMNS($AJ$19:AJ28)-1),\"\")","v":""},{"$f":"IF(OFFSET(DE108_23B!$AK$19,ROWS($AK$19:AK28)-1,COLUMNS($AK$19:AK28)-1)<>\"\",OFFSET(DE108_23B!$AK$19,ROWS($AK$19:AK28)-1,COLUMNS($AK$19:AK28)-1),\"\")","v":""},{"$f":"IF(OFFSET(DE108_23B!$AL$19,ROWS($AL$19:AL28)-1,COLUMNS($AL$19:AL28)-1)<>\"\",OFFSET(DE108_23B!$AL$19,ROWS($AL$19:AL28)-1,COLUMNS($AL$19:AL28)-1),\"\")","v":""},{"$f":"IF(OFFSET(DE108_23B!$AM$19,ROWS($AM$19:AM28)-1,COLUMNS($AM$19:AM28)-1)<>\"\",OFFSET(DE108_23B!$AM$19,ROWS($AM$19:AM28)-1,COLUMNS($AM$19:AM28)-1),\"\")","v":""},{"$f":"IF(OFFSET(DE108_23B!$AN$19,ROWS($AN$19:AN28)-1,COLUMNS($AN$19:AN28)-1)<>\"\",OFFSET(DE108_23B!$AN$19,ROWS($AN$19:AN28)-1,COLUMNS($AN$19:AN28)-1),\"\")","v":""},{"$f":"IF(OFFSET(DE108_23B!$AO$19,ROWS($AO$19:AO28)-1,COLUMNS($AO$19:AO28)-1)<>\"\",OFFSET(DE108_23B!$AO$19,ROWS($AO$19:AO28)-1,COLUMNS($AO$19:AO28)-1),\"\")","v":""},{"$f":"IF(OFFSET(DE108_23B!$AP$19,ROWS($AP$19:AP28)-1,COLUMNS($AP$19:AP28)-1)<>\"\",OFFSET(DE108_23B!$AP$19,ROWS($AP$19:AP28)-1,COLUMNS($AP$19:AP28)-1),\"\")","v":""},{"$f":"IF(OFFSET(DE108_23B!$AQ$19,ROWS($AQ$19:AQ28)-1,COLUMNS($AQ$19:AQ28)-1)<>\"\",OFFSET(DE108_23B!$AQ$19,ROWS($AQ$19:AQ28)-1,COLUMNS($AQ$19:AQ28)-1),\"\")","v":""},{"$f":"IF(OFFSET(DE108_23B!$AR$19,ROWS($AR$19:AR28)-1,COLUMNS($AR$19:AR28)-1)<>\"\",OFFSET(DE108_23B!$AR$19,ROWS($AR$19:AR28)-1,COLUMNS($AR$19:AR28)-1),\"\")","v":""},{"$f":"IF(OFFSET(DE108_23B!$AS$19,ROWS($AS$19:AS28)-1,COLUMNS($AS$19:AS28)-1)<>\"\",OFFSET(DE108_23B!$AS$19,ROWS($AS$19:AS28)-1,COLUMNS($AS$19:AS28)-1),\"\")","v":""},{"$f":"IF(OFFSET(DE108_23B!$AT$19,ROWS($AT$19:AT28)-1,COLUMNS($AT$19:AT28)-1)<>\"\",OFFSET(DE108_23B!$AT$19,ROWS($AT$19:AT28)-1,COLUMNS($AT$19:AT28)-1),\"\")","v":""},{"$f":"IF(OFFSET(DE108_23B!$AU$19,ROWS($AU$19:AU28)-1,COLUMNS($AU$19:AU28)-1)<>\"\",OFFSET(DE108_23B!$AU$19,ROWS($AU$19:AU28)-1,COLUMNS($AU$19:AU28)-1),\"\")","v":""},{"$f":"IF(OFFSET(DE108_23B!$AV$19,ROWS($AV$19:AV28)-1,COLUMNS($AV$19:AV28)-1)<>\"\",OFFSET(DE108_23B!$AV$19,ROWS($AV$19:AV28)-1,COLUMNS($AV$19:AV28)-1),\"\")","v":""},{"$f":"IF(OFFSET(DE108_23B!$AW$19,ROWS($AW$19:AW28)-1,COLUMNS($AW$19:AW28)-1)<>\"\",OFFSET(DE108_23B!$AW$19,ROWS($AW$19:AW28)-1,COLUMNS($AW$19:AW28)-1),\"\")","v":""},{"$f":"IF(OFFSET(DE108_23B!$AX$19,ROWS($AX$19:AX28)-1,COLUMNS($AX$19:AX28)-1)<>\"\",OFFSET(DE108_23B!$AX$19,ROWS($AX$19:AX28)-1,COLUMNS($AX$19:AX28)-1),\"\")","v":""},{"$f":"IF(OFFSET(DE108_23B!$AY$19,ROWS($AY$19:AY28)-1,COLUMNS($AY$19:AY28)-1)<>\"\",OFFSET(DE108_23B!$AY$19,ROWS($AY$19:AY28)-1,COLUMNS($AY$19:AY28)-1),\"\")","v":""}]
[{"$f":"IF(OFFSET(DE108_23B!$C$19,ROWS($C$19:C29)-1,COLUMNS($C$19:C29)-1)<>\"\",OFFSET(DE108_23B!$C$19,ROWS($C$19:C29)-1,COLUMNS($C$19:C29)-1),\"\")","v":""}]

{"sheet":"108_26A","index":8,"n_rows":0,"n_cols":0,"rows_kept":0,"cut":false,"hidden":false,"merged":[]}

{"sheet":"111_01","index":9,"n_rows":18,"n_cols":2,"rows_kept":18,"cut":false,"hidden":false,"merged":[[0,0,0,1],[1,0,1,1],[2,0,4,1],[5,0,9,1],[10,0,11,0],[10,1,11,1]]}
["111-01"]
["2012-04-17"]
["COORDINATED OPERATIONS"]
[]
[]
["Other work in progress during the same period of time will include the construction of the projects listed. Coordinate operations with those of other contractors working within the same area. "]
[]
[]
[]
[]
["Project","Type of Work"]
[]
[{"$f":"IF(OFFSET(DE111_01!$C$26,ROWS($C$26:C26)-1,COLUMNS($C$26:C26)-1)<>\"\",OFFSET(DE111_01!$C$26,ROWS($C$26:C26)-1,COLUMNS($C$26:C26)-1),\"\")","v":"NONE"},{"$f":"IF(OFFSET(DE111_01!$D$26,ROWS($D$26:D26)-1,COLUMNS($D$26:D26)-1)<>\"\",OFFSET(DE111_01!$D$26,ROWS($D$26:D26)-1,COLUMNS($D$26:D26)-1),\"\")","v":""}]
[{"$f":"IF(OFFSET(DE111_01!$C$26,ROWS($C$26:C27)-1,COLUMNS($C$26:C27)-1)<>\"\",OFFSET(DE111_01!$C$26,ROWS($C$26:C27)-1,COLUMNS($C$26:C27)-1),\"\")","v":""},{"$f":"IF(OFFSET(DE111_01!$D$26,ROWS($D$26:D27)-1,COLUMNS($D$26:D27)-1)<>\"\",OFFSET(DE111_01!$D$26,ROWS($D$26:D27)-1,COLUMNS($D$26:D27)-1),\"\")","v":""}]
[{"$f":"IF(OFFSET(DE111_01!$C$26,ROWS($C$26:C28)-1,COLUMNS($C$26:C28)-1)<>\"\",OFFSET(DE111_01!$C$26,ROWS($C$26:C28)-1,COLUMNS($C$26:C28)-1),\"\")","v":""},{"$f":"IF(OFFSET(DE111_01!$D$26,ROWS($D$26:D28)-1,COLUMNS($D$26:D28)-1)<>\"\",OFFSET(DE111_01!$D$26,ROWS($D$26:D28)-1,COLUMNS($D$26:D28)-1),\"\")","v":""}]
[{"$f":"IF(OFFSET(DE111_01!$C$26,ROWS($C$26:C29)-1,COLUMNS($C$26:C29)-1)<>\"\",OFFSET(DE111_01!$C$26,ROWS($C$26:C29)-1,COLUMNS($C$26:C29)-1),\"\")","v":""},{"$f":"IF(OFFSET(DE111_01!$D$26,ROWS($D$26:D29)-1,COLUMNS($D$26:D29)-1)<>\"\",OFFSET(DE111_01!$D$26,ROWS($D$26:D29)-1,COLUMNS($D$26:D29)-1),\"\")","v":""}]
[{"$f":"IF(OFFSET(DE111_01!$C$26,ROWS($C$26:C30)-1,COLUMNS($C$26:C30)-1)<>\"\",OFFSET(DE111_01!$C$26,ROWS($C$26:C30)-1,COLUMNS($C$26:C30)-1),\"\")","v":""},{"$f":"IF(OFFSET(DE111_01!$D$26,ROWS($D$26:D30)-1,COLUMNS($D$26:D30)-1)<>\"\",OFFSET(DE111_01!$D$26,ROWS($D$26:D30)-1,COLUMNS($D$26:D30)-1),\"\")","v":""}]
[{"$f":"IF(OFFSET(DE111_01!$C$26,ROWS($C$26:C31)-1,COLUMNS($C$26:C31)-1)<>\"\",OFFSET(DE111_01!$C$26,ROWS($C$26:C31)-1,COLUMNS($C$26:C31)-1),\"\")","v":""},{"$f":"IF(OFFSET(DE111_01!$D$26,ROWS($D$26:D31)-1,COLUMNS($D$26:D31)-1)<>\"\",OFFSET(DE111_01!$D$26,ROWS($D$26:D31)-1,COLUMNS($D$26:D31)-1),\"\")","v":""}]

{"sheet":"PrintSheetTemplate","index":10,"n_rows":95,"n_cols":179,"rows_kept":95,"cut":false,"hidden":true,"merged":[[93,171,93,178],[94,1,94,178],[93,101,93,106],[93,107,93,118],[93,119,93,148],[93,149,93,158],[93,159,93,164],[93,165,93,170],[93,1,93,7],[93,8,93,14],[93,15,93,21],[93,22,93,30],[93,31,93,64],[93,65,93,100]]}
[" "]
[]
[]
[]
[]
[]
[]
[]
[]
[]
[]
[]
[]
[]
[]
[]
[]
[]
[]
[]
[]
[]
[]
[]
[]
[]
[]
[]
[]
[]
[]
[]
[]
[]
[]
[]
[]
[]
[]
[]
[]
[]
[]
[]
[]
[]
[]
[]
[]
[]
[]
[]
[]
[]
[]
[]
[]
[]
[]
[]
[]
[]
[]
[]
[]
[]
[]
[]
[]
[]
[]
[]
[]
[]
[]
[]
[]
[]
[]
[]
[]
[]
[]
[]
[]
[]
[]
[]
[]
[]
[]
[]
[null,"","","","","","","","","","","","","","","","","","","","","","","","","","","","","","","","","","","","","","","","","","","","","","","","","","","","","","","","","","","","","","","","","","","","","","","","","","","","","","","","","","","","","","","","","","","","","","","","","","","","","","","","","","","","","","","","","","","","","","","","","","","","","","","","","","","","","","","","","","","","","","","","","","","","","","","",null,"","","","","","","","","","","","","","","","","","","","","","","","","",""]
[null,"FILE NO.",null,null,null,null,null,null,{"$f":"IF(ProjectInformation!$B$11<>\"\",ProjectInformation!$B$11,\"\")","v":""},null,null,null,null,null,null,{"$f":"UPPER(ProjectInformation!$B$8)","v":"ENGLISH"},null,null,null,null,null,null,"DESIGN TEAM",null,null,null,null,null,null,null,null,{"$f":"IF(AND(ProjectInformation!$B$3<>\"\",ProjectInformation!$B$4<>\"\",ProjectInformation!$B$5<>\"\"),ProjectInformation!$B$3&\"\\\"&ProjectInformation!$B$4&\"\\\"&ProjectInformation!$B$5,IF(AND(ProjectInformation!$B$3<>\"\",ProjectInformation!$B$4<>\"\"),ProjectInformation!$B$3&\"\\\"&ProjectInformation!$B$4,IF(ProjectInformation!$B$3<>\"\",ProjectInformation!$B$3,\"\")))","v":"WHKS & Co."},null,null,null,null,null,null,null,null,null,null,null,null,null,null,null,null,null,null,null,null,null,null,null,null,null,null,null,null,null,null,null,null,null,{"$f":"IF(ProjectInformation!$B$6<>\"\",ProjectInformation!$B$6,\"\")","v":"CLINTON"},null,null,null,null,null,null,null,null,null,null,null,null,null,null,null,null,null,null,null,null,null,null,null,null,null,null,null,null,null,null,null,null,null,null,null,"COUNTY",null,null,null,null,null,"PROJECT NUMBER",null,null,null,null,null,null,null,null,null,null,null,{"$f":"IF(ProjectInformation!$B$7<>\"\",ProjectInformation!$B$7,\"\")","v":"STPN-136-1(73)--2J-23"},null,null,null,null,null,null,null,null,null,null,null,null,null,null,null,null,null,null,null,null,null,null,null,null,null,null,null,null,null,"SHEET NUMBER",null,null,null,null,null,null,null,null,null,null,null,null,null,null,null,{"$f":"IF(FP94<>\"\",\"REVISED\",\"\")","v":""},null,null,null,null,null,{"$f":"IF(ProjectInformation!$B$9<>\"\",ProjectInformation!$B$9,\"\")","v":""}]
[""]

{"sheet":"Note1","index":11,"n_rows":1,"n_cols":1,"rows_kept":1,"cut":false,"hidden":true,"merged":[[0,0,2,0]]}
["SEE V SHEETS FOR ADDITIONAL BID ITEMS AND QUANTITIES"]

{"sheet":"BridgeBlock","index":12,"n_rows":4,"n_cols":14,"rows_kept":4,"cut":false,"hidden":true,"merged":[[2,2,2,8],[3,2,3,7],[2,9,2,12],[3,8,3,12]]}
[2]
[null,"","","","","","","","","","","","",""]
[null,null,"Design No.",null,null,null,null,null,null,{"$f":"IF(#REF!<>\"\",#REF!,\"\")","v":{"$error":"#REF!"}}]
[null,null,"File No.",null,null,null,null,null,{"$f":"IF(#REF!<>\"\",#REF!,\"\")","v":{"$error":"#REF!"}}]

{"sheet":"Index","index":13,"n_rows":164,"n_cols":17,"rows_kept":164,"cut":false,"hidden":true,"merged":[]}
["100-0A","1997-10-28","4.5.5","ADAIR",null,"Live English File Path","H:\\IDOT\\V8i\\ExcelTabs\\",null,"Brian R. Smith","bsmith2","Methods","ROADWAY DESIGN",null,"108_23A(1)","='108_23A'!$A$1:$A$52",null,"A_DE111Series.xlsm"]
["100-1A","1997-07-15","10/01/15","ADAMS",null,"Live Metric File Path","W:\\Highway\\Design\\RoadDesignDetails\\ExcelTabs\\MetricTabs\\",null,"Khyle B. Clute","kclute","Methods","ROADWAY DESIGN",null,"111_01(1)","='111_01'!$A$1:$B$18",null,"C_DE100Series.xlsm"]
["100-1C","2012-04-17","J","ALLAMAKEE",null,"Index File Path","H:\\IDOT\\V8i\\ExcelIndexes\\",null,"Thomas M. Hamski","thamski","Methods","ROADWAY DESIGN",null,"108_23B(1)","='108_23B'!$A$1:$AW$15",null,"C_DE102Series.xlsm"]
["100-1D","2005-10-18",null,"APPANOOSE",null,"Index File Name","TNT_EnglishIndexes.xlsx",null,"Wesley L. Mayberry","wmayber","Methods","ROADWAY DESIGN",null,null,null,null,"C_DE103Series.xlsm"]
["100-4A","2002-10-29",null,"AUDUBON",null,"Last Revision English File Path","H:\\IDOT\\V8i\\ExcelTabs\\Last_Revision\\",null,"John M. Narigon","jnarigo","Methods","ROADWAY DESIGN",null,null,null,null,"C_DE104Series.xlsm"]
["100-7","2012-10-16",null,"BENTON",null,"Last Revision Metric File Path","W:\\Highway\\Design\\RoadDesignDetails\\Old_Details\\ExcelTabs\\MetricTabs\\",null,"Christopher Poole","cpoole","Methods","ROADWAY DESIGN",null,null,null,null,"C_DE105Series.xlsm"]
["100-10","2011-10-18",null,"BLACK HAWK",null,"Seed Path","W:\\Highway\\Design\\CADD\\SpreadSheets\\ExcelTabulations.xltm",null,"Daniel J. Harness","dharnes","Methods","ROADWAY DESIGN",null,null,null,null,"C_DE106Series.xlsm"]
["100-11","2008-08-01",null,"BOONE",null,"VersionCheck Path","H:\\IDOT\\V8i\\Entire\\seed_files\\SpreadSheets\\ExcelTabulations.xlsm",null,"R.D. Skogerboe","dskoger","Road1","ROADWAY DESIGN",null,null,null,null,"C_DE107Series.xlsm"]
["100-12","2008-08-01",null,"BREMER",null,"Standard Road Plan Path","H:\\IDOT\\V8i\\ExcelIndexes\\SRP_EnglishIndex.xls",null,"Jason R. Strum","jstrum","Road1","ROADWAY DESIGN",null,null,null,null,"C_DE108Series.xlsm"]
["100-12A","2008-08-01",null,"BUCHANAN",null,"Last Revision Standard Road Plan Path","H:\\IDOT\\V8i\\ExcelIndexes\\SRP_Revisions\\April_2015\\SRP_EnglishIndex.xls",null,"Robert A. Schoenrock","rschoen","Road1","ROADWAY DESIGN",null,null,null,null,"C_DE110Series.xlsm"]
["100-13","2010-04-20",null,"BUENA VISTA",null,"AddIn Path","H:\\IDOT\\V8i\\Entire\\seed_files\\SpreadSheets\\ExcelTabulations.xlam",null,"Stacy M. Ryan","sryan","Road1","ROADWAY DESIGN",null,null,null,null,"C_DE111Series.xlsm"]
["100-14","2010-04-20",null,"BUTLER",null,"Old Files Path","H:\\IDOT\\V8i\\ExcelIndexes\\SRP_Revisions\\April_2015\\",null,"Nathan A. Thede","nthede","Road1","ROADWAY DESIGN",null,null,null,null,"C_DE112Series.xlsm"]
["100-15","2010-04-20",null,"CALHOUN",null,null,null,null,"Yanxiao Jia","yjia","Road2","ROADWAY DESIGN",null,null,null,null,"C_DE113Series.xlsm"]
["100-16","2010-10-19",null,"CARROLL",null,null,null,null,"Ryan R. Miller","rmille3","Road2","ROADWAY DESIGN",null,null,null,null,"C_DE190Series.xlsm"]
["100-17","2010-04-20",null,"CASS",null,null,null,null,"Jason M. Holst","jholst","Road2","ROADWAY DESIGN",null,null,null,null,"C_DE192Series.xlsm"]
["100-18","2010-04-20",null,"CEDAR",null,null,null,null,"Dustin T. Skogerboe","dskoge2","Road2","ROADWAY DESIGN",null,null,null,null,"C_DE231Series.xlsm"]
["100-19","2012-10-16",null,"CERRO GORDO",null,null,null,null,"Dung T. Ta","dta","Road2","ROADWAY DESIGN",null,null,null,null,"C_DE232Series.xlsm"]
["100-20","2008-08-01",null,"CHEROKEE",null,null,null,null,"Paul W. Flattery","pflatte","Road3","ROADWAY DESIGN",null,null,null,null,"C_DE252Series.xlsm"]
["100-21","2008-08-01",null,"CHICKASAW",null,null,null,null,"Kelly C. Bell","kbell","Road3","ROADWAY DESIGN",null,null,null,null,"C_DE253Series.xlsm"]
["100-22","2008-08-01",null,"CLARKE",null,null,null,null,"Angela K. Johnson","ajohns1","Road3","ROADWAY DESIGN",null,null,null,null,"C_DE254Series.xlsm"]
["100-23","2010-10-19",null,"CLAY",null,null,null,null,"Elijah D. Gansen","egansen","Road3","ROADWAY DESIGN",null,null,null,null,"C_DE259Series.xlsm"]
["100-24","2013-04-16",null,"CLAYTON",null,null,null,null,"James R. Schoenrock","jschoen","Consultant","ROADWAY DESIGN",null,null,null,null,"C_DE262Series.xlsm"]
["100-26","2008-08-01",null,"CLINTON",null,null,null,null,"Randall E. Schlei","rschlie","Consultant","ROADWAY DESIGN",null,null,null,null,"C_DE271Series.xlsm"]
["100-27","2009-10-20",null,"CRAWFORD",null,null,null,null,"Mark D. Mastellar","mmastel","Roadside","ROADWAY DESIGN",null,null,null,null,"C_DE281Series.xlsm"]
["100-28","2010-10-19",null,"DALLAS",null,null,null,null,"Robert L. Stanley","rstanle","Soils","GEOTECHNICAL DESIGN",null,null,null,null,"C_DE282Series.xlsm"]
["101-4","2002-04-30",null,"DAVIS",null,null,null,null,"Stephen J. Megivern","smegive","Soils","GEOTECHNICAL DESIGN",null,null,null,null,"C_DE290Series.xlsm"]
["101-5","2002-04-30",null,"DECATUR",null,null,null,null,"Mark A. Dell","mdell","Soils","GEOTECHNICAL DESIGN",null,null,null,null,"G_DE101Series.xlsm"]
["101-6","2002-04-30",null,"DELAWARE",null,null,null,null,"David R. Claman","dclaman","Bridge","HYDRAULIC DESIGN",null,null,null,null,"J_DE108Series.xlsm"]
["101-7","2002-04-30",null,"DES MOINES",null,null,null,null,"Zachary K. Abrams","zabrams","TrafficAndSafety","ROADWAY DESIGN",null,null,null,null,"J_DE111Series.xlsm"]
["101-8","2013-04-16",null,"DICKINSON",null,null,null,null,null,null,null,null,null,null,null,null,"J_DE113Series.xlsm"]
["101-13","2004-04-20",null,"DUBUQUE",null,null,null,null,null,null,null,null,null,null,null,null,"S_DE113Series.xlsm"]
["101-16","2009-10-20",null,"EMMET",null,null,null,null,null,null,null,null,null,null,null,null,"R_DE100Series.xlsm"]
["101-17","2011-04-19",null,"FAYETTE",null,null,null,null,null,null,null,null,null,null,null,null,"R_DE105Series.xlsm"]
["101-18","2011-04-19",null,"FLOYD",null,null,null,null,null,null,null,null,null,null,null,null,"R_DE110Series.xlsm"]
["102-3","2013-04-16",null,"FRANKLIN",null,null,null,null,null,null,null,null,null,null,null,null,"R_DE111Series.xlsm"]
["102-4","2011-10-18",null,"FREMONT",null,null,null,null,null,null,null,null,null,null,null,null,"R_DE231Series.xlsm"]
["102-5","2012-10-16",null,"GREENE",null,null,null,null,null,null,null,null,null,null,null,null,"R_DE232Series.xlsm"]
["102-5A","2008-08-01",null,"GRUNDY",null,null,null,null,null,null,null,null,null,null,null,null,"R_DE262Series.xlsm"]
["102-6C","2011-10-18",null,"GUTHRIE",null,null,null,null,null,null,null,null,null,null,null,null,"R_DE281Series.xlsm"]
["102-10","2008-08-01",null,"HAMILTON",null,null,null,null,null,null,null,null,null,null,null,null,"R_DE282Series.xlsm"]
["102-11","2008-08-01",null,"HANCOCK"]
["102-12","2008-08-01",null,"HARDIN"]
["102-14","2012-04-17",null,"HARRISON"]
["102-15","2008-08-01",null,"HENRY"]
["103-1","2010-10-19",null,"HOWARD"]
["103-3","2012-10-16",null,"HUMBOLDT"]
["103-4","2011-04-19",null,"IDA"]
["103-5","2008-08-01",null,"IOWA"]
["103-6","2011-04-19",null,"JACKSON"]
["103-7","2008-08-01",null,"JASPER"]
["104-3","2012-10-16",null,"JEFFERSON"]
["104-4","2009-10-20",null,"JOHNSON"]
["104-5A","2011-10-18",null,"JONES"]
["104-5B","2011-10-18",null,"KEOKUK"]
["104-5C","2012-04-17",null,"KOSSUTH"]
["104-8","2008-08-01",null,"LEE"]
["104-8A","2010-04-20",null,"LINN"]
["104-9","2012-04-17",null,"LOUISA"]
["104-10","2008-08-01",null,"LUCAS"]
["104-11","2008-08-01",null,"LYON"]
["104-12","2012-10-16",null,"MADISON"]
["104-13","2013-04-16",null,"MAHASKA"]
["105-1","1994-09-27",null,"MARION"]
["105-3","2005-10-18",null,"MARSHALL"]
["105-4","2011-10-18",null,"MILLS"]
["106-1","2008-08-01",null,"MITCHELL"]
["106-2","2008-08-01",null,"MONONA"]
["106-3","2008-08-01",null,"MONROE"]
["106-4","2013-04-16",null,"MONTGOMERY"]
["106-5","2008-08-01",null,"MUSCATINE"]
["106-7","2008-08-01",null,"O'BRIEN"]
["106-8","2011-04-19",null,"OSCEOLA"]
["107-7","2008-08-01",null,"PAGE"]
["107-22","2013-04-16",null,"PALO ALTO"]
["107-23","2011-10-18",null,"PLYMOUTH"]
["107-24","2008-08-01",null,"POCAHONTAS"]
["107-25","2008-08-01",null,"POLK"]
["107-29","2012-04-17",null,"POTTAWATTAMIE"]
["107-30","2012-04-17",null,"POWESHIEK"]
["107-31","2011-04-19",null,"RINGGOLD"]
["108-1","2008-08-01",null,"SAC"]
["108-2","2008-08-01",null,"SCOTT"]
["108-2A","2008-08-01",null,"SHELBY"]
["108-8A","2010-10-19",null,"SIOUX"]
["108-8B","2011-10-18",null,"STORY"]
["108-8C","2011-10-18",null,"TAMA"]
["108-8D","2010-10-19",null,"TAYLOR"]
["108-9A","2010-04-20",null,"UNION"]
["108-11A","2008-08-01",null,"VAN BUREN"]
["108-12","2008-08-01",null,"WAPELLO"]
["108-13A","2008-08-01",null,"WARREN"]
["108-15","2008-08-01",null,"WASHINGTON"]
["108-16","2010-10-19",null,"WAYNE"]
["108-18","2011-10-18",null,"WEBSTER"]
["108-18B","2012-10-16",null,"WINNEBAGO"]
["108-22","2013-04-16",null,"WINNESHIEK"]
["108-23A","2008-08-01",null,"WOODBURY"]
["108-24","2011-04-19",null,"WORTH"]
["108-26A","2008-08-01",null,"WRIGHT"]
["108-27","2012-10-16"]
["108-28","2008-08-01"]
["108-29","2012-10-16"]
["108-30","2013-04-16"]
["108-33","2013-04-16"]
["108-34","2010-10-19"]
["108-35","2012-04-17"]
["110-1","2013-04-16"]
["110-2","2013-04-16"]
["110-3","2008-08-01"]
["110-4","2008-08-01"]
["110-5","2008-08-01"]
["110-6","2008-08-01"]
["110-7A","2012-04-17"]
["110-7B","2010-10-19"]
["110-8","2008-08-01"]
["110-9","2011-10-18"]
["110-10","2008-08-01"]
["110-11","2008-08-01"]
["110-12A","2013-04-16"]
["110-13","2010-04-20"]
["110-14","2013-04-16"]
["110-15","2013-04-16"]
["110-16","2013-04-16"]
["111-1","2012-04-17"]
["111-2","1989-02-28"]
["111-23","2002-10-29"]
["111-25","2011-10-18"]
["112-3","2013-04-16"]
["112-5","2008-08-01"]
["112-6","2013-04-16"]
["112-7","2010-10-19"]
["112-8","2012-10-16"]
["112-9","2012-04-17"]
["112-10","2011-04-19"]
["113-1","2013-04-16"]
["113-2","2013-04-16"]
["113-3","2011-10-18"]
["113-10","2012-10-16"]
["213-2","2011-10-18"]
["213-3","2011-10-18"]
["231-1","2011-10-18"]
["231-2","2012-10-16"]
["232-3A","2012-10-16"]
["232-3B","2012-10-16"]
["232-3C","2012-10-16"]
["232-3D","2012-10-16"]
["232-4","2011-10-18"]
["232-6","2011-10-18"]
["232-7","2012-10-16"]
["232-9","2011-10-18"]
["232-11","2012-10-16"]
["241-5","2011-10-18"]
["252-1","2012-10-16"]
["253-1","2011-10-18"]
["254-1","2001-10-02"]
["262-3","2012-10-16"]
["262-4","2013-04-16"]
["262-5","2005-10-18"]
["262-6","2005-10-18"]
["263-1","2011-10-18"]
["271-1","2011-10-18"]
["271-2","1985-08-20"]
["271-4","2011-10-18"]
["271-9","1994-09-27"]