{"text_format":"1","workbook":"xlsx","n_sheets":8,"sheets":["ProjectInformation","PrintSheets","DE110_2","110_2","PrintSheetTemplate","Note1","BridgeBlock","Index"],"not_rendered":{"charts":0,"images":4,"macros":1,"external_links":0,"defined_names":8,"comments":0,"pivot_tables":0},"unopened":[],"bounds":{"document_bytes":16777216,"sheet_cells":100000,"rows_first":2000,"rows_last":500,"rows_between":2000,"halvings":0,"cell_chars":16384,"cell_head_chars":4096},"cells_cut":0,"cells_raw":0,"read":"whole","date_system":"1900"}

{"sheet":"ProjectInformation","index":0,"n_rows":11,"n_cols":2,"rows_kept":11,"cut":false,"hidden":false,"merged":[[0,0,0,1],[1,0,1,1],[9,0,9,1],[3,0,4,0]]}
["CPN DATA"]
["INFORMATION ADDED BY DESIGNER"]
["Section Engineer","Flattery"]
["Design Team","Johnson"]
[]
["County","TAMA"]
["Project Number","NHSX-030-6(189)--3H-86"]
["English or Metric","ENGLISH"]
["Revised"]
["Bridge Block"]
["File No."]

{"sheet":"PrintSheets","index":1,"n_rows":95,"n_cols":179,"rows_kept":95,"cut":false,"hidden":false,"merged":[[93,171,93,178],[94,1,94,178],[93,101,93,106],[93,107,93,118],[93,119,93,148],[93,149,93,158],[93,159,93,164],[93,165,93,170],[93,1,93,7],[93,8,93,14],[93,15,93,21],[93,22,93,30],[93,31,93,64],[93,65,93,100]]}
[" "]
[]
[]
[]
[]
[]
[]
[]
[]
[]
[]
[]
[]
[]
[]
[]
[]
[]
[]
[]
[]
[]
[]
[]
[]
[]
[]
[]
[]
[]
[]
[]
[]
[]
[]
[]
[]
[]
[]
[]
[]
[]
[]
[]
[]
[]
[]
[]
[]
[]
[]
[]
[]
[]
[]
[]
[]
[]
[]
[]
[]
[]
[]
[]
[]
[]
[]
[]
[]
[]
[]
[]
[]
[]
[]
[]
[]
[]
[]
[]
[]
[]
[]
[]
[]
[]
[]
[]
[]
[]
[]
[]
[null,"","","","","","","","","","","","","","","","","","","","","","","","","","","","","","","","","","","","","","","","","","","","","","","","","","","","","","","","","","","","","","","","","","","","","","","","","","","","","","","","","","","","","","","","","","","","","","","","","","","","","","","","","","","","","","","","","","","","","","","","","","","","","","","","","","","","","","","","","","","","","","","","","","","","","","","",null,"","","","","","","","","","","","","","","","","","","","","","","","","",""]
[null,"FILE NO.",null,null,null,null,null,null,{"$f":"IF(ProjectInformation!$B$11<>\"\",ProjectInformation!$B$11,\"\")","v":""},null,null,null,null,null,null,{"$f":"UPPER(ProjectInformation!B8)","v":"ENGLISH"},null,null,null,null,null,null,"DESIGN TEAM",null,null,null,null,null,null,null,null,{"$f":"IF(AND(ProjectInformation!$B$3<>\"\",ProjectInformation!$B$4<>\"\",ProjectInformation!$B$5<>\"\"),ProjectInformation!$B$3&\"\\\"&ProjectInformation!$B$4&\"\\\"&ProjectInformation!$B$5,IF(AND(ProjectInformation!$B$3<>\"\",ProjectInformation!$B$4<>\"\"),ProjectInformation!$B$3&\"\\\"&ProjectInformation!$B$4,IF(ProjectInformation!$B$3<>\"\",ProjectInformation!$B$3,\"\")))","v":"Flattery\\Johnson"},null,null,null,null,null,null,null,null,null,null,null,null,null,null,null,null,null,null,null,null,null,null,null,null,null,null,null,null,null,null,null,null,null,{"$f":"IF(ProjectInformation!$B$6<>\"\",ProjectInformation!$B$6,\"\")","v":"TAMA"},null,null,null,null,null,null,null,null,null,null,null,null,null,null,null,null,null,null,null,null,null,null,null,null,null,null,null,null,null,null,null,null,null,null,null,"COUNTY",null,null,null,null,null,"PROJECT NUMBER",null,null,null,null,null,null,null,null,null,null,null,{"$f":"IF(ProjectInformation!$B$7<>\"\",ProjectInformation!$B$7,\"\")","v":"NHSX-030-6(189)--3H-86"},null,null,null,null,null,null,null,null,null,null,null,null,null,null,null,null,null,null,null,null,null,null,null,null,null,null,null,null,null,"SHEET NUMBER",null,null,null,null,null,null,null,null,null,"C.13",null,null,null,null,null,{"$f":"IF(FP94<>\"\",\"REVISED\",\"\")","v":""},null,null,null,null,null,{"$f":"IF(ProjectInformation!$B$9<>\"\",ProjectInformation!$B$9,\"\")","v":""}]
["","2/21/2018     2:26:22 PM     ajohns1     c:\\pw_work\\pwmain\\ajohns1\\d0569206\\86030189_C03_Tab110-2.xlsm"]

{"sheet":"DE110_2","index":2,"n_rows":46,"n_cols":9,"rows_kept":46,"cut":false,"hidden":false,"merged":[[14,2,16,4],[14,6,14,8],[15,6,15,8],[16,6,17,8],[17,2,17,4]]}
["TabTitle",{"$f":"C15","v":"REMOVAL OF EXISTING STRUCTURES"}]
["Number of Tab Columns",3]
["DE Starter Row Number",20]
["TabSheet Starter Row Number",6]
["TabSheet Header Row Count",5]
["Top Header Cell","G15"]
["Bottom Header Cell","I19"]
["DESheet Row Count",27]
["Fixed Empty Rows",20]
["Usable Empty Rows",0]
["Total Rows Placed",47,"xlLeft(1)","xlLeft(1)","xlLeft(1)",null,"xlLeft(1)","xlLeft(1)","xlLeft(1)"]
["Total Rows Needed",{"$f":"SUM(B8:B10)","v":47},"General","General","General",null,"General","General","General"]
["Last Tab DE Starter Row",20,{"$f":"CELL(\"width\",C13)","v":30},{"$f":"CELL(\"width\",D13)","v":75},{"$f":"CELL(\"width\",E13)","v":76},null,{"$f":"CELL(\"width\",G13)","v":0},{"$f":"CELL(\"width\",H13)","v":0},{"$f":"CELL(\"width\",I13)","v":0}]
["Last Tab Tabsheet Starter Row",6,"A","B","C",null,{"$f":"LOWER(C14)","v":"a"},{"$f":"LOWER(D14)","v":"b"},{"$f":"LOWER(E14)","v":"c"}]
["Last Copy Starter Row",1,"REMOVAL OF EXISTING STRUCTURES",null,null,null,"110-2"]
["Tab Loop Number",2,null,null,null,null,{"$f":"B17","v":"2013-04-16"}]
["Revision Date","2013-04-16",null,null,null,null,{"$f":"C15","v":"REMOVAL OF EXISTING STRUCTURES"}]
["Tabulation Width",2,{"$f":"\"This Data Entry Sheet fills Tab \"&G15&\" effective \"&TEXT(B17,\"mm-dd-yy\")","v":"This Data Entry Sheet fills Tab 110-2 effective 04-16-13"}]
["Horizontal Grid Lines","Yes","Location","Description","Remarks",null,{"$f":"C19","v":"Location"},{"$f":"D19","v":"Description"},{"$f":"E19","v":"Remarks"}]
[null,null,"338+93.44, 170.16' Rt.","3'x4'x131' RCB","Remove inlet headwall to face of parapet and 6' of barrel."]
[null,null,"384+89.17, 189.97' Rt.","10'x12.5'x107' Conc. Arch Culvert w/10'x12' RCB Extensions","Remove inlet headwall to face of parapet."]
[null,null,"399+09.11, 189.72' Rt.","2'x2'x126' RCB","Remove outlet headwall to face of parapet."]
[null,null,"404+60.49, 183.54' Rt.","2'x2'x196' RCB","Remove outlet headwall to face of parapet."]
[null,null,"427+65.01, 165.26' Rt.","12'x14.25'x163' Conc. Arch Culvert","Remove inlet headwall to face of parapet."]
[null,null,"435+94.10, 160.63' Rt.","3'x4'x187' RCB","Remove inlet headwall to face of parapet."]
[null,null,"453+84.52, 162.69' Rt.","3.7'x5.5'x178' Conc. Arch Culvert w/4'x5'x249' RCB Extensions","Remove inlet headwall and flume."]
[null,null,"459+60.87, 168.59' Rt.","3.7'x5.5'x147' Conc. Arch Culvert w/4'x5'x117' RCB Extensions","Remove inlet headwall and flume."]
[null,null,"475+31.53, 157.92' Rt.","3'x3'x241' RCB","Remove headwalls."]
[null,null,"481+86.54, 156.10' Rt.","10'x12.5'x118' Conc. Arch Culvert","Remove inlet headwall to face of parapet."]
[null,null,"493+95.50, 152.76' Rt.","5'x7'x280' RCB","Remove headwalls."]
[null,null,"497+75.15, 151.70' Rt.","2'x2'x145' RCB","Remove headwalls."]
[null,null,"511+30.61, 147.95' Rt.","4.75'x6'x287' Conc. Arch Culvert","Remove headwalls."]
[null,null,"531+45.64, 134.84' Rt.","4'x4'x189' RCB","Remove headwalls."]
[null,null,"538+86.05, 138.76' Rt.","5.5'x8'x141' Conc. Arch Culvert","Remove headwalls."]
[null,null,"554+57.18, 145.52' Rt.","2'x2'x161' RCB","Remove inlet headwall and flume."]
[null,null,"556+89.66, 146.29' Rt.","2'x2'x216' RCB","Remove headwalls."]
[null,null,"566+82.25, 149.58' Rt.","5'x5'x170' RCB","Remove headwalls."]
[null,null,"577+31.18, 153.06' Rt.","6.25'x9.25'x271' Conc. Arch Culvert","Remove headwalls."]
[null,null,"593+45.94, 158.41' Rt.","3.7'x5.5'x320' Conc. Arch Culvert","Remove headwalls."]
[null,null,"612+43.88, 158.62' Rt.","4.75'x6'x308' Conc. Arch Culvert","Remove headwalls."]
[null,null,"626+42.71, 155.01' Rt.","3.7'x5.5'x281' Conc. Arch Culvert","Remove headwalls."]
[null,null,"654+57.52, 134.34' Rt.","4.75'x6'x196' Conc. Arch Culvert w/5'x6'x66' RCB Extension","Remove headwalls."]
[null,null,"661+02.08, 130.50' Rt.","2'x2'x130' RCB","Remove headwalls."]
[null,null,"664+83.45, 115.98' Rt.","2'x2'x105' RCB w/30\"x18' RCP Extension","Remove outlet headwall."]
[null,null,"668+87.97, 90.61' Rt.","3'x3'x131' RCB w/42\"x59' RCP Extension","Remove outlet headwall."]
[null,null,"671+20.30, 75.69' Rt.","2'x3'x104' RCB w/36\"x71' RCP Extensions","Remove headwalls."]

{"sheet":"110_2","index":3,"n_rows":52,"n_cols":3,"rows_kept":52,"cut":false,"hidden":false,"merged":[[0,0,0,2],[1,0,1,2],[2,0,3,2]]}
["110-2"]
["2013-04-16"]
["REMOVAL OF EXISTING STRUCTURES"]
[]
["Location","Description","Remarks"]
[{"$f":"IF(OFFSET(DE110_2!$C$20,ROWS($C$20:C20)-1,COLUMNS($C$20:C20)-1)<>\"\",OFFSET(DE110_2!$C$20,ROWS($C$20:C20)-1,COLUMNS($C$20:C20)-1),\"\")","v":"338+93.44, 170.16' Rt."},{"$f":"IF(OFFSET(DE110_2!$D$20,ROWS($D$20:D20)-1,COLUMNS($D$20:D20)-1)<>\"\",OFFSET(DE110_2!$D$20,ROWS($D$20:D20)-1,COLUMNS($D$20:D20)-1),\"\")","v":"3'x4'x131' RCB"},{"$f":"IF(OFFSET(DE110_2!$E$20,ROWS($E$20:E20)-1,COLUMNS($E$20:E20)-1)<>\"\",OFFSET(DE110_2!$E$20,ROWS($E$20:E20)-1,COLUMNS($E$20:E20)-1),\"\")","v":"Remove inlet headwall to face of parapet and 6' of barrel."}]
[{"$f":"IF(OFFSET(DE110_2!$C$20,ROWS($C$20:C21)-1,COLUMNS($C$20:C21)-1)<>\"\",OFFSET(DE110_2!$C$20,ROWS($C$20:C21)-1,COLUMNS($C$20:C21)-1),\"\")","v":"384+89.17, 189.97' Rt."},{"$f":"IF(OFFSET(DE110_2!$D$20,ROWS($D$20:D21)-1,COLUMNS($D$20:D21)-1)<>\"\",OFFSET(DE110_2!$D$20,ROWS($D$20:D21)-1,COLUMNS($D$20:D21)-1),\"\")","v":"10'x12.5'x107' Conc. Arch Culvert w/10'x12' RCB Extensions"},{"$f":"IF(OFFSET(DE110_2!$E$20,ROWS($E$20:E21)-1,COLUMNS($E$20:E21)-1)<>\"\",OFFSET(DE110_2!$E$20,ROWS($E$20:E21)-1,COLUMNS($E$20:E21)-1),\"\")","v":"Remove inlet headwall to face of parapet."}]
[{"$f":"IF(OFFSET(DE110_2!$C$20,ROWS($C$20:C22)-1,COLUMNS($C$20:C22)-1)<>\"\",OFFSET(DE110_2!$C$20,ROWS($C$20:C22)-1,COLUMNS($C$20:C22)-1),\"\")","v":"399+09.11, 189.72' Rt."},{"$f":"IF(OFFSET(DE110_2!$D$20,ROWS($D$20:D22)-1,COLUMNS($D$20:D22)-1)<>\"\",OFFSET(DE110_2!$D$20,ROWS($D$20:D22)-1,COLUMNS($D$20:D22)-1),\"\")","v":"2'x2'x126' RCB"},{"$f":"IF(OFFSET(DE110_2!$E$20,ROWS($E$20:E22)-1,COLUMNS($E$20:E22)-1)<>\"\",OFFSET(DE110_2!$E$20,ROWS($E$20:E22)-1,COLUMNS($E$20:E22)-1),\"\")","v":"Remove outlet headwall to face of parapet."}]
[{"$f":"IF(OFFSET(DE110_2!$C$20,ROWS($C$20:C23)-1,COLUMNS($C$20:C23)-1)<>\"\",OFFSET(DE110_2!$C$20,ROWS($C$20:C23)-1,COLUMNS($C$20:C23)-1),\"\")","v":"404+60.49, 183.54' Rt."},{"$f":"IF(OFFSET(DE110_2!$D$20,ROWS($D$20:D23)-1,COLUMNS($D$20:D23)-1)<>\"\",OFFSET(DE110_2!$D$20,ROWS($D$20:D23)-1,COLUMNS($D$20:D23)-1),\"\")","v":"2'x2'x196' RCB"},{"$f":"IF(OFFSET(DE110_2!$E$20,ROWS($E$20:E23)-1,COLUMNS($E$20:E23)-1)<>\"\",OFFSET(DE110_2!$E$20,ROWS($E$20:E23)-1,COLUMNS($E$20:E23)-1),\"\")","v":"Remove outlet headwall to face of parapet."}]
[{"$f":"IF(OFFSET(DE110_2!$C$20,ROWS($C$20:C24)-1,COLUMNS($C$20:C24)-1)<>\"\",OFFSET(DE110_2!$C$20,ROWS($C$20:C24)-1,COLUMNS($C$20:C24)-1),\"\")","v":"427+65.01, 165.26' Rt."},{"$f":"IF(OFFSET(DE110_2!$D$20,ROWS($D$20:D24)-1,COLUMNS($D$20:D24)-1)<>\"\",OFFSET(DE110_2!$D$20,ROWS($D$20:D24)-1,COLUMNS($D$20:D24)-1),\"\")","v":"12'x14.25'x163' Conc. Arch Culvert"},{"$f":"IF(OFFSET(DE110_2!$E$20,ROWS($E$20:E24)-1,COLUMNS($E$20:E24)-1)<>\"\",OFFSET(DE110_2!$E$20,ROWS($E$20:E24)-1,COLUMNS($E$20:E24)-1),\"\")","v":"Remove inlet headwall to face of parapet."}]
[{"$f":"IF(OFFSET(DE110_2!$C$20,ROWS($C$20:C25)-1,COLUMNS($C$20:C25)-1)<>\"\",OFFSET(DE110_2!$C$20,ROWS($C$20:C25)-1,COLUMNS($C$20:C25)-1),\"\")","v":"435+94.10, 160.63' Rt."},{"$f":"IF(OFFSET(DE110_2!$D$20,ROWS($D$20:D25)-1,COLUMNS($D$20:D25)-1)<>\"\",OFFSET(DE110_2!$D$20,ROWS($D$20:D25)-1,COLUMNS($D$20:D25)-1),\"\")","v":"3'x4'x187' RCB"},{"$f":"IF(OFFSET(DE110_2!$E$20,ROWS($E$20:E25)-1,COLUMNS($E$20:E25)-1)<>\"\",OFFSET(DE110_2!$E$20,ROWS($E$20:E25)-1,COLUMNS($E$20:E25)-1),\"\")","v":"Remove inlet headwall to face of parapet."}]
[{"$f":"IF(OFFSET(DE110_2!$C$20,ROWS($C$20:C26)-1,COLUMNS($C$20:C26)-1)<>\"\",OFFSET(DE110_2!$C$20,ROWS($C$20:C26)-1,COLUMNS($C$20:C26)-1),\"\")","v":"453+84.52, 162.69' Rt."},{"$f":"IF(OFFSET(DE110_2!$D$20,ROWS($D$20:D26)-1,COLUMNS($D$20:D26)-1)<>\"\",OFFSET(DE110_2!$D$20,ROWS($D$20:D26)-1,COLUMNS($D$20:D26)-1),\"\")","v":"3.7'x5.5'x178' Conc. Arch Culvert w/4'x5'x249' RCB Extensions"},{"$f":"IF(OFFSET(DE110_2!$E$20,ROWS($E$20:E26)-1,COLUMNS($E$20:E26)-1)<>\"\",OFFSET(DE110_2!$E$20,ROWS($E$20:E26)-1,COLUMNS($E$20:E26)-1),\"\")","v":"Remove inlet headwall and flume."}]
[{"$f":"IF(OFFSET(DE110_2!$C$20,ROWS($C$20:C27)-1,COLUMNS($C$20:C27)-1)<>\"\",OFFSET(DE110_2!$C$20,ROWS($C$20:C27)-1,COLUMNS($C$20:C27)-1),\"\")","v":"459+60.87, 168.59' Rt."},{"$f":"IF(OFFSET(DE110_2!$D$20,ROWS($D$20:D27)-1,COLUMNS($D$20:D27)-1)<>\"\",OFFSET(DE110_2!$D$20,ROWS($D$20:D27)-1,COLUMNS($D$20:D27)-1),\"\")","v":"3.7'x5.5'x147' Conc. Arch Culvert w/4'x5'x117' RCB Extensions"},{"$f":"IF(OFFSET(DE110_2!$E$20,ROWS($E$20:E27)-1,COLUMNS($E$20:E27)-1)<>\"\",OFFSET(DE110_2!$E$20,ROWS($E$20:E27)-1,COLUMNS($E$20:E27)-1),\"\")","v":"Remove inlet headwall and flume."}]
[{"$f":"IF(OFFSET(DE110_2!$C$20,ROWS($C$20:C28)-1,COLUMNS($C$20:C28)-1)<>\"\",OFFSET(DE110_2!$C$20,ROWS($C$20:C28)-1,COLUMNS($C$20:C28)-1),\"\")","v":"475+31.53, 157.92' Rt."},{"$f":"IF(OFFSET(DE110_2!$D$20,ROWS($D$20:D28)-1,COLUMNS($D$20:D28)-1)<>\"\",OFFSET(DE110_2!$D$20,ROWS($D$20:D28)-1,COLUMNS($D$20:D28)-1),\"\")","v":"3'x3'x241' RCB"},{"$f":"IF(OFFSET(DE110_2!$E$20,ROWS($E$20:E28)-1,COLUMNS($E$20:E28)-1)<>\"\",OFFSET(DE110_2!$E$20,ROWS($E$20:E28)-1,COLUMNS($E$20:E28)-1),\"\")","v":"Remove headwalls."}]
[{"$f":"IF(OFFSET(DE110_2!$C$20,ROWS($C$20:C29)-1,COLUMNS($C$20:C29)-1)<>\"\",OFFSET(DE110_2!$C$20,ROWS($C$20:C29)-1,COLUMNS($C$20:C29)-1),\"\")","v":"481+86.54, 156.10' Rt."},{"$f":"IF(OFFSET(DE110_2!$D$20,ROWS($D$20:D29)-1,COLUMNS($D$20:D29)-1)<>\"\",OFFSET(DE110_2!$D$20,ROWS($D$20:D29)-1,COLUMNS($D$20:D29)-1),\"\")","v":"10'x12.5'x118' Conc. Arch Culvert"},{"$f":"IF(OFFSET(DE110_2!$E$20,ROWS($E$20:E29)-1,COLUMNS($E$20:E29)-1)<>\"\",OFFSET(DE110_2!$E$20,ROWS($E$20:E29)-1,COLUMNS($E$20:E29)-1),\"\")","v":"Remove inlet headwall to face of parapet."}]
[{"$f":"IF(OFFSET(DE110_2!$C$20,ROWS($C$20:C30)-1,COLUMNS($C$20:C30)-1)<>\"\",OFFSET(DE110_2!$C$20,ROWS($C$20:C30)-1,COLUMNS($C$20:C30)-1),\"\")","v":"493+95.50, 152.76' Rt."},{"$f":"IF(OFFSET(DE110_2!$D$20,ROWS($D$20:D30)-1,COLUMNS($D$20:D30)-1)<>\"\",OFFSET(DE110_2!$D$20,ROWS($D$20:D30)-1,COLUMNS($D$20:D30)-1),\"\")","v":"5'x7'x280' RCB"},{"$f":"IF(OFFSET(DE110_2!$E$20,ROWS($E$20:E30)-1,COLUMNS($E$20:E30)-1)<>\"\",OFFSET(DE110_2!$E$20,ROWS($E$20:E30)-1,COLUMNS($E$20:E30)-1),\"\")","v":"Remove headwalls."}]
[{"$f":"IF(OFFSET(DE110_2!$C$20,ROWS($C$20:C31)-1,COLUMNS($C$20:C31)-1)<>\"\",OFFSET(DE110_2!$C$20,ROWS($C$20:C31)-1,COLUMNS($C$20:C31)-1),\"\")","v":"497+75.15, 151.70' Rt."},{"$f":"IF(OFFSET(DE110_2!$D$20,ROWS($D$20:D31)-1,COLUMNS($D$20:D31)-1)<>\"\",OFFSET(DE110_2!$D$20,ROWS($D$20:D31)-1,COLUMNS($D$20:D31)-1),\"\")","v":"2'x2'x145' RCB"},{"$f":"IF(OFFSET(DE110_2!$E$20,ROWS($E$20:E31)-1,COLUMNS($E$20:E31)-1)<>\"\",OFFSET(DE110_2!$E$20,ROWS($E$20:E31)-1,COLUMNS($E$20:E31)-1),\"\")","v":"Remove headwalls."}]
[{"$f":"IF(OFFSET(DE110_2!$C$20,ROWS($C$20:C32)-1,COLUMNS($C$20:C32)-1)<>\"\",OFFSET(DE110_2!$C$20,ROWS($C$20:C32)-1,COLUMNS($C$20:C32)-1),\"\")","v":"511+30.61, 147.95' Rt."},{"$f":"IF(OFFSET(DE110_2!$D$20,ROWS($D$20:D32)-1,COLUMNS($D$20:D32)-1)<>\"\",OFFSET(DE110_2!$D$20,ROWS($D$20:D32)-1,COLUMNS($D$20:D32)-1),\"\")","v":"4.75'x6'x287' Conc. Arch Culvert"},{"$f":"IF(OFFSET(DE110_2!$E$20,ROWS($E$20:E32)-1,COLUMNS($E$20:E32)-1)<>\"\",OFFSET(DE110_2!$E$20,ROWS($E$20:E32)-1,COLUMNS($E$20:E32)-1),\"\")","v":"Remove headwalls."}]
[{"$f":"IF(OFFSET(DE110_2!$C$20,ROWS($C$20:C33)-1,COLUMNS($C$20:C33)-1)<>\"\",OFFSET(DE110_2!$C$20,ROWS($C$20:C33)-1,COLUMNS($C$20:C33)-1),\"\")","v":"531+45.64, 134.84' Rt."},{"$f":"IF(OFFSET(DE110_2!$D$20,ROWS($D$20:D33)-1,COLUMNS($D$20:D33)-1)<>\"\",OFFSET(DE110_2!$D$20,ROWS($D$20:D33)-1,COLUMNS($D$20:D33)-1),\"\")","v":"4'x4'x189' RCB"},{"$f":"IF(OFFSET(DE110_2!$E$20,ROWS($E$20:E33)-1,COLUMNS($E$20:E33)-1)<>\"\",OFFSET(DE110_2!$E$20,ROWS($E$20:E33)-1,COLUMNS($E$20:E33)-1),\"\")","v":"Remove headwalls."}]
[{"$f":"IF(OFFSET(DE110_2!$C$20,ROWS($C$20:C34)-1,COLUMNS($C$20:C34)-1)<>\"\",OFFSET(DE110_2!$C$20,ROWS($C$20:C34)-1,COLUMNS($C$20:C34)-1),\"\")","v":"538+86.05, 138.76' Rt."},{"$f":"IF(OFFSET(DE110_2!$D$20,ROWS($D$20:D34)-1,COLUMNS($D$20:D34)-1)<>\"\",OFFSET(DE110_2!$D$20,ROWS($D$20:D34)-1,COLUMNS($D$20:D34)-1),\"\")","v":"5.5'x8'x141' Conc. Arch Culvert"},{"$f":"IF(OFFSET(DE110_2!$E$20,ROWS($E$20:E34)-1,COLUMNS($E$20:E34)-1)<>\"\",OFFSET(DE110_2!$E$20,ROWS($E$20:E34)-1,COLUMNS($E$20:E34)-1),\"\")","v":"Remove headwalls."}]
[{"$f":"IF(OFFSET(DE110_2!$C$20,ROWS($C$20:C35)-1,COLUMNS($C$20:C35)-1)<>\"\",OFFSET(DE110_2!$C$20,ROWS($C$20:C35)-1,COLUMNS($C$20:C35)-1),\"\")","v":"554+57.18, 145.52' Rt."},{"$f":"IF(OFFSET(DE110_2!$D$20,ROWS($D$20:D35)-1,COLUMNS($D$20:D35)-1)<>\"\",OFFSET(DE110_2!$D$20,ROWS($D$20:D35)-1,COLUMNS($D$20:D35)-1),\"\")","v":"2'x2'x161' RCB"},{"$f":"IF(OFFSET(DE110_2!$E$20,ROWS($E$20:E35)-1,COLUMNS($E$20:E35)-1)<>\"\",OFFSET(DE110_2!$E$20,ROWS($E$20:E35)-1,COLUMNS($E$20:E35)-1),\"\")","v":"Remove inlet headwall and flume."}]
[{"$f":"IF(OFFSET(DE110_2!$C$20,ROWS($C$20:C36)-1,COLUMNS($C$20:C36)-1)<>\"\",OFFSET(DE110_2!$C$20,ROWS($C$20:C36)-1,COLUMNS($C$20:C36)-1),\"\")","v":"556+89.66, 146.29' Rt."},{"$f":"IF(OFFSET(DE110_2!$D$20,ROWS($D$20:D36)-1,COLUMNS($D$20:D36)-1)<>\"\",OFFSET(DE110_2!$D$20,ROWS($D$20:D36)-1,COLUMNS($D$20:D36)-1),\"\")","v":"2'x2'x216' RCB"},{"$f":"IF(OFFSET(DE110_2!$E$20,ROWS($E$20:E36)-1,COLUMNS($E$20:E36)-1)<>\"\",OFFSET(DE110_2!$E$20,ROWS($E$20:E36)-1,COLUMNS($E$20:E36)-1),\"\")","v":"Remove headwalls."}]
[{"$f":"IF(OFFSET(DE110_2!$C$20,ROWS($C$20:C37)-1,COLUMNS($C$20:C37)-1)<>\"\",OFFSET(DE110_2!$C$20,ROWS($C$20:C37)-1,COLUMNS($C$20:C37)-1),\"\")","v":"566+82.25, 149.58' Rt."},{"$f":"IF(OFFSET(DE110_2!$D$20,ROWS($D$20:D37)-1,COLUMNS($D$20:D37)-1)<>\"\",OFFSET(DE110_2!$D$20,ROWS($D$20:D37)-1,COLUMNS($D$20:D37)-1),\"\")","v":"5'x5'x170' RCB"},{"$f":"IF(OFFSET(DE110_2!$E$20,ROWS($E$20:E37)-1,COLUMNS($E$20:E37)-1)<>\"\",OFFSET(DE110_2!$E$20,ROWS($E$20:E37)-1,COLUMNS($E$20:E37)-1),\"\")","v":"Remove headwalls."}]
[{"$f":"IF(OFFSET(DE110_2!$C$20,ROWS($C$20:C38)-1,COLUMNS($C$20:C38)-1)<>\"\",OFFSET(DE110_2!$C$20,ROWS($C$20:C38)-1,COLUMNS($C$20:C38)-1),\"\")","v":"577+31.18, 153.06' Rt."},{"$f":"IF(OFFSET(DE110_2!$D$20,ROWS($D$20:D38)-1,COLUMNS($D$20:D38)-1)<>\"\",OFFSET(DE110_2!$D$20,ROWS($D$20:D38)-1,COLUMNS($D$20:D38)-1),\"\")","v":"6.25'x9.25'x271' Conc. Arch Culvert"},{"$f":"IF(OFFSET(DE110_2!$E$20,ROWS($E$20:E38)-1,COLUMNS($E$20:E38)-1)<>\"\",OFFSET(DE110_2!$E$20,ROWS($E$20:E38)-1,COLUMNS($E$20:E38)-1),\"\")","v":"Remove headwalls."}]
[{"$f":"IF(OFFSET(DE110_2!$C$20,ROWS($C$20:C39)-1,COLUMNS($C$20:C39)-1)<>\"\",OFFSET(DE110_2!$C$20,ROWS($C$20:C39)-1,COLUMNS($C$20:C39)-1),\"\")","v":"593+45.94, 158.41' Rt."},{"$f":"IF(OFFSET(DE110_2!$D$20,ROWS($D$20:D39)-1,COLUMNS($D$20:D39)-1)<>\"\",OFFSET(DE110_2!$D$20,ROWS($D$20:D39)-1,COLUMNS($D$20:D39)-1),\"\")","v":"3.7'x5.5'x320' Conc. Arch Culvert"},{"$f":"IF(OFFSET(DE110_2!$E$20,ROWS($E$20:E39)-1,COLUMNS($E$20:E39)-1)<>\"\",OFFSET(DE110_2!$E$20,ROWS($E$20:E39)-1,COLUMNS($E$20:E39)-1),\"\")","v":"Remove headwalls."}]
[{"$f":"IF(OFFSET(DE110_2!$C$20,ROWS($C$20:C40)-1,COLUMNS($C$20:C40)-1)<>\"\",OFFSET(DE110_2!$C$20,ROWS($C$20:C40)-1,COLUMNS($C$20:C40)-1),\"\")","v":"612+43.88, 158.62' Rt."},{"$f":"IF(OFFSET(DE110_2!$D$20,ROWS($D$20:D40)-1,COLUMNS($D$20:D40)-1)<>\"\",OFFSET(DE110_2!$D$20,ROWS($D$20:D40)-1,COLUMNS($D$20:D40)-1),\"\")","v":"4.75'x6'x308' Conc. Arch Culvert"},{"$f":"IF(OFFSET(DE110_2!$E$20,ROWS($E$20:E40)-1,COLUMNS($E$20:E40)-1)<>\"\",OFFSET(DE110_2!$E$20,ROWS($E$20:E40)-1,COLUMNS($E$20:E40)-1),\"\")","v":"Remove headwalls."}]
[{"$f":"IF(OFFSET(DE110_2!$C$20,ROWS($C$20:C41)-1,COLUMNS($C$20:C41)-1)<>\"\",OFFSET(DE110_2!$C$20,ROWS($C$20:C41)-1,COLUMNS($C$20:C41)-1),\"\")","v":"626+42.71, 155.01' Rt."},{"$f":"IF(OFFSET(DE110_2!$D$20,ROWS($D$20:D41)-1,COLUMNS($D$20:D41)-1)<>\"\",OFFSET(DE110_2!$D$20,ROWS($D$20:D41)-1,COLUMNS($D$20:D41)-1),\"\")","v":"3.7'x5.5'x281' Conc. Arch Culvert"},{"$f":"IF(OFFSET(DE110_2!$E$20,ROWS($E$20:E41)-1,COLUMNS($E$20:E41)-1)<>\"\",OFFSET(DE110_2!$E$20,ROWS($E$20:E41)-1,COLUMNS($E$20:E41)-1),\"\")","v":"Remove headwalls."}]
[{"$f":"IF(OFFSET(DE110_2!$C$20,ROWS($C$20:C42)-1,COLUMNS($C$20:C42)-1)<>\"\",OFFSET(DE110_2!$C$20,ROWS($C$20:C42)-1,COLUMNS($C$20:C42)-1),\"\")","v":"654+57.52, 134.34' Rt."},{"$f":"IF(OFFSET(DE110_2!$D$20,ROWS($D$20:D42)-1,COLUMNS($D$20:D42)-1)<>\"\",OFFSET(DE110_2!$D$20,ROWS($D$20:D42)-1,COLUMNS($D$20:D42)-1),\"\")","v":"4.75'x6'x196' Conc. Arch Culvert w/5'x6'x66' RCB Extension"},{"$f":"IF(OFFSET(DE110_2!$E$20,ROWS($E$20:E42)-1,COLUMNS($E$20:E42)-1)<>\"\",OFFSET(DE110_2!$E$20,ROWS($E$20:E42)-1,COLUMNS($E$20:E42)-1),\"\")","v":"Remove headwalls."}]
[{"$f":"IF(OFFSET(DE110_2!$C$20,ROWS($C$20:C43)-1,COLUMNS($C$20:C43)-1)<>\"\",OFFSET(DE110_2!$C$20,ROWS($C$20:C43)-1,COLUMNS($C$20:C43)-1),\"\")","v":"661+02.08, 130.50' Rt."},{"$f":"IF(OFFSET(DE110_2!$D$20,ROWS($D$20:D43)-1,COLUMNS($D$20:D43)-1)<>\"\",OFFSET(DE110_2!$D$20,ROWS($D$20:D43)-1,COLUMNS($D$20:D43)-1),\"\")","v":"2'x2'x130' RCB"},{"$f":"IF(OFFSET(DE110_2!$E$20,ROWS($E$20:E43)-1,COLUMNS($E$20:E43)-1)<>\"\",OFFSET(DE110_2!$E$20,ROWS($E$20:E43)-1,COLUMNS($E$20:E43)-1),\"\")","v":"Remove headwalls."}]
[{"$f":"IF(OFFSET(DE110_2!$C$20,ROWS($C$20:C44)-1,COLUMNS($C$20:C44)-1)<>\"\",OFFSET(DE110_2!$C$20,ROWS($C$20:C44)-1,COLUMNS($C$20:C44)-1),\"\")","v":"664+83.45, 115.98' Rt."},{"$f":"IF(OFFSET(DE110_2!$D$20,ROWS($D$20:D44)-1,COLUMNS($D$20:D44)-1)<>\"\",OFFSET(DE110_2!$D$20,ROWS($D$20:D44)-1,COLUMNS($D$20:D44)-1),\"\")","v":"2'x2'x105' RCB w/30\"x18' RCP Extension"},{"$f":"IF(OFFSET(DE110_2!$E$20,ROWS($E$20:E44)-1,COLUMNS($E$20:E44)-1)<>\"\",OFFSET(DE110_2!$E$20,ROWS($E$20:E44)-1,COLUMNS($E$20:E44)-1),\"\")","v":"Remove outlet headwall."}]
[{"$f":"IF(OFFSET(DE110_2!$C$20,ROWS($C$20:C45)-1,COLUMNS($C$20:C45)-1)<>\"\",OFFSET(DE110_2!$C$20,ROWS($C$20:C45)-1,COLUMNS($C$20:C45)-1),\"\")","v":"668+87.97, 90.61' Rt."},{"$f":"IF(OFFSET(DE110_2!$D$20,ROWS($D$20:D45)-1,COLUMNS($D$20:D45)-1)<>\"\",OFFSET(DE110_2!$D$20,ROWS($D$20:D45)-1,COLUMNS($D$20:D45)-1),\"\")","v":"3'x3'x131' RCB w/42\"x59' RCP Extension"},{"$f":"IF(OFFSET(DE110_2!$E$20,ROWS($E$20:E45)-1,COLUMNS($E$20:E45)-1)<>\"\",OFFSET(DE110_2!$E$20,ROWS($E$20:E45)-1,COLUMNS($E$20:E45)-1),\"\")","v":"Remove outlet headwall."}]
[{"$f":"IF(OFFSET(DE110_2!$C$20,ROWS($C$20:C46)-1,COLUMNS($C$20:C46)-1)<>\"\",OFFSET(DE110_2!$C$20,ROWS($C$20:C46)-1,COLUMNS($C$20:C46)-1),\"\")","v":"671+20.30, 75.69' Rt."},{"$f":"IF(OFFSET(DE110_2!$D$20,ROWS($D$20:D46)-1,COLUMNS($D$20:D46)-1)<>\"\",OFFSET(DE110_2!$D$20,ROWS($D$20:D46)-1,COLUMNS($D$20:D46)-1),\"\")","v":"2'x3'x104' RCB w/36\"x71' RCP Extensions"},{"$f":"IF(OFFSET(DE110_2!$E$20,ROWS($E$20:E46)-1,COLUMNS($E$20:E46)-1)<>\"\",OFFSET(DE110_2!$E$20,ROWS($E$20:E46)-1,COLUMNS($E$20:E46)-1),\"\")","v":"Remove headwalls."}]
[{"$f":"IF(OFFSET(DE110_2!$C$20,ROWS($C$20:C47)-1,COLUMNS($C$20:C47)-1)<>\"\",OFFSET(DE110_2!$C$20,ROWS($C$20:C47)-1,COLUMNS($C$20:C47)-1),\"\")","v":""},{"$f":"IF(OFFSET(DE110_2!$D$20,ROWS($D$20:D47)-1,COLUMNS($D$20:D47)-1)<>\"\",OFFSET(DE110_2!$D$20,ROWS($D$20:D47)-1,COLUMNS($D$20:D47)-1),\"\")","v":""},{"$f":"IF(OFFSET(DE110_2!$E$20,ROWS($E$20:E47)-1,COLUMNS($E$20:E47)-1)<>\"\",OFFSET(DE110_2!$E$20,ROWS($E$20:E47)-1,COLUMNS($E$20:E47)-1),\"\")","v":""}]
[{"$f":"IF(OFFSET(DE110_2!$C$20,ROWS($C$20:C48)-1,COLUMNS($C$20:C48)-1)<>\"\",OFFSET(DE110_2!$C$20,ROWS($C$20:C48)-1,COLUMNS($C$20:C48)-1),\"\")","v":""},{"$f":"IF(OFFSET(DE110_2!$D$20,ROWS($D$20:D48)-1,COLUMNS($D$20:D48)-1)<>\"\",OFFSET(DE110_2!$D$20,ROWS($D$20:D48)-1,COLUMNS($D$20:D48)-1),\"\")","v":""},{"$f":"IF(OFFSET(DE110_2!$E$20,ROWS($E$20:E48)-1,COLUMNS($E$20:E48)-1)<>\"\",OFFSET(DE110_2!$E$20,ROWS($E$20:E48)-1,COLUMNS($E$20:E48)-1),\"\")","v":""}]
[{"$f":"IF(OFFSET(DE110_2!$C$20,ROWS($C$20:C49)-1,COLUMNS($C$20:C49)-1)<>\"\",OFFSET(DE110_2!$C$20,ROWS($C$20:C49)-1,COLUMNS($C$20:C49)-1),\"\")","v":""},{"$f":"IF(OFFSET(DE110_2!$D$20,ROWS($D$20:D49)-1,COLUMNS($D$20:D49)-1)<>\"\",OFFSET(DE110_2!$D$20,ROWS($D$20:D49)-1,COLUMNS($D$20:D49)-1),\"\")","v":""},{"$f":"IF(OFFSET(DE110_2!$E$20,ROWS($E$20:E49)-1,COLUMNS($E$20:E49)-1)<>\"\",OFFSET(DE110_2!$E$20,ROWS($E$20:E49)-1,COLUMNS($E$20:E49)-1),\"\")","v":""}]
[{"$f":"IF(OFFSET(DE110_2!$C$20,ROWS($C$20:C50)-1,COLUMNS($C$20:C50)-1)<>\"\",OFFSET(DE110_2!$C$20,ROWS($C$20:C50)-1,COLUMNS($C$20:C50)-1),\"\")","v":""},{"$f":"IF(OFFSET(DE110_2!$D$20,ROWS($D$20:D50)-1,COLUMNS($D$20:D50)-1)<>\"\",OFFSET(DE110_2!$D$20,ROWS($D$20:D50)-1,COLUMNS($D$20:D50)-1),\"\")","v":""},{"$f":"IF(OFFSET(DE110_2!$E$20,ROWS($E$20:E50)-1,COLUMNS($E$20:E50)-1)<>\"\",OFFSET(DE110_2!$E$20,ROWS($E$20:E50)-1,COLUMNS($E$20:E50)-1),\"\")","v":""}]
[{"$f":"IF(OFFSET(DE110_2!$C$20,ROWS($C$20:C51)-1,COLUMNS($C$20:C51)-1)<>\"\",OFFSET(DE110_2!$C$20,ROWS($C$20:C51)-1,COLUMNS($C$20:C51)-1),\"\")","v":""},{"$f":"IF(OFFSET(DE110_2!$D$20,ROWS($D$20:D51)-1,COLUMNS($D$20:D51)-1)<>\"\",OFFSET(DE110_2!$D$20,ROWS($D$20:D51)-1,COLUMNS($D$20:D51)-1),\"\")","v":""},{"$f":"IF(OFFSET(DE110_2!$E$20,ROWS($E$20:E51)-1,COLUMNS($E$20:E51)-1)<>\"\",OFFSET(DE110_2!$E$20,ROWS($E$20:E51)-1,COLUMNS($E$20:E51)-1),\"\")","v":""}]
[{"$f":"IF(OFFSET(DE110_2!$C$20,ROWS($C$20:C52)-1,COLUMNS($C$20:C52)-1)<>\"\",OFFSET(DE110_2!$C$20,ROWS($C$20:C52)-1,COLUMNS($C$20:C52)-1),\"\")","v":""},{"$f":"IF(OFFSET(DE110_2!$D$20,ROWS($D$20:D52)-1,COLUMNS($D$20:D52)-1)<>\"\",OFFSET(DE110_2!$D$20,ROWS($D$20:D52)-1,COLUMNS($D$20:D52)-1),\"\")","v":""},{"$f":"IF(OFFSET(DE110_2!$E$20,ROWS($E$20:E52)-1,COLUMNS($E$20:E52)-1)<>\"\",OFFSET(DE110_2!$E$20,ROWS($E$20:E52)-1,COLUMNS($E$20:E52)-1),\"\")","v":""}]
[{"$f":"IF(OFFSET(DE110_2!$C$20,ROWS($C$20:C53)-1,COLUMNS($C$20:C53)-1)<>\"\",OFFSET(DE110_2!$C$20,ROWS($C$20:C53)-1,COLUMNS($C$20:C53)-1),\"\")","v":""},{"$f":"IF(OFFSET(DE110_2!$D$20,ROWS($D$20:D53)-1,COLUMNS($D$20:D53)-1)<>\"\",OFFSET(DE110_2!$D$20,ROWS($D$20:D53)-1,COLUMNS($D$20:D53)-1),\"\")","v":""},{"$f":"IF(OFFSET(DE110_2!$E$20,ROWS($E$20:E53)-1,COLUMNS($E$20:E53)-1)<>\"\",OFFSET(DE110_2!$E$20,ROWS($E$20:E53)-1,COLUMNS($E$20:E53)-1),\"\")","v":""}]
[{"$f":"IF(OFFSET(DE110_2!$C$20,ROWS($C$20:C54)-1,COLUMNS($C$20:C54)-1)<>\"\",OFFSET(DE110_2!$C$20,ROWS($C$20:C54)-1,COLUMNS($C$20:C54)-1),\"\")","v":""},{"$f":"IF(OFFSET(DE110_2!$D$20,ROWS($D$20:D54)-1,COLUMNS($D$20:D54)-1)<>\"\",OFFSET(DE110_2!$D$20,ROWS($D$20:D54)-1,COLUMNS($D$20:D54)-1),\"\")","v":""},{"$f":"IF(OFFSET(DE110_2!$E$20,ROWS($E$20:E54)-1,COLUMNS($E$20:E54)-1)<>\"\",OFFSET(DE110_2!$E$20,ROWS($E$20:E54)-1,COLUMNS($E$20:E54)-1),\"\")","v":""}]
[{"$f":"IF(OFFSET(DE110_2!$C$20,ROWS($C$20:C55)-1,COLUMNS($C$20:C55)-1)<>\"\",OFFSET(DE110_2!$C$20,ROWS($C$20:C55)-1,COLUMNS($C$20:C55)-1),\"\")","v":""},{"$f":"IF(OFFSET(DE110_2!$D$20,ROWS($D$20:D55)-1,COLUMNS($D$20:D55)-1)<>\"\",OFFSET(DE110_2!$D$20,ROWS($D$20:D55)-1,COLUMNS($D$20:D55)-1),\"\")","v":""},{"$f":"IF(OFFSET(DE110_2!$E$20,ROWS($E$20:E55)-1,COLUMNS($E$20:E55)-1)<>\"\",OFFSET(DE110_2!$E$20,ROWS($E$20:E55)-1,COLUMNS($E$20:E55)-1),\"\")","v":""}]
[{"$f":"IF(OFFSET(DE110_2!$C$20,ROWS($C$20:C56)-1,COLUMNS($C$20:C56)-1)<>\"\",OFFSET(DE110_2!$C$20,ROWS($C$20:C56)-1,COLUMNS($C$20:C56)-1),\"\")","v":""},{"$f":"IF(OFFSET(DE110_2!$D$20,ROWS($D$20:D56)-1,COLUMNS($D$20:D56)-1)<>\"\",OFFSET(DE110_2!$D$20,ROWS($D$20:D56)-1,COLUMNS($D$20:D56)-1),\"\")","v":""},{"$f":"IF(OFFSET(DE110_2!$E$20,ROWS($E$20:E56)-1,COLUMNS($E$20:E56)-1)<>\"\",OFFSET(DE110_2!$E$20,ROWS($E$20:E56)-1,COLUMNS($E$20:E56)-1),\"\")","v":""}]
[{"$f":"IF(OFFSET(DE110_2!$C$20,ROWS($C$20:C57)-1,COLUMNS($C$20:C57)-1)<>\"\",OFFSET(DE110_2!$C$20,ROWS($C$20:C57)-1,COLUMNS($C$20:C57)-1),\"\")","v":""},{"$f":"IF(OFFSET(DE110_2!$D$20,ROWS($D$20:D57)-1,COLUMNS($D$20:D57)-1)<>\"\",OFFSET(DE110_2!$D$20,ROWS($D$20:D57)-1,COLUMNS($D$20:D57)-1),\"\")","v":""},{"$f":"IF(OFFSET(DE110_2!$E$20,ROWS($E$20:E57)-1,COLUMNS($E$20:E57)-1)<>\"\",OFFSET(DE110_2!$E$20,ROWS($E$20:E57)-1,COLUMNS($E$20:E57)-1),\"\")","v":""}]
[{"$f":"IF(OFFSET(DE110_2!$C$20,ROWS($C$20:C58)-1,COLUMNS($C$20:C58)-1)<>\"\",OFFSET(DE110_2!$C$20,ROWS($C$20:C58)-1,COLUMNS($C$20:C58)-1),\"\")","v":""},{"$f":"IF(OFFSET(DE110_2!$D$20,ROWS($D$20:D58)-1,COLUMNS($D$20:D58)-1)<>\"\",OFFSET(DE110_2!$D$20,ROWS($D$20:D58)-1,COLUMNS($D$20:D58)-1),\"\")","v":""},{"$f":"IF(OFFSET(DE110_2!$E$20,ROWS($E$20:E58)-1,COLUMNS($E$20:E58)-1)<>\"\",OFFSET(DE110_2!$E$20,ROWS($E$20:E58)-1,COLUMNS($E$20:E58)-1),\"\")","v":""}]
[{"$f":"IF(OFFSET(DE110_2!$C$20,ROWS($C$20:C59)-1,COLUMNS($C$20:C59)-1)<>\"\",OFFSET(DE110_2!$C$20,ROWS($C$20:C59)-1,COLUMNS($C$20:C59)-1),\"\")","v":""},{"$f":"IF(OFFSET(DE110_2!$D$20,ROWS($D$20:D59)-1,COLUMNS($D$20:D59)-1)<>\"\",OFFSET(DE110_2!$D$20,ROWS($D$20:D59)-1,COLUMNS($D$20:D59)-1),\"\")","v":""},{"$f":"IF(OFFSET(DE110_2!$E$20,ROWS($E$20:E59)-1,COLUMNS($E$20:E59)-1)<>\"\",OFFSET(DE110_2!$E$20,ROWS($E$20:E59)-1,COLUMNS($E$20:E59)-1),\"\")","v":""}]
[{"$f":"IF(OFFSET(DE110_2!$C$20,ROWS($C$20:C60)-1,COLUMNS($C$20:C60)-1)<>\"\",OFFSET(DE110_2!$C$20,ROWS($C$20:C60)-1,COLUMNS($C$20:C60)-1),\"\")","v":""},{"$f":"IF(OFFSET(DE110_2!$D$20,ROWS($D$20:D60)-1,COLUMNS($D$20:D60)-1)<>\"\",OFFSET(DE110_2!$D$20,ROWS($D$20:D60)-1,COLUMNS($D$20:D60)-1),\"\")","v":""},{"$f":"IF(OFFSET(DE110_2!$E$20,ROWS($E$20:E60)-1,COLUMNS($E$20:E60)-1)<>\"\",OFFSET(DE110_2!$E$20,ROWS($E$20:E60)-1,COLUMNS($E$20:E60)-1),\"\")","v":""}]
[{"$f":"IF(OFFSET(DE110_2!$C$20,ROWS($C$20:C61)-1,COLUMNS($C$20:C61)-1)<>\"\",OFFSET(DE110_2!$C$20,ROWS($C$20:C61)-1,COLUMNS($C$20:C61)-1),\"\")","v":""},{"$f":"IF(OFFSET(DE110_2!$D$20,ROWS($D$20:D61)-1,COLUMNS($D$20:D61)-1)<>\"\",OFFSET(DE110_2!$D$20,ROWS($D$20:D61)-1,COLUMNS($D$20:D61)-1),\"\")","v":""},{"$f":"IF(OFFSET(DE110_2!$E$20,ROWS($E$20:E61)-1,COLUMNS($E$20:E61)-1)<>\"\",OFFSET(DE110_2!$E$20,ROWS($E$20:E61)-1,COLUMNS($E$20:E61)-1),\"\")","v":""}]
[{"$f":"IF(OFFSET(DE110_2!$C$20,ROWS($C$20:C62)-1,COLUMNS($C$20:C62)-1)<>\"\",OFFSET(DE110_2!$C$20,ROWS($C$20:C62)-1,COLUMNS($C$20:C62)-1),\"\")","v":""},{"$f":"IF(OFFSET(DE110_2!$D$20,ROWS($D$20:D62)-1,COLUMNS($D$20:D62)-1)<>\"\",OFFSET(DE110_2!$D$20,ROWS($D$20:D62)-1,COLUMNS($D$20:D62)-1),\"\")","v":""},{"$f":"IF(OFFSET(DE110_2!$E$20,ROWS($E$20:E62)-1,COLUMNS($E$20:E62)-1)<>\"\",OFFSET(DE110_2!$E$20,ROWS($E$20:E62)-1,COLUMNS($E$20:E62)-1),\"\")","v":""}]
[{"$f":"IF(OFFSET(DE110_2!$C$20,ROWS($C$20:C63)-1,COLUMNS($C$20:C63)-1)<>\"\",OFFSET(DE110_2!$C$20,ROWS($C$20:C63)-1,COLUMNS($C$20:C63)-1),\"\")","v":""},{"$f":"IF(OFFSET(DE110_2!$D$20,ROWS($D$20:D63)-1,COLUMNS($D$20:D63)-1)<>\"\",OFFSET(DE110_2!$D$20,ROWS($D$20:D63)-1,COLUMNS($D$20:D63)-1),\"\")","v":""},{"$f":"IF(OFFSET(DE110_2!$E$20,ROWS($E$20:E63)-1,COLUMNS($E$20:E63)-1)<>\"\",OFFSET(DE110_2!$E$20,ROWS($E$20:E63)-1,COLUMNS($E$20:E63)-1),\"\")","v":""}]
[{"$f":"IF(OFFSET(DE110_2!$C$20,ROWS($C$20:C64)-1,COLUMNS($C$20:C64)-1)<>\"\",OFFSET(DE110_2!$C$20,ROWS($C$20:C64)-1,COLUMNS($C$20:C64)-1),\"\")","v":""},{"$f":"IF(OFFSET(DE110_2!$D$20,ROWS($D$20:D64)-1,COLUMNS($D$20:D64)-1)<>\"\",OFFSET(DE110_2!$D$20,ROWS($D$20:D64)-1,COLUMNS($D$20:D64)-1),\"\")","v":""},{"$f":"IF(OFFSET(DE110_2!$E$20,ROWS($E$20:E64)-1,COLUMNS($E$20:E64)-1)<>\"\",OFFSET(DE110_2!$E$20,ROWS($E$20:E64)-1,COLUMNS($E$20:E64)-1),\"\")","v":""}]
[{"$f":"IF(OFFSET(DE110_2!$C$20,ROWS($C$20:C65)-1,COLUMNS($C$20:C65)-1)<>\"\",OFFSET(DE110_2!$C$20,ROWS($C$20:C65)-1,COLUMNS($C$20:C65)-1),\"\")","v":""},{"$f":"IF(OFFSET(DE110_2!$D$20,ROWS($D$20:D65)-1,COLUMNS($D$20:D65)-1)<>\"\",OFFSET(DE110_2!$D$20,ROWS($D$20:D65)-1,COLUMNS($D$20:D65)-1),\"\")","v":""},{"$f":"IF(OFFSET(DE110_2!$E$20,ROWS($E$20:E65)-1,COLUMNS($E$20:E65)-1)<>\"\",OFFSET(DE110_2!$E$20,ROWS($E$20:E65)-1,COLUMNS($E$20:E65)-1),\"\")","v":""}]
[{"$f":"IF(OFFSET(DE110_2!$C$20,ROWS($C$20:C66)-1,COLUMNS($C$20:C66)-1)<>\"\",OFFSET(DE110_2!$C$20,ROWS($C$20:C66)-1,COLUMNS($C$20:C66)-1),\"\")","v":""},{"$f":"IF(OFFSET(DE110_2!$D$20,ROWS($D$20:D66)-1,COLUMNS($D$20:D66)-1)<>\"\",OFFSET(DE110_2!$D$20,ROWS($D$20:D66)-1,COLUMNS($D$20:D66)-1),\"\")","v":""},{"$f":"IF(OFFSET(DE110_2!$E$20,ROWS($E$20:E66)-1,COLUMNS($E$20:E66)-1)<>\"\",OFFSET(DE110_2!$E$20,ROWS($E$20:E66)-1,COLUMNS($E$20:E66)-1),\"\")","v":""}]

{"sheet":"PrintSheetTemplate","index":4,"n_rows":95,"n_cols":179,"rows_kept":95,"cut":false,"hidden":true,"merged":[[93,171,93,178],[94,1,94,178],[93,101,93,106],[93,107,93,118],[93,119,93,148],[93,149,93,158],[93,159,93,164],[93,165,93,170],[93,1,93,7],[93,8,93,14],[93,15,93,21],[93,22,93,30],[93,31,93,64],[93,65,93,100]]}
[" "]
[]
[]
[]
[]
[]
[]
[]
[]
[]
[]
[]
[]
[]
[]
[]
[]
[]
[]
[]
[]
[]
[]
[]
[]
[]
[]
[]
[]
[]
[]
[]
[]
[]
[]
[]
[]
[]
[]
[]
[]
[]
[]
[]
[]
[]
[]
[]
[]
[]
[]
[]
[]
[]
[]
[]
[]
[]
[]
[]
[]
[]
[]
[]
[]
[]
[]
[]
[]
[]
[]
[]
[]
[]
[]
[]
[]
[]
[]
[]
[]
[]
[]
[]
[]
[]
[]
[]
[]
[]
[]
[]
[null,"","","","","","","","","","","","","","","","","","","","","","","","","","","","","","","","","","","","","","","","","","","","","","","","","","","","","","","","","","","","","","","","","","","","","","","","","","","","","","","","","","","","","","","","","","","","","","","","","","","","","","","","","","","","","","","","","","","","","","","","","","","","","","","","","","","","","","","","","","","","","","","","","","","","","","","",null,"","","","","","","","","","","","","","","","","","","","","","","","","",""]
[null,"FILE NO.",null,null,null,null,null,null,{"$f":"IF(ProjectInformation!$B$11<>\"\",ProjectInformation!$B$11,\"\")","v":""},null,null,null,null,null,null,{"$f":"UPPER(ProjectInformation!$B$8)","v":"ENGLISH"},null,null,null,null,null,null,"DESIGN TEAM",null,null,null,null,null,null,null,null,{"$f":"IF(AND(ProjectInformation!$B$3<>\"\",ProjectInformation!$B$4<>\"\",ProjectInformation!$B$5<>\"\"),ProjectInformation!$B$3&\"\\\"&ProjectInformation!$B$4&\"\\\"&ProjectInformation!$B$5,IF(AND(ProjectInformation!$B$3<>\"\",ProjectInformation!$B$4<>\"\"),ProjectInformation!$B$3&\"\\\"&ProjectInformation!$B$4,IF(ProjectInformation!$B$3<>\"\",ProjectInformation!$B$3,\"\")))","v":"Flattery\\Johnson"},null,null,null,null,null,null,null,null,null,null,null,null,null,null,null,null,null,null,null,null,null,null,null,null,null,null,null,null,null,null,null,null,null,{"$f":"IF(ProjectInformation!$B$6<>\"\",ProjectInformation!$B$6,\"\")","v":"TAMA"},null,null,null,null,null,null,null,null,null,null,null,null,null,null,null,null,null,null,null,null,null,null,null,null,null,null,null,null,null,null,null,null,null,null,null,"COUNTY",null,null,null,null,null,"PROJECT NUMBER",null,null,null,null,null,null,null,null,null,null,null,{"$f":"IF(ProjectInformation!$B$7<>\"\",ProjectInformation!$B$7,\"\")","v":"NHSX-030-6(189)--3H-86"},null,null,null,null,null,null,null,null,null,null,null,null,null,null,null,null,null,null,null,null,null,null,null,null,null,null,null,null,null,"SHEET NUMBER",null,null,null,null,null,null,null,null,null,null,null,null,null,null,null,{"$f":"IF(FP94<>\"\",\"REVISED\",\"\")","v":""},null,null,null,null,null,{"$f":"IF(ProjectInformation!$B$9<>\"\",ProjectInformation!$B$9,\"\")","v":""}]
[""]

{"sheet":"Note1","index":5,"n_rows":1,"n_cols":1,"rows_kept":1,"cut":false,"hidden":true,"merged":[[0,0,2,0]]}
["SEE V SHEETS FOR ADDITIONAL BID ITEMS AND QUANTITIES"]

{"sheet":"BridgeBlock","index":6,"n_rows":4,"n_cols":14,"rows_kept":4,"cut":false,"hidden":true,"merged":[[2,2,2,8],[3,2,3,7],[2,9,2,12],[3,8,3,12]]}
[2]
[null,"","","","","","","","","","","","",""]
[null,null,"Design No.",null,null,null,null,null,null,{"$f":"IF(#REF!<>\"\",#REF!,\"\")","v":{"$error":"#REF!"}}]
[null,null,"File No.",null,null,null,null,null,{"$f":"IF(#REF!<>\"\",#REF!,\"\")","v":{"$error":"#REF!"}}]

{"sheet":"Index","index":7,"n_rows":164,"n_cols":17,"rows_kept":164,"cut":false,"hidden":true,"merged":[]}
["100-0A","1997-10-28","4.5.6","ADAIR",null,"Live English File Path","W:\\Highway\\Design\\RoadDesignDetails\\ExcelTabs\\",null,"Brian R. Smith","bsmith2","Methods","ROADWAY DESIGN",null,"110_2(1)","='110_2'!$A$1:$C$52",null,"A_DE111Series.xlsm"]
["100-1A","1997-07-15","10/01/15","ADAMS",null,"Live Metric File Path","W:\\Highway\\Design\\RoadDesignDetails\\ExcelTabs\\MetricTabs\\",null,"Khyle B. Clute","kclute","Methods","ROADWAY DESIGN",null,null,null,null,"C_DE100Series.xlsm"]
["100-1C","2012-04-17","C","ALLAMAKEE",null,"Index File Path","W:\\Highway\\Design\\RoadDesignDetails\\PDFsandWebFiles\\Indexes\\",null,"Thomas M. Hamski","thamski","Methods","ROADWAY DESIGN",null,null,null,null,"C_DE102Series.xlsm"]
["100-1D","2005-10-18",null,"APPANOOSE",null,"Index File Name","TNT_EnglishIndexes.xlsx",null,"Wesley L. Mayberry","wmayber","Methods","ROADWAY DESIGN",null,null,null,null,"C_DE103Series.xlsm"]
["100-4A","2002-10-29",null,"AUDUBON",null,"Last Revision English File Path","W:\\Highway\\Design\\RoadDesignDetails\\Old_Details\\ExcelTabs\\",null,"John M. Narigon","jnarigo","Methods","ROADWAY DESIGN",null,null,null,null,"C_DE104Series.xlsm"]
["100-7","2012-10-16",null,"BENTON",null,"Last Revision Metric File Path","W:\\Highway\\Design\\RoadDesignDetails\\Old_Details\\ExcelTabs\\MetricTabs\\",null,"Christopher Poole","cpoole","Methods","ROADWAY DESIGN",null,null,null,null,"C_DE105Series.xlsm"]
["100-10","2011-10-18",null,"BLACK HAWK",null,"Seed Path","W:\\Highway\\Design\\CADD\\SpreadSheets\\ExcelTabulations.xltm",null,"Daniel J. Harness","dharnes","Methods","ROADWAY DESIGN",null,null,null,null,"C_DE106Series.xlsm"]
["100-11","2008-08-01",null,"BOONE",null,"VersionCheck Path","W:\\Highway\\Design\\CADD\\SpreadSheets\\ExcelTabulations.xlsm",null,"Jason M. Holst","jholst","Road1","ROADWAY DESIGN",null,null,null,null,"C_DE107Series.xlsm"]
["100-12","2008-08-01",null,"BREMER",null,"Standard Road Plan Path","W:\\Highway\\Design\\StandardRoadPlans\\PDFsAndWebFiles\\Indexes\\SRP_EnglishIndex.xls",null,"Jason R. Strum","jstrum","Road1","ROADWAY DESIGN",null,null,null,null,"C_DE108Series.xlsm"]
["100-12A","2008-08-01",null,"BUCHANAN",null,"Last Revision Standard Road Plan Path","W:\\Highway\\Design\\StandardRoadPlans\\PDFsAndWebFiles\\Old_Indexes\\SRP_EnglishIndex.xls",null,"Robert A. Schoenrock","rschoen","Road1","ROADWAY DESIGN",null,null,null,null,"C_DE110Series.xlsm"]
["100-13","2010-04-20",null,"BUENA VISTA",null,"AddIn Path","W:\\Highway\\Design\\CADD\\SpreadSheets\\ExcelTabulations.xlam",null,"Stacy M. Ryan","sryan","Road1","ROADWAY DESIGN",null,null,null,null,"C_DE111Series.xlsm"]
["100-14","2010-04-20",null,"BUTLER",null,"Old Files Path","W:\\Highway\\Design\\RoadDesignDetails\\Old_Details\\ExcelTabs\\",null,"Nathan A. Thede","nthede","Road1","ROADWAY DESIGN",null,null,null,null,"C_DE112Series.xlsm"]
["100-15","2010-04-20",null,"CALHOUN",null,null,null,null,"Yanxiao Jia","yjia","Road2","ROADWAY DESIGN",null,null,null,null,"C_DE113Series.xlsm"]
["100-16","2010-10-19",null,"CARROLL",null,null,null,null,"Ryan R. Miller","rmille3","Road2","ROADWAY DESIGN",null,null,null,null,"C_DE190Series.xlsm"]
["100-17","2010-04-20",null,"CASS",null,null,null,null,"Dustin T. Skogerboe","dskoge2","Road2","ROADWAY DESIGN",null,null,null,null,"C_DE192Series.xlsm"]
["100-18","2010-04-20",null,"CEDAR",null,null,null,null,"Dung T. Ta","dta","Road2","ROADWAY DESIGN",null,null,null,null,"C_DE231Series.xlsm"]
["100-19","2012-10-16",null,"CERRO GORDO",null,null,null,null,"Allison L. P. Smyth","asmyth","Road2","ROADWAY DESIGN",null,null,null,null,"C_DE232Series.xlsm"]
["100-20","2008-08-01",null,"CHEROKEE",null,null,null,null,"Paul W. Flattery","pflatte","Road3","ROADWAY DESIGN",null,null,null,null,"C_DE252Series.xlsm"]
["100-21","2008-08-01",null,"CHICKASAW",null,null,null,null,"Kelly C. Bell","kbell","Road3","ROADWAY DESIGN",null,null,null,null,"C_DE253Series.xlsm"]
["100-22","2008-08-01",null,"CLARKE",null,null,null,null,"Angela K. Johnson","ajohns1","Road3","ROADWAY DESIGN",null,null,null,null,"C_DE254Series.xlsm"]
["100-23","2010-10-19",null,"CLAY",null,null,null,null,"Elijah D. Gansen","egansen","Road3","ROADWAY DESIGN",null,null,null,null,"C_DE259Series.xlsm"]
["100-24","2013-04-16",null,"CLAYTON",null,null,null,null,"James R. Schoenrock","jschoen","Consultant","ROADWAY DESIGN",null,null,null,null,"C_DE262Series.xlsm"]
["100-26","2008-08-01",null,"CLINTON",null,null,null,null,"Randall E. Schlei","rschlie","Consultant","ROADWAY DESIGN",null,null,null,null,"C_DE271Series.xlsm"]
["100-27","2009-10-20",null,"CRAWFORD",null,null,null,null,"Seana K. Godbold","sgodbol","Roadside","ROADWAY DESIGN",null,null,null,null,"C_DE281Series.xlsm"]
["100-28","2010-10-19",null,"DALLAS",null,null,null,null,"Robert L. Stanley","rstanle","Soils","GEOTECHNICAL DESIGN",null,null,null,null,"C_DE282Series.xlsm"]
["101-4","2002-04-30",null,"DAVIS",null,null,null,null,"Stephen J. Megivern","smegive","Soils","GEOTECHNICAL DESIGN",null,null,null,null,"C_DE290Series.xlsm"]
["101-5","2002-04-30",null,"DECATUR",null,null,null,null,"Mark A. Dell","mdell","Soils","GEOTECHNICAL DESIGN",null,null,null,null,"G_DE101Series.xlsm"]
["101-6","2002-04-30",null,"DELAWARE",null,null,null,null,"David R. Claman","dclaman","Bridge","HYDRAULIC DESIGN",null,null,null,null,"J_DE108Series.xlsm"]
["101-7","2002-04-30",null,"DES MOINES",null,null,null,null,"Zachary K. Abrams","zabrams","TrafficAndSafety","ROADWAY DESIGN",null,null,null,null,"J_DE111Series.xlsm"]
["101-8","2013-04-16",null,"DICKINSON",null,null,null,null,"Engineer of Record","Khocket","Methods","ROADWAY DESIGN",null,null,null,null,"J_DE113Series.xlsm"]
["101-13","2004-04-20",null,"DUBUQUE",null,null,null,null,"William L. Kaufman","wkaufma","Bridge","HYDRAULIC DESIGN",null,null,null,null,"S_DE113Series.xlsm"]
["101-16","2009-10-20",null,"EMMET",null,null,null,null,"David J. Heer","dheer","Soils","GEOTECHNICAL DESIGN"]
["101-17","2011-04-19",null,"FAYETTE"]
["101-18","2011-04-19",null,"FLOYD"]
["102-3","2013-04-16",null,"FRANKLIN"]
["102-4","2011-10-18",null,"FREMONT"]
["102-5","2012-10-16",null,"GREENE"]
["102-5A","2008-08-01",null,"GRUNDY"]
["102-6C","2011-10-18",null,"GUTHRIE"]
["102-10","2008-08-01",null,"HAMILTON"]
["102-11","2008-08-01",null,"HANCOCK"]
["102-12","2008-08-01",null,"HARDIN"]
["102-14","2012-04-17",null,"HARRISON"]
["102-15","2008-08-01",null,"HENRY"]
["103-1","2010-10-19",null,"HOWARD"]
["103-3","2012-10-16",null,"HUMBOLDT"]
["103-4","2011-04-19",null,"IDA"]
["103-5","2008-08-01",null,"IOWA"]
["103-6","2011-04-19",null,"JACKSON"]
["103-7","2008-08-01",null,"JASPER"]
["104-3","2012-10-16",null,"JEFFERSON"]
["104-4","2009-10-20",null,"JOHNSON"]
["104-5A","2011-10-18",null,"JONES"]
["104-5B","2011-10-18",null,"KEOKUK"]
["104-5C","2012-04-17",null,"KOSSUTH"]
["104-8","2008-08-01",null,"LEE"]
["104-8A","2010-04-20",null,"LINN"]
["104-9","2012-04-17",null,"LOUISA"]
["104-10","2008-08-01",null,"LUCAS"]
["104-11","2008-08-01",null,"LYON"]
["104-12","2012-10-16",null,"MADISON"]
["104-13","2013-04-16",null,"MAHASKA"]
["105-1","1994-09-27",null,"MARION"]
["105-3","2005-10-18",null,"MARSHALL"]
["105-4","2011-10-18",null,"MILLS"]
["106-1","2008-08-01",null,"MITCHELL"]
["106-2","2008-08-01",null,"MONONA"]
["106-3","2008-08-01",null,"MONROE"]
["106-4","2013-04-16",null,"MONTGOMERY"]
["106-5","2008-08-01",null,"MUSCATINE"]
["106-7","2008-08-01",null,"O'BRIEN"]
["106-8","2011-04-19",null,"OSCEOLA"]
["107-7","2008-08-01",null,"PAGE"]
["107-22","2013-04-16",null,"PALO ALTO"]
["107-23","2011-10-18",null,"PLYMOUTH"]
["107-24","2008-08-01",null,"POCAHONTAS"]
["107-25","2008-08-01",null,"POLK"]
["107-29","2012-04-17",null,"POTTAWATTAMIE"]
["107-30","2012-04-17",null,"POWESHIEK"]
["107-31","2011-04-19",null,"RINGGOLD"]
["108-1","2008-08-01",null,"SAC"]
["108-2","2008-08-01",null,"SCOTT"]
["108-2A","2008-08-01",null,"SHELBY"]
["108-8A","2010-10-19",null,"SIOUX"]
["108-8B","2011-10-18",null,"STORY"]
["108-8C","2011-10-18",null,"TAMA"]
["108-8D","2010-10-19",null,"TAYLOR"]
["108-9A","2010-04-20",null,"UNION"]
["108-11A","2008-08-01",null,"VAN BUREN"]
["108-12","2008-08-01",null,"WAPELLO"]
["108-13A","2008-08-01",null,"WARREN"]
["108-15","2008-08-01",null,"WASHINGTON"]
["108-16","2010-10-19",null,"WAYNE"]
["108-18","2011-10-18",null,"WEBSTER"]
["108-18B","2012-10-16",null,"WINNEBAGO"]
["108-22","2013-04-16",null,"WINNESHIEK"]
["108-23A","2008-08-01",null,"WOODBURY"]
["108-24","2011-04-19",null,"WORTH"]
["108-26A","2008-08-01",null,"WRIGHT"]
["108-27","2012-10-16"]
["108-28","2008-08-01",null,"SeriesList.xlsx"]
["108-29","2012-10-16"]
["108-30","2013-04-16"]
["108-33","2013-04-16"]
["108-34","2010-10-19"]
["108-35","2012-04-17"]
["110-1","2013-04-16"]
["110-2","2013-04-16"]
["110-3","2008-08-01"]
["110-4","2008-08-01"]
["110-5","2008-08-01"]
["110-6","2008-08-01"]
["110-7A","2012-04-17"]
["110-7B","2010-10-19"]
["110-8","2008-08-01"]
["110-9","2011-10-18"]
["110-10","2008-08-01"]
["110-11","2008-08-01"]
["110-12A","2013-04-16"]
["110-13","2010-04-20"]
["110-14","2013-04-16"]
["110-15","2013-04-16"]
["110-16","2013-04-16"]
["111-1","2012-04-17"]
["111-2","1989-02-28"]
["111-23","2002-10-29"]
["111-25","2011-10-18"]
["112-3","2013-04-16"]
["112-5","2008-08-01"]
["112-6","2013-04-16"]
["112-7","2010-10-19"]
["112-8","2012-10-16"]
["112-9","2012-04-17"]
["112-10","2011-04-19"]
["113-1","2013-04-16"]
["113-2","2013-04-16"]
["113-3","2011-10-18"]
["113-10","2012-10-16"]
["213-2","2011-10-18"]
["213-3","2011-10-18"]
["231-1","2011-10-18"]
["231-2","2012-10-16"]
["232-3A","2012-10-16"]
["232-3B","2012-10-16"]
["232-3C","2012-10-16"]
["232-3D","2012-10-16"]
["232-4","2011-10-18"]
["232-6","2011-10-18"]
["232-7","2012-10-16"]
["232-9","2011-10-18"]
["232-11","2012-10-16"]
["241-5","2011-10-18"]
["252-1","2012-10-16"]
["253-1","2011-10-18"]
["254-1","2001-10-02"]
["262-3","2012-10-16"]
["262-4","2013-04-16"]
["262-5","2005-10-18"]
["262-6","2005-10-18"]
["263-1","2011-10-18"]
["271-1","2011-10-18"]
["271-2","1985-08-20"]
["271-4","2011-10-18"]
["271-9","1994-09-27"]