{"text_format":"1","workbook":"xlsx","n_sheets":8,"sheets":["ProjectInformation","PrintSheets","DE104_3","104_3","PrintSheetTemplate","Note1","BridgeBlock","Index"],"not_rendered":{"charts":0,"images":4,"macros":1,"external_links":0,"defined_names":8,"comments":0,"pivot_tables":0},"unopened":[],"bounds":{"document_bytes":16777216,"sheet_cells":100000,"rows_first":2000,"rows_last":500,"rows_between":2000,"halvings":0,"cell_chars":16384,"cell_head_chars":4096},"cells_cut":0,"cells_raw":0,"read":"whole","date_system":"1900"}

{"sheet":"ProjectInformation","index":0,"n_rows":11,"n_cols":2,"rows_kept":11,"cut":false,"hidden":false,"merged":[[0,0,0,1],[1,0,1,1],[9,0,9,1],[3,0,4,0]]}
["CPN DATA"]
["INFORMATION ADDED BY DESIGNER"]
["Section Engineer","Flattery"]
["Design Team","Johnson"]
[]
["County","TAMA"]
["Project Number","NHSX-030-6(189)--3H-86"]
["English or Metric","ENGLISH"]
["Revised","2018-06-08"]
["Bridge Block"]
["File No."]

{"sheet":"PrintSheets","index":1,"n_rows":95,"n_cols":179,"rows_kept":95,"cut":false,"hidden":false,"merged":[[93,171,93,178],[94,1,94,178],[93,101,93,106],[93,107,93,118],[93,119,93,148],[93,149,93,158],[93,159,93,164],[93,165,93,170],[93,1,93,7],[93,8,93,14],[93,15,93,21],[93,22,93,30],[93,31,93,64],[93,65,93,100]]}
[" "]
[]
[]
[]
[]
[]
[]
[]
[]
[]
[]
[]
[]
[]
[]
[]
[]
[]
[]
[]
[]
[]
[]
[]
[]
[]
[]
[]
[]
[]
[]
[]
[]
[]
[]
[]
[]
[]
[]
[]
[]
[]
[]
[]
[]
[]
[]
[]
[]
[]
[]
[]
[]
[]
[]
[]
[]
[]
[]
[]
[]
[]
[]
[]
[]
[]
[]
[]
[]
[]
[]
[]
[]
[]
[]
[]
[]
[]
[]
[]
[]
[]
[]
[]
[]
[]
[]
[]
[]
[]
[]
[]
[null,"","","","","","","","","","","","","","","","","","","","","","","","","","","","","","","","","","","","","","","","","","","","","","","","","","","","","","","","","","","","","","","","","","","","","","","","","","","","","","","","","","","","","","","","","","","","","","","","","","","","","","","","","","","","","","","","","","","","","","","","","","","","","","","","","","","",null,null,null,null,null,null,null,null,null,null,null,null,null,null,null,null,null,null,null,null,null,null,null,null,null,null,null,null,null,null,null,null,null,null,null,null,null,null,null,null,null,null,null,null,null,null,""]
[null,"FILE NO.",null,null,null,null,null,null,{"$f":"IF(ProjectInformation!$B$11<>\"\",ProjectInformation!$B$11,\"\")","v":""},null,null,null,null,null,null,{"$f":"UPPER(ProjectInformation!B8)","v":"ENGLISH"},null,null,null,null,null,null,"DESIGN TEAM",null,null,null,null,null,null,null,null,{"$f":"IF(AND(ProjectInformation!$B$3<>\"\",ProjectInformation!$B$4<>\"\",ProjectInformation!$B$5<>\"\"),ProjectInformation!$B$3&\"\\\"&ProjectInformation!$B$4&\"\\\"&ProjectInformation!$B$5,IF(AND(ProjectInformation!$B$3<>\"\",ProjectInformation!$B$4<>\"\"),ProjectInformation!$B$3&\"\\\"&ProjectInformation!$B$4,IF(ProjectInformation!$B$3<>\"\",ProjectInformation!$B$3,\"\")))","v":"Flattery\\Johnson"},null,null,null,null,null,null,null,null,null,null,null,null,null,null,null,null,null,null,null,null,null,null,null,null,null,null,null,null,null,null,null,null,null,{"$f":"IF(ProjectInformation!$B$6<>\"\",ProjectInformation!$B$6,\"\")","v":"TAMA"},null,null,null,null,null,null,null,null,null,null,null,null,null,null,null,null,null,null,null,null,null,null,null,null,null,null,null,null,null,null,null,null,null,null,null,"COUNTY",null,null,null,null,null,"PROJECT NUMBER",null,null,null,null,null,null,null,null,null,null,null,{"$f":"IF(ProjectInformation!$B$7<>\"\",ProjectInformation!$B$7,\"\")","v":"NHSX-030-6(189)--3H-86"},null,null,null,null,null,null,null,null,null,null,null,null,null,null,null,null,null,null,null,null,null,null,null,null,null,null,null,null,null,"SHEET NUMBER",null,null,null,null,null,null,null,null,null,"CD.2",null,null,null,null,null,{"$f":"IF(FP94<>\"\",\"REVISED\",\"\")","v":"REVISED"},null,null,null,null,null,{"$f":"IF(ProjectInformation!$B$9<>\"\",ProjectInformation!$B$9,\"\")","v":"2018-06-08"}]
["","5/30/2018     2:05:07 PM     ajohns1     c:\\pw_work\\pwmain\\ajohns1\\d0569206\\86030189_Field Adjustment_CD1.xlsm"]

{"sheet":"DE104_3","index":2,"n_rows":50,"n_cols":90,"rows_kept":50,"cut":false,"hidden":false,"merged":[[19,2,19,42],[19,44,19,52],[19,53,19,58],[20,2,20,42],[20,44,20,84],[21,2,21,42],[21,44,21,84],[24,2,32,2],[24,3,33,3],[24,4,33,4],[24,5,32,5],[24,6,33,6],[24,7,32,7],[24,22,32,22],[24,23,32,26],[24,27,31,30],[24,31,32,32],[24,33,30,36],[24,37,32,37],[32,27,32,28],[22,2,22,42],[14,44,14,84],[15,2,17,42],[15,44,15,84],[16,44,18,84],[18,2,18,10],[18,11,18,16],[22,44,22,84],[23,2,23,42],[23,44,23,84],[32,29,32,30],[24,84,33,84],[31,34,33,34],[31,35,33,35],[31,36,33,36],[31,76,33,76],[31,77,33,77],[31,78,33,78],[24,65,32,68],[24,69,31,72],[24,73,32,74],[24,75,30,78],[24,79,32,79],[24,59,32,59],[24,60,32,60],[24,61,32,62],[24,63,32,63],[24,64,32,64],[24,83,31,83],[24,55,32,55],[24,56,32,56],[24,57,32,57],[24,45,33,45],[24,46,33,46],[24,47,32,47],[24,48,33,48],[24,49,32,49],[24,50,33,50],[24,51,32,51],[24,52,32,52],[24,53,32,54],[24,80,32,80],[32,69,32,70],[32,71,32,72],[24,8,33,8],[24,9,32,9],[24,10,32,10],[24,11,32,12],[24,13,32,13],[24,14,32,14],[24,81,31,81],[24,82,31,82],[24,38,32,38],[24,39,31,39],[24,40,31,40],[24,15,32,15],[24,16,32,16],[24,17,32,17],[24,18,32,18],[24,19,32,20],[24,21,32,21],[24,41,31,41],[24,42,33,42],[24,44,32,44],[24,58,32,58]]}
["TabTitle",{"$f":"C16","v":"DRAINAGE STRUCTURE BY ROAD CONTRACTOR"}]
["Number of Tab Columns",41]
["DE Starter Row Number",35]
["TabSheet Starter Row Number",21]
["TabSheet Header Row Count",20]
["Top Header Cell","AS15"]
["Bottom Header Cell","CG34"]
["DESheet Row Count",7]
["Fixed Empty Rows",0]
["Usable Empty Rows",20]
["Total Rows Placed",24,"xlRight","xlRight","xlRight","xlRight","xlRight","xlRight","xlRight","xlRight","xlRight","xlRight","xlRight","xlRight","xlRight","xlRight","xlRight","xlRight","xlRight","xlLeft","xlRight","xlLeft","xlRight","xlRight","xlRight","xlRight","xlRight","xlRight","xlRight","xlRight","xlRight","xlRight","xlRight","xlCenter","xlRight","xlRight","xlRight","xlRight","xlRight","xlRight","xlRight","xlRight","xlLeft",null,{"$f":"C11","v":"xlRight"},"xlRight","xlRight","xlRight","xlRight","xlRight","xlRight","xlRight","xlRight","xlRight","xlRight","xlRight","xlRight","xlRight","xlRight","xlRight",{"$f":"S11","v":"xlRight"},"xlLeft","xlRight","xlLeft","xlRight","xlRight","xlRight","xlRight","xlRight","xlRight","xlRight","xlRight","xlRight","xlRight","xlRight","xlCenter",{"$f":"AI11","v":"xlRight"},"xlRight","xlRight","xlRight","xlRight","xlRight","xlRight","xlRight","xlLeft"]
["Total Rows Needed",{"$f":"SUM(B8:B10)","v":27},"0.0","#+00.00","General","0","General","0","General","0.0","0.00","General","General","0","0","0","0","0","0","General","0","General","0","0.00","0.00","0.00","0.00","0.0","0.0","0.0","0.0","0","0","General","#+00.00","0.00","General","0.0","0.0","0.0","0.0","0.0","General",null,"0.0","#+00.00","General","0","General","0","General","0.0","0.00","General","General","0","0","0","0","0","0","General","0","General","0","0.00","0.00","0.00","0.00","0.0","0.0","0.0","0.0","0","0","General","#+00.00","0.00","General","0.0","0.0","0.0","0.0","0.0","General"]
["Last Tab DE Starter Row",35,{"$f":"CELL(\"width\",C13)","v":6},25,8,5,6,6,5,6,5,5,5,5,5,5,5,5,5,6,5,8,7,10,10,10,10,7,7,7,7,5,5,5,14,11,5,8,7,8,7,8,6,null,{"$f":"CELL(\"width\",AS13)","v":0},0,0,0,0,0,0,0,0,0,0,0,0,0,0,0,0,0,0,0,0,0,0,0,0,0,0,0,0,0,0,0,0,0,0,0,0,0,0,0,0]
["Last Tab Tabsheet Starter Row",21,"A","B","C","D","E","F","G","H","I","J","K","L","M","N","O","P","Q","R","S","T","U","V","W","X","Y","Z","AA","AB","AC","AD","AE","AF","AG","AH","AI","AJ","AK","AL","AM","AN","AO",null,{"$f":"LOWER(C14)","v":"a"},"b","c","d","e","f","g","h","i","j","k","l","m","n","o","p","q","r","s","t","u","v","w","x","y","z","aa","ab","ac","ad","ae","af","ag","ah","ai","aj","ak","al","am","an","ao"]
["Last Copy Starter Row",1,null,null,null,null,null,null,null,null,null,null,null,null,null,null,null,null,null,null,null,null,null,null,null,null,null,null,null,null,null,null,null,null,null,null,"Totals:",{"$f":"SUBTOTAL(9,AL35:AL5499)","v":323.22222222222217},{"$f":"SUBTOTAL(9,AM35:AM5499)","v":0},{"$f":"SUBTOTAL(9,AN35:AN5499)","v":0},{"$f":"SUBTOTAL(9,AO35:AO5499)","v":0},{"$f":"SUBTOTAL(9,AP35:AP5499)","v":0},null,null,"104-3M",null,null,null,null,null,null,null,null,null,null,null,null,null,null,null,null,null,null,null,null,null,null,null,null,null,null,null,null,null,null,null,null,null,null,null,null,null,null,null,null,null,{"$f":"G25","v":"Kind\nOf\nPipe"},"Pipe Type",{"$f":"T25","v":"Type 'C' Connections*\n(DR-122)"},{"$f":"V25","v":"Connected\nPipe Joint*\n(DR-121)"}]
["Tab Loop Number",2,"DRAINAGE STRUCTURE BY ROAD CONTRACTOR",null,null,null,null,null,null,null,null,null,null,null,null,null,null,null,null,null,null,null,null,null,null,null,null,null,null,null,null,null,null,null,null,null,null,null,null,null,null,null,null,null,{"$f":"B17","v":"Modified"},null,null,null,null,null,null,null,null,null,null,null,null,null,null,null,null,null,null,null,null,null,null,null,null,null,null,null,null,null,null,null,null,null,null,null,null,null,null,null,null,null,"CMP","Reinforced Concrete Pipe.","C-1","Type 1"]
["Revision Date","Modified",null,null,null,null,null,null,null,null,null,null,null,null,null,null,null,null,null,null,null,null,null,null,null,null,null,null,null,null,null,null,null,null,null,null,null,null,null,null,null,null,null,null,{"$f":"C16","v":"DRAINAGE STRUCTURE BY ROAD CONTRACTOR"},null,null,null,null,null,null,null,null,null,null,null,null,null,null,null,null,null,null,null,null,null,null,null,null,null,null,null,null,null,null,null,null,null,null,null,null,null,null,null,null,null,"LCP","Corrugated Metal Pipe.","C-2","Type 2"]
["Tabulation Width",4,null,null,null,null,null,null,null,null,null,null,null,null,null,null,null,null,null,null,null,null,null,null,null,null,null,null,null,null,null,null,null,null,null,null,null,null,null,null,null,null,null,null,null,null,null,null,null,null,null,null,null,null,null,null,null,null,null,null,null,null,null,null,null,null,null,null,null,null,null,null,null,null,null,null,null,null,null,null,null,null,null,null,null,null,"RCP",null,"C-3","Type 3"]
["Horizontal Grid Lines","Yes","   Length of unclassified pipe calculated is based on using ",null,null,null,null,null,null,null,null,"Reinforced Concrete Pipe.",null,null,null,null,null,null,null,null,null,null,null,null,null,null,null,null,null,null,null,null,null,null,null,null,null,null,null,null,null,null,null,null,null,null,null,null,null,null,null,null,null,null,null,null,null,null,null,null,null,null,null,null,null,null,null,null,null,null,null,null,null,null,null,null,null,null,null,null,null,null,null,null,null,null,"SARC",null,"C-4"]
[null,null,"  * Not a bid item",null,null,null,null,null,null,null,null,null,null,null,null,null,null,null,null,null,null,null,null,null,null,null,null,null,null,null,null,null,null,null,null,null,null,null,null,null,null,null,null,null,{"$f":"C19","v":"   Length of unclassified pipe calculated is based on using "},null,null,null,null,null,null,null,null,{"$f":"L19","v":"Reinforced Concrete Pipe."},null,null,null,null,null,null,null,null,null,null,null,null,null,null,null,null,null,null,null,null,null,null,null,null,null,null,null,null,null,null,null,null,"UNCL"]
[null,null,"    Diameter or equivalent diameter",null,null,null,null,null,null,null,null,null,null,null,null,null,null,null,null,null,null,null,null,null,null,null,null,null,null,null,null,null,null,null,null,null,null,null,null,null,null,null,null,null,{"$f":"C20","v":"  * Not a bid item"}]
[null,null,"    UNCL = Unclassified Pipe     CMP = Corrugated Metal Pipe     RCP = Reinforced Concrete Pipe     LCP = Arch or Elliptical Low Clearance Pipe     SARC = Steel Arch Pipe",null,null,null,null,null,null,null,null,null,null,null,null,null,null,null,null,null,null,null,null,null,null,null,null,null,null,null,null,null,null,null,null,null,null,null,null,null,null,null,null,null,{"$f":"C21","v":"    Diameter or equivalent diameter"}]
[null,null,"    Backfill according to DR-101",null,null,null,null,null,null,null,null,null,null,null,null,null,null,null,null,null,null,null,null,null,null,null,null,null,null,null,null,null,null,null,null,null,null,null,null,null,null,null,null,null,{"$f":"C22","v":"    UNCL = Unclassified Pipe     CMP = Corrugated Metal Pipe     RCP = Reinforced Concrete Pipe     LCP = Arch or Elliptical Low Clearance Pipe     SARC = Steel Arch Pipe"}]
[null,null,{"$f":"\"This Data Entry Sheet fills Tab \"&AS15&\" effective \"&TEXT(B17,\"mm-dd-yy\")","v":"This Data Entry Sheet fills Tab 104-3M effective Modified"},null,null,null,null,null,null,null,null,null,null,null,null,null,null,null,null,null,null,null,null,null,null,null,null,null,null,null,null,null,null,null,null,null,null,null,null,null,null,null,null,null,{"$f":"C23","v":"    Backfill according to DR-101"}]
[null,null,"Drainage Area","Location","Type","Size","Kind\nOf\nPipe","Length New Const.","Bedding\nClass","Design Cover (H)","Camber*\n(DR-102)","Apron\nNo.",null,"Apron Guard*\n(DR-213)","Elbow*\n(DR-141)","Diaphragm*\n(DR-501)","Tee Section*\n(DR-142)","\"D\" Section*\n(DR-141)","Reducer*","Type 'C' Connections*\n(DR-122)",null,"Connected\nPipe Joint*\n(DR-121)","DR-205 Inlet          Apron Top","Flow Line\nElevations",null,null,null,"Dimensions\nLin. Ft.",null,null,null,"Skew Ahead\nDegrees",null,"Dike",null,null,null,"Class\n20","Flowable\nMortar","Floodable* Backfill","Porous*\nBackfill","Flooded\nBackfill","Remarks",null,{"$f":"C25","v":"Drainage Area"},"Location","Type","Size","Kind\nOf\nPipe","Length New Const.","Bedding\nClass","Design Cover (H)","Camber*\n(DR-102)","Apron\nNo.",null,{"$f":"N25","v":"Apron Guard*\n(DR-213)"},"Elbow*\n(DR-141)","Diaphragm*\n(DR-501)","Tee Section*\n(DR-142)","\"D\" Section*\n(DR-141)","Reducer*","Type 'C' Connections*\n(DR-122)",null,{"$f":"V25","v":"Connected\nPipe Joint*\n(DR-121)"},{"$f":"W25","v":"DR-205 Inlet          Apron Top"},{"$f":"X25","v":"Flow Line\nElevations"},null,null,null,{"$f":"AB25","v":"Dimensions\nLin. Ft."},null,null,null,{"$f":"AF25","v":"Skew Ahead\nDegrees"},null,{"$f":"AH25","v":"Dike"},null,null,null,{"$f":"AL25","v":"Class\n20"},"Flowable\nMortar","Floodable* Backfill","Porous*\nBackfill","Flooded\nBackfill","Remarks"]
[]
[]
[]
[]
[]
[]
[null,null,null,null,null,null,null,null,null,null,null,null,null,null,null,null,null,null,null,null,null,null,null,null,null,null,null,null,null,null,null,null,null,"Rt.","Location\nStation","Top\nElevation","Type",null,null,null,null,null,null,null,null,null,null,null,null,null,null,null,null,null,null,null,null,null,null,null,null,null,null,null,null,null,null,null,null,null,null,null,null,null,null,{"$f":"AH32","v":"Rt."},{"$f":"AI32","v":"Location\nStation"},{"$f":"AJ32","v":"Top\nElevation"},{"$f":"AK32","v":"Type"}]
[null,null,null,null,null,null,null,null,null,null,null,null,null,null,null,null,null,null,null,null,null,null,null,null,null,null,null,"Total",null,"Extensions",null,null,null,null,null,null,null,null,null,"(A)","(B)","(A+B)",null,null,null,null,null,null,null,null,null,null,null,null,null,null,null,null,null,null,null,null,null,null,null,null,null,null,null,{"$f":"AB33","v":"Total"},null,{"$f":"AD33","v":"Extensions"},null,null,null,null,null,null,null,null,null,{"$f":"AN33","v":"(A)"},"(B)","(A+B)"]
[null,null,"ACRE",null,null,"IN",null,"LF",null,"FT","FT","IN","OUT","No.","No.","No.","No.","No.","No.","Type","No.","Type","Elev.","Lt.","Rt.","Other","Other","Lt.","Rt.","Lt.","Rt.","Lt.","Rt.","Lt.",null,null,null,"CY","CY","CY","CY","CY",null,null,{"$f":"C34","v":"ACRE"},null,null,{"$f":"F34","v":"IN"},null,{"$f":"H34","v":"LF"},null,{"$f":"J34","v":"FT"},"FT","IN","OUT","No.","No.","No.","No.","No.","No.","Type","No.","Type","Elev.","Lt.","Rt.","Other","Other",{"$f":"AB34","v":"Lt."},{"$f":"AC34","v":"Rt."},{"$f":"AD34","v":"Lt."},{"$f":"AE34","v":"Rt."},{"$f":"AF34","v":"Lt."},{"$f":"AG34","v":"Rt."},{"$f":"AH34","v":"Lt."},null,null,null,{"$f":"AL34","v":"CY"},{"$f":"AM34","v":"CY"},"CY","CY","CY"]
[null,null,null,"MAINLINE"]
[null,null,null,"482+25.00",651,24,"UNCL",302,null,23,null,null,null,null,null,null,null,null,null,null,null,null,null,866.52,876.95,null,null,185.8,116,null,null,null,null,null,null,null,null,{"$f":"624/27","v":23.111111111111111}]
[null,null,null,"492+00.00",651,24,"UNCL",218,null,11,null,null,null,null,null,null,null,null,null,null,null,null,null,895.56,896.14,null,null,118,100,null,null,null,null,null,null,null,null,{"$f":"267.5/27","v":9.9074074074074066}]
[null,null,null,62475,651,24,"UNCL",240,null,11,null,null,null,null,null,null,null,null,null,null,null,null,null,918.28,923.08,null,null,128,112,null,null,null,null,null,null,null,null,{"$f":"62*56/27","v":128.59259259259258}]
[]
[]
[]
[]
[]
[]
[]
[]
[]
[]
[]
[null,null,null,"TOTALS:",null,null,null,null,null,null,null,null,null,null,null,null,null,null,null,null,null,null,null,null,null,null,null,null,null,null,null,null,null,null,null,null,null,{"$f":"SUM(AL36:AL49)","v":161.61111111111109},{"$f":"SUM(AM36:AM49)","v":0},0,0,0]

{"sheet":"104_3","index":3,"n_rows":44,"n_cols":41,"rows_kept":44,"cut":false,"hidden":false,"merged":[[10,19,18,19],[10,37,17,37],[6,0,6,40],[18,25,18,26],[18,27,18,28],[17,34,19,34],[7,0,7,40],[8,0,8,40],[9,0,9,40],[10,8,18,8],[10,9,18,10],[10,11,18,11],[10,12,18,12],[10,13,18,13],[10,38,17,38],[10,39,17,39],[10,40,19,40],[17,32,19,32],[17,33,19,33],[10,31,16,34],[10,35,18,35],[10,36,18,36],[0,0,0,40],[1,0,1,40],[2,0,4,40],[5,0,5,8],[5,9,5,14],[10,5,18,5],[10,6,19,6],[10,29,18,30],[10,0,18,0],[10,1,19,1],[10,2,19,2],[10,3,18,3],[10,4,19,4],[10,14,18,14],[10,15,18,15],[10,16,18,16],[10,20,18,20],[10,7,18,7],[10,17,18,18],[10,21,18,24],[10,25,17,28]]}
["104-3M"]
["Modified"]
["DRAINAGE STRUCTURE BY ROAD CONTRACTOR"]
[]
[]
["   Length of unclassified pipe calculated is based on using ",null,null,null,null,null,null,null,null,"Reinforced Concrete Pipe."]
["  * Not a bid item"]
["    Diameter or equivalent diameter"]
["    UNCL = Unclassified Pipe     CMP = Corrugated Metal Pipe     RCP = Reinforced Concrete Pipe     LCP = Arch or Elliptical Low Clearance Pipe     SARC = Steel Arch Pipe"]
["    Backfill according to DR-101"]
["Drainage Area","Location","Type","Size","Kind\nOf\nPipe","Length New Const.","Bedding\nClass","Design Cover (H)","Camber*\n(DR-102)","Apron\nNo.",null,"Apron Guard*\n(DR-213)","Elbow*\n(DR-141)","Diaphragm*\n(DR-501)","Tee Section*\n(DR-142)","\"D\" Section*\n(DR-141)","Reducer*","Type 'C' Connections*\n(DR-122)",null,"Connected\nPipe Joint*\n(DR-121)","DR-205 Inlet          Apron Top","Flow Line\nElevations",null,null,null,"Dimensions\nLin. Ft.",null,null,null,"Skew Ahead\nDegrees",null,"Dike",null,null,null,"Class\n20","Flowable\nMortar","Floodable* Backfill","Porous*\nBackfill","Flooded\nBackfill","Remarks"]
[]
[]
[]
[]
[]
[]
[null,null,null,null,null,null,null,null,null,null,null,null,null,null,null,null,null,null,null,null,null,null,null,null,null,null,null,null,null,null,null,"Rt.","Location\nStation","Top\nElevation","Type"]
[null,null,null,null,null,null,null,null,null,null,null,null,null,null,null,null,null,null,null,null,null,null,null,null,null,"Total",null,"Extensions",null,null,null,null,null,null,null,null,null,"(A)","(B)","(A+B)"]
["ACRE",null,null,"IN",null,"LF",null,"FT","FT","IN","OUT","No.","No.","No.","No.","No.","No.","Type","No.","Type","Elev.","Lt.","Rt.","Other","Other","Lt.","Rt.","Lt.","Rt.","Lt.","Rt.","Lt.",null,null,null,"CY","CY","CY","CY","CY"]
[{"$f":"IF(OFFSET(DE104_3!$C$35,ROWS($C$35:C35)-1,COLUMNS($C$35:C35)-1)<>\"\",OFFSET(DE104_3!$C$35,ROWS($C$35:C35)-1,COLUMNS($C$35:C35)-1),\"\")","v":""},{"$f":"IF(OFFSET(DE104_3!$D$35,ROWS($D$35:D35)-1,COLUMNS($D$35:D35)-1)<>\"\",OFFSET(DE104_3!$D$35,ROWS($D$35:D35)-1,COLUMNS($D$35:D35)-1),\"\")","v":"MAINLINE"},{"$f":"IF(OFFSET(DE104_3!$E$35,ROWS($E$35:E35)-1,COLUMNS($E$35:E35)-1)<>\"\",OFFSET(DE104_3!$E$35,ROWS($E$35:E35)-1,COLUMNS($E$35:E35)-1),\"\")","v":""},{"$f":"IF(OFFSET(DE104_3!$F$35,ROWS($F$35:F35)-1,COLUMNS($F$35:F35)-1)<>\"\",OFFSET(DE104_3!$F$35,ROWS($F$35:F35)-1,COLUMNS($F$35:F35)-1),\"\")","v":""},{"$f":"IF(OFFSET(DE104_3!$G$35,ROWS($G$35:G35)-1,COLUMNS($G$35:G35)-1)<>\"\",OFFSET(DE104_3!$G$35,ROWS($G$35:G35)-1,COLUMNS($G$35:G35)-1),\"\")","v":""},{"$f":"IF(OFFSET(DE104_3!$H$35,ROWS($H$35:H35)-1,COLUMNS($H$35:H35)-1)<>\"\",OFFSET(DE104_3!$H$35,ROWS($H$35:H35)-1,COLUMNS($H$35:H35)-1),\"\")","v":""},{"$f":"IF(OFFSET(DE104_3!$I$35,ROWS($I$35:I35)-1,COLUMNS($I$35:I35)-1)<>\"\",OFFSET(DE104_3!$I$35,ROWS($I$35:I35)-1,COLUMNS($I$35:I35)-1),\"\")","v":""},{"$f":"IF(OFFSET(DE104_3!$J$35,ROWS($J$35:J35)-1,COLUMNS($J$35:J35)-1)<>\"\",OFFSET(DE104_3!$J$35,ROWS($J$35:J35)-1,COLUMNS($J$35:J35)-1),\"\")","v":""},{"$f":"IF(OFFSET(DE104_3!$K$35,ROWS($K$35:K35)-1,COLUMNS($K$35:K35)-1)<>\"\",OFFSET(DE104_3!$K$35,ROWS($K$35:K35)-1,COLUMNS($K$35:K35)-1),\"\")","v":""},{"$f":"IF(OFFSET(DE104_3!$L$35,ROWS($L$35:L35)-1,COLUMNS($L$35:L35)-1)<>\"\",OFFSET(DE104_3!$L$35,ROWS($L$35:L35)-1,COLUMNS($L$35:L35)-1),\"\")","v":""},{"$f":"IF(OFFSET(DE104_3!$M$35,ROWS($M$35:M35)-1,COLUMNS($M$35:M35)-1)<>\"\",OFFSET(DE104_3!$M$35,ROWS($M$35:M35)-1,COLUMNS($M$35:M35)-1),\"\")","v":""},{"$f":"IF(OFFSET(DE104_3!$N$35,ROWS($N$35:N35)-1,COLUMNS($N$35:N35)-1)<>\"\",OFFSET(DE104_3!$N$35,ROWS($N$35:N35)-1,COLUMNS($N$35:N35)-1),\"\")","v":""},{"$f":"IF(OFFSET(DE104_3!$O$35,ROWS($O$35:O35)-1,COLUMNS($O$35:O35)-1)<>\"\",OFFSET(DE104_3!$O$35,ROWS($O$35:O35)-1,COLUMNS($O$35:O35)-1),\"\")","v":""},{"$f":"IF(OFFSET(DE104_3!$P$35,ROWS($P$35:P35)-1,COLUMNS($P$35:P35)-1)<>\"\",OFFSET(DE104_3!$P$35,ROWS($P$35:P35)-1,COLUMNS($P$35:P35)-1),\"\")","v":""},{"$f":"IF(OFFSET(DE104_3!$Q$35,ROWS($Q$35:Q35)-1,COLUMNS($Q$35:Q35)-1)<>\"\",OFFSET(DE104_3!$Q$35,ROWS($Q$35:Q35)-1,COLUMNS($Q$35:Q35)-1),\"\")","v":""},{"$f":"IF(OFFSET(DE104_3!$R$35,ROWS($R$35:R35)-1,COLUMNS($R$35:R35)-1)<>\"\",OFFSET(DE104_3!$R$35,ROWS($R$35:R35)-1,COLUMNS($R$35:R35)-1),\"\")","v":""},{"$f":"IF(OFFSET(DE104_3!$S$35,ROWS($S$35:S35)-1,COLUMNS($S$35:S35)-1)<>\"\",OFFSET(DE104_3!$S$35,ROWS($S$35:S35)-1,COLUMNS($S$35:S35)-1),\"\")","v":""},{"$f":"IF(OFFSET(DE104_3!$T$35,ROWS($T$35:T35)-1,COLUMNS($T$35:T35)-1)<>\"\",OFFSET(DE104_3!$T$35,ROWS($T$35:T35)-1,COLUMNS($T$35:T35)-1),\"\")","v":""},{"$f":"IF(OFFSET(DE104_3!$U$35,ROWS($U$35:U35)-1,COLUMNS($U$35:U35)-1)<>\"\",OFFSET(DE104_3!$U$35,ROWS($U$35:U35)-1,COLUMNS($U$35:U35)-1),\"\")","v":""},{"$f":"IF(OFFSET(DE104_3!$V$35,ROWS($V$35:V35)-1,COLUMNS($V$35:V35)-1)<>\"\",OFFSET(DE104_3!$V$35,ROWS($V$35:V35)-1,COLUMNS($V$35:V35)-1),\"\")","v":""},{"$f":"IF(OFFSET(DE104_3!$W$35,ROWS($W$35:W35)-1,COLUMNS($W$35:W35)-1)<>\"\",OFFSET(DE104_3!$W$35,ROWS($W$35:W35)-1,COLUMNS($W$35:W35)-1),\"\")","v":""},{"$f":"IF(OFFSET(DE104_3!$X$35,ROWS($X$35:X35)-1,COLUMNS($X$35:X35)-1)<>\"\",OFFSET(DE104_3!$X$35,ROWS($X$35:X35)-1,COLUMNS($X$35:X35)-1),\"\")","v":""},{"$f":"IF(OFFSET(DE104_3!$Y$35,ROWS($Y$35:Y35)-1,COLUMNS($Y$35:Y35)-1)<>\"\",OFFSET(DE104_3!$Y$35,ROWS($Y$35:Y35)-1,COLUMNS($Y$35:Y35)-1),\"\")","v":""},{"$f":"IF(OFFSET(DE104_3!$Z$35,ROWS($Z$35:Z35)-1,COLUMNS($Z$35:Z35)-1)<>\"\",OFFSET(DE104_3!$Z$35,ROWS($Z$35:Z35)-1,COLUMNS($Z$35:Z35)-1),\"\")","v":""},{"$f":"IF(OFFSET(DE104_3!$AA$35,ROWS($AA$35:AA35)-1,COLUMNS($AA$35:AA35)-1)<>\"\",OFFSET(DE104_3!$AA$35,ROWS($AA$35:AA35)-1,COLUMNS($AA$35:AA35)-1),\"\")","v":""},{"$f":"IF(OFFSET(DE104_3!$AB$35,ROWS($AB$35:AB35)-1,COLUMNS($AB$35:AB35)-1)<>\"\",OFFSET(DE104_3!$AB$35,ROWS($AB$35:AB35)-1,COLUMNS($AB$35:AB35)-1),\"\")","v":""},{"$f":"IF(OFFSET(DE104_3!$AC$35,ROWS($AC$35:AC35)-1,COLUMNS($AC$35:AC35)-1)<>\"\",OFFSET(DE104_3!$AC$35,ROWS($AC$35:AC35)-1,COLUMNS($AC$35:AC35)-1),\"\")","v":""},{"$f":"IF(OFFSET(DE104_3!$AD$35,ROWS($AD$35:AD35)-1,COLUMNS($AD$35:AD35)-1)<>\"\",OFFSET(DE104_3!$AD$35,ROWS($AD$35:AD35)-1,COLUMNS($AD$35:AD35)-1),\"\")","v":""},{"$f":"IF(OFFSET(DE104_3!$AE$35,ROWS($AE$35:AE35)-1,COLUMNS($AE$35:AE35)-1)<>\"\",OFFSET(DE104_3!$AE$35,ROWS($AE$35:AE35)-1,COLUMNS($AE$35:AE35)-1),\"\")","v":""},{"$f":"IF(OFFSET(DE104_3!$AF$35,ROWS($AF$35:AF35)-1,COLUMNS($AF$35:AF35)-1)<>\"\",OFFSET(DE104_3!$AF$35,ROWS($AF$35:AF35)-1,COLUMNS($AF$35:AF35)-1),\"\")","v":""},{"$f":"IF(OFFSET(DE104_3!$AG$35,ROWS($AG$35:AG35)-1,COLUMNS($AG$35:AG35)-1)<>\"\",OFFSET(DE104_3!$AG$35,ROWS($AG$35:AG35)-1,COLUMNS($AG$35:AG35)-1),\"\")","v":""},{"$f":"IF(OFFSET(DE104_3!$AH$35,ROWS($AH$35:AH35)-1,COLUMNS($AH$35:AH35)-1)<>\"\",OFFSET(DE104_3!$AH$35,ROWS($AH$35:AH35)-1,COLUMNS($AH$35:AH35)-1),\"\")","v":""},{"$f":"IF(OFFSET(DE104_3!$AI$35,ROWS($AI$35:AI35)-1,COLUMNS($AI$35:AI35)-1)<>\"\",OFFSET(DE104_3!$AI$35,ROWS($AI$35:AI35)-1,COLUMNS($AI$35:AI35)-1),\"\")","v":""},{"$f":"IF(OFFSET(DE104_3!$AJ$35,ROWS($AJ$35:AJ35)-1,COLUMNS($AJ$35:AJ35)-1)<>\"\",OFFSET(DE104_3!$AJ$35,ROWS($AJ$35:AJ35)-1,COLUMNS($AJ$35:AJ35)-1),\"\")","v":""},{"$f":"IF(OFFSET(DE104_3!$AK$35,ROWS($AK$35:AK35)-1,COLUMNS($AK$35:AK35)-1)<>\"\",OFFSET(DE104_3!$AK$35,ROWS($AK$35:AK35)-1,COLUMNS($AK$35:AK35)-1),\"\")","v":""},{"$f":"IF(OFFSET(DE104_3!$AL$35,ROWS($AL$35:AL35)-1,COLUMNS($AL$35:AL35)-1)<>\"\",OFFSET(DE104_3!$AL$35,ROWS($AL$35:AL35)-1,COLUMNS($AL$35:AL35)-1),\"\")","v":""},{"$f":"IF(OFFSET(DE104_3!$AM$35,ROWS($AM$35:AM35)-1,COLUMNS($AM$35:AM35)-1)<>\"\",OFFSET(DE104_3!$AM$35,ROWS($AM$35:AM35)-1,COLUMNS($AM$35:AM35)-1),\"\")","v":""},{"$f":"IF(OFFSET(DE104_3!$AN$35,ROWS($AN$35:AN35)-1,COLUMNS($AN$35:AN35)-1)<>\"\",OFFSET(DE104_3!$AN$35,ROWS($AN$35:AN35)-1,COLUMNS($AN$35:AN35)-1),\"\")","v":""},{"$f":"IF(OFFSET(DE104_3!$AO$35,ROWS($AO$35:AO35)-1,COLUMNS($AO$35:AO35)-1)<>\"\",OFFSET(DE104_3!$AO$35,ROWS($AO$35:AO35)-1,COLUMNS($AO$35:AO35)-1),\"\")","v":""},{"$f":"IF(OFFSET(DE104_3!$AP$35,ROWS($AP$35:AP35)-1,COLUMNS($AP$35:AP35)-1)<>\"\",OFFSET(DE104_3!$AP$35,ROWS($AP$35:AP35)-1,COLUMNS($AP$35:AP35)-1),\"\")","v":""},{"$f":"IF(OFFSET(DE104_3!$AQ$35,ROWS($AQ$35:AQ35)-1,COLUMNS($AQ$35:AQ35)-1)<>\"\",OFFSET(DE104_3!$AQ$35,ROWS($AQ$35:AQ35)-1,COLUMNS($AQ$35:AQ35)-1),\"\")","v":""}]
[{"$f":"IF(OFFSET(DE104_3!$C$35,ROWS($C$35:C36)-1,COLUMNS($C$35:C36)-1)<>\"\",OFFSET(DE104_3!$C$35,ROWS($C$35:C36)-1,COLUMNS($C$35:C36)-1),\"\")","v":""},{"$f":"IF(OFFSET(DE104_3!$D$35,ROWS($D$35:D36)-1,COLUMNS($D$35:D36)-1)<>\"\",OFFSET(DE104_3!$D$35,ROWS($D$35:D36)-1,COLUMNS($D$35:D36)-1),\"\")","v":"482+25.00"},{"$f":"IF(OFFSET(DE104_3!$E$35,ROWS($E$35:E36)-1,COLUMNS($E$35:E36)-1)<>\"\",OFFSET(DE104_3!$E$35,ROWS($E$35:E36)-1,COLUMNS($E$35:E36)-1),\"\")","v":651},{"$f":"IF(OFFSET(DE104_3!$F$35,ROWS($F$35:F36)-1,COLUMNS($F$35:F36)-1)<>\"\",OFFSET(DE104_3!$F$35,ROWS($F$35:F36)-1,COLUMNS($F$35:F36)-1),\"\")","v":24},{"$f":"IF(OFFSET(DE104_3!$G$35,ROWS($G$35:G36)-1,COLUMNS($G$35:G36)-1)<>\"\",OFFSET(DE104_3!$G$35,ROWS($G$35:G36)-1,COLUMNS($G$35:G36)-1),\"\")","v":"UNCL"},{"$f":"IF(OFFSET(DE104_3!$H$35,ROWS($H$35:H36)-1,COLUMNS($H$35:H36)-1)<>\"\",OFFSET(DE104_3!$H$35,ROWS($H$35:H36)-1,COLUMNS($H$35:H36)-1),\"\")","v":302},{"$f":"IF(OFFSET(DE104_3!$I$35,ROWS($I$35:I36)-1,COLUMNS($I$35:I36)-1)<>\"\",OFFSET(DE104_3!$I$35,ROWS($I$35:I36)-1,COLUMNS($I$35:I36)-1),\"\")","v":""},{"$f":"IF(OFFSET(DE104_3!$J$35,ROWS($J$35:J36)-1,COLUMNS($J$35:J36)-1)<>\"\",OFFSET(DE104_3!$J$35,ROWS($J$35:J36)-1,COLUMNS($J$35:J36)-1),\"\")","v":23},{"$f":"IF(OFFSET(DE104_3!$K$35,ROWS($K$35:K36)-1,COLUMNS($K$35:K36)-1)<>\"\",OFFSET(DE104_3!$K$35,ROWS($K$35:K36)-1,COLUMNS($K$35:K36)-1),\"\")","v":""},{"$f":"IF(OFFSET(DE104_3!$L$35,ROWS($L$35:L36)-1,COLUMNS($L$35:L36)-1)<>\"\",OFFSET(DE104_3!$L$35,ROWS($L$35:L36)-1,COLUMNS($L$35:L36)-1),\"\")","v":""},{"$f":"IF(OFFSET(DE104_3!$M$35,ROWS($M$35:M36)-1,COLUMNS($M$35:M36)-1)<>\"\",OFFSET(DE104_3!$M$35,ROWS($M$35:M36)-1,COLUMNS($M$35:M36)-1),\"\")","v":""},{"$f":"IF(OFFSET(DE104_3!$N$35,ROWS($N$35:N36)-1,COLUMNS($N$35:N36)-1)<>\"\",OFFSET(DE104_3!$N$35,ROWS($N$35:N36)-1,COLUMNS($N$35:N36)-1),\"\")","v":""},{"$f":"IF(OFFSET(DE104_3!$O$35,ROWS($O$35:O36)-1,COLUMNS($O$35:O36)-1)<>\"\",OFFSET(DE104_3!$O$35,ROWS($O$35:O36)-1,COLUMNS($O$35:O36)-1),\"\")","v":""},{"$f":"IF(OFFSET(DE104_3!$P$35,ROWS($P$35:P36)-1,COLUMNS($P$35:P36)-1)<>\"\",OFFSET(DE104_3!$P$35,ROWS($P$35:P36)-1,COLUMNS($P$35:P36)-1),\"\")","v":""},{"$f":"IF(OFFSET(DE104_3!$Q$35,ROWS($Q$35:Q36)-1,COLUMNS($Q$35:Q36)-1)<>\"\",OFFSET(DE104_3!$Q$35,ROWS($Q$35:Q36)-1,COLUMNS($Q$35:Q36)-1),\"\")","v":""},{"$f":"IF(OFFSET(DE104_3!$R$35,ROWS($R$35:R36)-1,COLUMNS($R$35:R36)-1)<>\"\",OFFSET(DE104_3!$R$35,ROWS($R$35:R36)-1,COLUMNS($R$35:R36)-1),\"\")","v":""},{"$f":"IF(OFFSET(DE104_3!$S$35,ROWS($S$35:S36)-1,COLUMNS($S$35:S36)-1)<>\"\",OFFSET(DE104_3!$S$35,ROWS($S$35:S36)-1,COLUMNS($S$35:S36)-1),\"\")","v":""},{"$f":"IF(OFFSET(DE104_3!$T$35,ROWS($T$35:T36)-1,COLUMNS($T$35:T36)-1)<>\"\",OFFSET(DE104_3!$T$35,ROWS($T$35:T36)-1,COLUMNS($T$35:T36)-1),\"\")","v":""},{"$f":"IF(OFFSET(DE104_3!$U$35,ROWS($U$35:U36)-1,COLUMNS($U$35:U36)-1)<>\"\",OFFSET(DE104_3!$U$35,ROWS($U$35:U36)-1,COLUMNS($U$35:U36)-1),\"\")","v":""},{"$f":"IF(OFFSET(DE104_3!$V$35,ROWS($V$35:V36)-1,COLUMNS($V$35:V36)-1)<>\"\",OFFSET(DE104_3!$V$35,ROWS($V$35:V36)-1,COLUMNS($V$35:V36)-1),\"\")","v":""},{"$f":"IF(OFFSET(DE104_3!$W$35,ROWS($W$35:W36)-1,COLUMNS($W$35:W36)-1)<>\"\",OFFSET(DE104_3!$W$35,ROWS($W$35:W36)-1,COLUMNS($W$35:W36)-1),\"\")","v":""},{"$f":"IF(OFFSET(DE104_3!$X$35,ROWS($X$35:X36)-1,COLUMNS($X$35:X36)-1)<>\"\",OFFSET(DE104_3!$X$35,ROWS($X$35:X36)-1,COLUMNS($X$35:X36)-1),\"\")","v":866.52},{"$f":"IF(OFFSET(DE104_3!$Y$35,ROWS($Y$35:Y36)-1,COLUMNS($Y$35:Y36)-1)<>\"\",OFFSET(DE104_3!$Y$35,ROWS($Y$35:Y36)-1,COLUMNS($Y$35:Y36)-1),\"\")","v":876.95},{"$f":"IF(OFFSET(DE104_3!$Z$35,ROWS($Z$35:Z36)-1,COLUMNS($Z$35:Z36)-1)<>\"\",OFFSET(DE104_3!$Z$35,ROWS($Z$35:Z36)-1,COLUMNS($Z$35:Z36)-1),\"\")","v":""},{"$f":"IF(OFFSET(DE104_3!$AA$35,ROWS($AA$35:AA36)-1,COLUMNS($AA$35:AA36)-1)<>\"\",OFFSET(DE104_3!$AA$35,ROWS($AA$35:AA36)-1,COLUMNS($AA$35:AA36)-1),\"\")","v":""},{"$f":"IF(OFFSET(DE104_3!$AB$35,ROWS($AB$35:AB36)-1,COLUMNS($AB$35:AB36)-1)<>\"\",OFFSET(DE104_3!$AB$35,ROWS($AB$35:AB36)-1,COLUMNS($AB$35:AB36)-1),\"\")","v":185.8},{"$f":"IF(OFFSET(DE104_3!$AC$35,ROWS($AC$35:AC36)-1,COLUMNS($AC$35:AC36)-1)<>\"\",OFFSET(DE104_3!$AC$35,ROWS($AC$35:AC36)-1,COLUMNS($AC$35:AC36)-1),\"\")","v":116},{"$f":"IF(OFFSET(DE104_3!$AD$35,ROWS($AD$35:AD36)-1,COLUMNS($AD$35:AD36)-1)<>\"\",OFFSET(DE104_3!$AD$35,ROWS($AD$35:AD36)-1,COLUMNS($AD$35:AD36)-1),\"\")","v":""},{"$f":"IF(OFFSET(DE104_3!$AE$35,ROWS($AE$35:AE36)-1,COLUMNS($AE$35:AE36)-1)<>\"\",OFFSET(DE104_3!$AE$35,ROWS($AE$35:AE36)-1,COLUMNS($AE$35:AE36)-1),\"\")","v":""},{"$f":"IF(OFFSET(DE104_3!$AF$35,ROWS($AF$35:AF36)-1,COLUMNS($AF$35:AF36)-1)<>\"\",OFFSET(DE104_3!$AF$35,ROWS($AF$35:AF36)-1,COLUMNS($AF$35:AF36)-1),\"\")","v":""},{"$f":"IF(OFFSET(DE104_3!$AG$35,ROWS($AG$35:AG36)-1,COLUMNS($AG$35:AG36)-1)<>\"\",OFFSET(DE104_3!$AG$35,ROWS($AG$35:AG36)-1,COLUMNS($AG$35:AG36)-1),\"\")","v":""},{"$f":"IF(OFFSET(DE104_3!$AH$35,ROWS($AH$35:AH36)-1,COLUMNS($AH$35:AH36)-1)<>\"\",OFFSET(DE104_3!$AH$35,ROWS($AH$35:AH36)-1,COLUMNS($AH$35:AH36)-1),\"\")","v":""},{"$f":"IF(OFFSET(DE104_3!$AI$35,ROWS($AI$35:AI36)-1,COLUMNS($AI$35:AI36)-1)<>\"\",OFFSET(DE104_3!$AI$35,ROWS($AI$35:AI36)-1,COLUMNS($AI$35:AI36)-1),\"\")","v":""},{"$f":"IF(OFFSET(DE104_3!$AJ$35,ROWS($AJ$35:AJ36)-1,COLUMNS($AJ$35:AJ36)-1)<>\"\",OFFSET(DE104_3!$AJ$35,ROWS($AJ$35:AJ36)-1,COLUMNS($AJ$35:AJ36)-1),\"\")","v":""},{"$f":"IF(OFFSET(DE104_3!$AK$35,ROWS($AK$35:AK36)-1,COLUMNS($AK$35:AK36)-1)<>\"\",OFFSET(DE104_3!$AK$35,ROWS($AK$35:AK36)-1,COLUMNS($AK$35:AK36)-1),\"\")","v":""},{"$f":"IF(OFFSET(DE104_3!$AL$35,ROWS($AL$35:AL36)-1,COLUMNS($AL$35:AL36)-1)<>\"\",OFFSET(DE104_3!$AL$35,ROWS($AL$35:AL36)-1,COLUMNS($AL$35:AL36)-1),\"\")","v":23.111111111111111},{"$f":"IF(OFFSET(DE104_3!$AM$35,ROWS($AM$35:AM36)-1,COLUMNS($AM$35:AM36)-1)<>\"\",OFFSET(DE104_3!$AM$35,ROWS($AM$35:AM36)-1,COLUMNS($AM$35:AM36)-1),\"\")","v":""},{"$f":"IF(OFFSET(DE104_3!$AN$35,ROWS($AN$35:AN36)-1,COLUMNS($AN$35:AN36)-1)<>\"\",OFFSET(DE104_3!$AN$35,ROWS($AN$35:AN36)-1,COLUMNS($AN$35:AN36)-1),\"\")","v":""},{"$f":"IF(OFFSET(DE104_3!$AO$35,ROWS($AO$35:AO36)-1,COLUMNS($AO$35:AO36)-1)<>\"\",OFFSET(DE104_3!$AO$35,ROWS($AO$35:AO36)-1,COLUMNS($AO$35:AO36)-1),\"\")","v":""},{"$f":"IF(OFFSET(DE104_3!$AP$35,ROWS($AP$35:AP36)-1,COLUMNS($AP$35:AP36)-1)<>\"\",OFFSET(DE104_3!$AP$35,ROWS($AP$35:AP36)-1,COLUMNS($AP$35:AP36)-1),\"\")","v":""},{"$f":"IF(OFFSET(DE104_3!$AQ$35,ROWS($AQ$35:AQ36)-1,COLUMNS($AQ$35:AQ36)-1)<>\"\",OFFSET(DE104_3!$AQ$35,ROWS($AQ$35:AQ36)-1,COLUMNS($AQ$35:AQ36)-1),\"\")","v":""}]
[{"$f":"IF(OFFSET(DE104_3!$C$35,ROWS($C$35:C37)-1,COLUMNS($C$35:C37)-1)<>\"\",OFFSET(DE104_3!$C$35,ROWS($C$35:C37)-1,COLUMNS($C$35:C37)-1),\"\")","v":""},{"$f":"IF(OFFSET(DE104_3!$D$35,ROWS($D$35:D37)-1,COLUMNS($D$35:D37)-1)<>\"\",OFFSET(DE104_3!$D$35,ROWS($D$35:D37)-1,COLUMNS($D$35:D37)-1),\"\")","v":"492+00.00"},{"$f":"IF(OFFSET(DE104_3!$E$35,ROWS($E$35:E37)-1,COLUMNS($E$35:E37)-1)<>\"\",OFFSET(DE104_3!$E$35,ROWS($E$35:E37)-1,COLUMNS($E$35:E37)-1),\"\")","v":651},{"$f":"IF(OFFSET(DE104_3!$F$35,ROWS($F$35:F37)-1,COLUMNS($F$35:F37)-1)<>\"\",OFFSET(DE104_3!$F$35,ROWS($F$35:F37)-1,COLUMNS($F$35:F37)-1),\"\")","v":24},{"$f":"IF(OFFSET(DE104_3!$G$35,ROWS($G$35:G37)-1,COLUMNS($G$35:G37)-1)<>\"\",OFFSET(DE104_3!$G$35,ROWS($G$35:G37)-1,COLUMNS($G$35:G37)-1),\"\")","v":"UNCL"},{"$f":"IF(OFFSET(DE104_3!$H$35,ROWS($H$35:H37)-1,COLUMNS($H$35:H37)-1)<>\"\",OFFSET(DE104_3!$H$35,ROWS($H$35:H37)-1,COLUMNS($H$35:H37)-1),\"\")","v":218},{"$f":"IF(OFFSET(DE104_3!$I$35,ROWS($I$35:I37)-1,COLUMNS($I$35:I37)-1)<>\"\",OFFSET(DE104_3!$I$35,ROWS($I$35:I37)-1,COLUMNS($I$35:I37)-1),\"\")","v":""},{"$f":"IF(OFFSET(DE104_3!$J$35,ROWS($J$35:J37)-1,COLUMNS($J$35:J37)-1)<>\"\",OFFSET(DE104_3!$J$35,ROWS($J$35:J37)-1,COLUMNS($J$35:J37)-1),\"\")","v":11},{"$f":"IF(OFFSET(DE104_3!$K$35,ROWS($K$35:K37)-1,COLUMNS($K$35:K37)-1)<>\"\",OFFSET(DE104_3!$K$35,ROWS($K$35:K37)-1,COLUMNS($K$35:K37)-1),\"\")","v":""},{"$f":"IF(OFFSET(DE104_3!$L$35,ROWS($L$35:L37)-1,COLUMNS($L$35:L37)-1)<>\"\",OFFSET(DE104_3!$L$35,ROWS($L$35:L37)-1,COLUMNS($L$35:L37)-1),\"\")","v":""},{"$f":"IF(OFFSET(DE104_3!$M$35,ROWS($M$35:M37)-1,COLUMNS($M$35:M37)-1)<>\"\",OFFSET(DE104_3!$M$35,ROWS($M$35:M37)-1,COLUMNS($M$35:M37)-1),\"\")","v":""},{"$f":"IF(OFFSET(DE104_3!$N$35,ROWS($N$35:N37)-1,COLUMNS($N$35:N37)-1)<>\"\",OFFSET(DE104_3!$N$35,ROWS($N$35:N37)-1,COLUMNS($N$35:N37)-1),\"\")","v":""},{"$f":"IF(OFFSET(DE104_3!$O$35,ROWS($O$35:O37)-1,COLUMNS($O$35:O37)-1)<>\"\",OFFSET(DE104_3!$O$35,ROWS($O$35:O37)-1,COLUMNS($O$35:O37)-1),\"\")","v":""},{"$f":"IF(OFFSET(DE104_3!$P$35,ROWS($P$35:P37)-1,COLUMNS($P$35:P37)-1)<>\"\",OFFSET(DE104_3!$P$35,ROWS($P$35:P37)-1,COLUMNS($P$35:P37)-1),\"\")","v":""},{"$f":"IF(OFFSET(DE104_3!$Q$35,ROWS($Q$35:Q37)-1,COLUMNS($Q$35:Q37)-1)<>\"\",OFFSET(DE104_3!$Q$35,ROWS($Q$35:Q37)-1,COLUMNS($Q$35:Q37)-1),\"\")","v":""},{"$f":"IF(OFFSET(DE104_3!$R$35,ROWS($R$35:R37)-1,COLUMNS($R$35:R37)-1)<>\"\",OFFSET(DE104_3!$R$35,ROWS($R$35:R37)-1,COLUMNS($R$35:R37)-1),\"\")","v":""},{"$f":"IF(OFFSET(DE104_3!$S$35,ROWS($S$35:S37)-1,COLUMNS($S$35:S37)-1)<>\"\",OFFSET(DE104_3!$S$35,ROWS($S$35:S37)-1,COLUMNS($S$35:S37)-1),\"\")","v":""},{"$f":"IF(OFFSET(DE104_3!$T$35,ROWS($T$35:T37)-1,COLUMNS($T$35:T37)-1)<>\"\",OFFSET(DE104_3!$T$35,ROWS($T$35:T37)-1,COLUMNS($T$35:T37)-1),\"\")","v":""},{"$f":"IF(OFFSET(DE104_3!$U$35,ROWS($U$35:U37)-1,COLUMNS($U$35:U37)-1)<>\"\",OFFSET(DE104_3!$U$35,ROWS($U$35:U37)-1,COLUMNS($U$35:U37)-1),\"\")","v":""},{"$f":"IF(OFFSET(DE104_3!$V$35,ROWS($V$35:V37)-1,COLUMNS($V$35:V37)-1)<>\"\",OFFSET(DE104_3!$V$35,ROWS($V$35:V37)-1,COLUMNS($V$35:V37)-1),\"\")","v":""},{"$f":"IF(OFFSET(DE104_3!$W$35,ROWS($W$35:W37)-1,COLUMNS($W$35:W37)-1)<>\"\",OFFSET(DE104_3!$W$35,ROWS($W$35:W37)-1,COLUMNS($W$35:W37)-1),\"\")","v":""},{"$f":"IF(OFFSET(DE104_3!$X$35,ROWS($X$35:X37)-1,COLUMNS($X$35:X37)-1)<>\"\",OFFSET(DE104_3!$X$35,ROWS($X$35:X37)-1,COLUMNS($X$35:X37)-1),\"\")","v":895.56},{"$f":"IF(OFFSET(DE104_3!$Y$35,ROWS($Y$35:Y37)-1,COLUMNS($Y$35:Y37)-1)<>\"\",OFFSET(DE104_3!$Y$35,ROWS($Y$35:Y37)-1,COLUMNS($Y$35:Y37)-1),\"\")","v":896.14},{"$f":"IF(OFFSET(DE104_3!$Z$35,ROWS($Z$35:Z37)-1,COLUMNS($Z$35:Z37)-1)<>\"\",OFFSET(DE104_3!$Z$35,ROWS($Z$35:Z37)-1,COLUMNS($Z$35:Z37)-1),\"\")","v":""},{"$f":"IF(OFFSET(DE104_3!$AA$35,ROWS($AA$35:AA37)-1,COLUMNS($AA$35:AA37)-1)<>\"\",OFFSET(DE104_3!$AA$35,ROWS($AA$35:AA37)-1,COLUMNS($AA$35:AA37)-1),\"\")","v":""},{"$f":"IF(OFFSET(DE104_3!$AB$35,ROWS($AB$35:AB37)-1,COLUMNS($AB$35:AB37)-1)<>\"\",OFFSET(DE104_3!$AB$35,ROWS($AB$35:AB37)-1,COLUMNS($AB$35:AB37)-1),\"\")","v":118},{"$f":"IF(OFFSET(DE104_3!$AC$35,ROWS($AC$35:AC37)-1,COLUMNS($AC$35:AC37)-1)<>\"\",OFFSET(DE104_3!$AC$35,ROWS($AC$35:AC37)-1,COLUMNS($AC$35:AC37)-1),\"\")","v":100},{"$f":"IF(OFFSET(DE104_3!$AD$35,ROWS($AD$35:AD37)-1,COLUMNS($AD$35:AD37)-1)<>\"\",OFFSET(DE104_3!$AD$35,ROWS($AD$35:AD37)-1,COLUMNS($AD$35:AD37)-1),\"\")","v":""},{"$f":"IF(OFFSET(DE104_3!$AE$35,ROWS($AE$35:AE37)-1,COLUMNS($AE$35:AE37)-1)<>\"\",OFFSET(DE104_3!$AE$35,ROWS($AE$35:AE37)-1,COLUMNS($AE$35:AE37)-1),\"\")","v":""},{"$f":"IF(OFFSET(DE104_3!$AF$35,ROWS($AF$35:AF37)-1,COLUMNS($AF$35:AF37)-1)<>\"\",OFFSET(DE104_3!$AF$35,ROWS($AF$35:AF37)-1,COLUMNS($AF$35:AF37)-1),\"\")","v":""},{"$f":"IF(OFFSET(DE104_3!$AG$35,ROWS($AG$35:AG37)-1,COLUMNS($AG$35:AG37)-1)<>\"\",OFFSET(DE104_3!$AG$35,ROWS($AG$35:AG37)-1,COLUMNS($AG$35:AG37)-1),\"\")","v":""},{"$f":"IF(OFFSET(DE104_3!$AH$35,ROWS($AH$35:AH37)-1,COLUMNS($AH$35:AH37)-1)<>\"\",OFFSET(DE104_3!$AH$35,ROWS($AH$35:AH37)-1,COLUMNS($AH$35:AH37)-1),\"\")","v":""},{"$f":"IF(OFFSET(DE104_3!$AI$35,ROWS($AI$35:AI37)-1,COLUMNS($AI$35:AI37)-1)<>\"\",OFFSET(DE104_3!$AI$35,ROWS($AI$35:AI37)-1,COLUMNS($AI$35:AI37)-1),\"\")","v":""},{"$f":"IF(OFFSET(DE104_3!$AJ$35,ROWS($AJ$35:AJ37)-1,COLUMNS($AJ$35:AJ37)-1)<>\"\",OFFSET(DE104_3!$AJ$35,ROWS($AJ$35:AJ37)-1,COLUMNS($AJ$35:AJ37)-1),\"\")","v":""},{"$f":"IF(OFFSET(DE104_3!$AK$35,ROWS($AK$35:AK37)-1,COLUMNS($AK$35:AK37)-1)<>\"\",OFFSET(DE104_3!$AK$35,ROWS($AK$35:AK37)-1,COLUMNS($AK$35:AK37)-1),\"\")","v":""},{"$f":"IF(OFFSET(DE104_3!$AL$35,ROWS($AL$35:AL37)-1,COLUMNS($AL$35:AL37)-1)<>\"\",OFFSET(DE104_3!$AL$35,ROWS($AL$35:AL37)-1,COLUMNS($AL$35:AL37)-1),\"\")","v":9.9074074074074066},{"$f":"IF(OFFSET(DE104_3!$AM$35,ROWS($AM$35:AM37)-1,COLUMNS($AM$35:AM37)-1)<>\"\",OFFSET(DE104_3!$AM$35,ROWS($AM$35:AM37)-1,COLUMNS($AM$35:AM37)-1),\"\")","v":""},{"$f":"IF(OFFSET(DE104_3!$AN$35,ROWS($AN$35:AN37)-1,COLUMNS($AN$35:AN37)-1)<>\"\",OFFSET(DE104_3!$AN$35,ROWS($AN$35:AN37)-1,COLUMNS($AN$35:AN37)-1),\"\")","v":""},{"$f":"IF(OFFSET(DE104_3!$AO$35,ROWS($AO$35:AO37)-1,COLUMNS($AO$35:AO37)-1)<>\"\",OFFSET(DE104_3!$AO$35,ROWS($AO$35:AO37)-1,COLUMNS($AO$35:AO37)-1),\"\")","v":""},{"$f":"IF(OFFSET(DE104_3!$AP$35,ROWS($AP$35:AP37)-1,COLUMNS($AP$35:AP37)-1)<>\"\",OFFSET(DE104_3!$AP$35,ROWS($AP$35:AP37)-1,COLUMNS($AP$35:AP37)-1),\"\")","v":""},{"$f":"IF(OFFSET(DE104_3!$AQ$35,ROWS($AQ$35:AQ37)-1,COLUMNS($AQ$35:AQ37)-1)<>\"\",OFFSET(DE104_3!$AQ$35,ROWS($AQ$35:AQ37)-1,COLUMNS($AQ$35:AQ37)-1),\"\")","v":""}]
[{"$f":"IF(OFFSET(DE104_3!$C$35,ROWS($C$35:C38)-1,COLUMNS($C$35:C38)-1)<>\"\",OFFSET(DE104_3!$C$35,ROWS($C$35:C38)-1,COLUMNS($C$35:C38)-1),\"\")","v":""},{"$f":"IF(OFFSET(DE104_3!$D$35,ROWS($D$35:D38)-1,COLUMNS($D$35:D38)-1)<>\"\",OFFSET(DE104_3!$D$35,ROWS($D$35:D38)-1,COLUMNS($D$35:D38)-1),\"\")","v":62475},{"$f":"IF(OFFSET(DE104_3!$E$35,ROWS($E$35:E38)-1,COLUMNS($E$35:E38)-1)<>\"\",OFFSET(DE104_3!$E$35,ROWS($E$35:E38)-1,COLUMNS($E$35:E38)-1),\"\")","v":651},{"$f":"IF(OFFSET(DE104_3!$F$35,ROWS($F$35:F38)-1,COLUMNS($F$35:F38)-1)<>\"\",OFFSET(DE104_3!$F$35,ROWS($F$35:F38)-1,COLUMNS($F$35:F38)-1),\"\")","v":24},{"$f":"IF(OFFSET(DE104_3!$G$35,ROWS($G$35:G38)-1,COLUMNS($G$35:G38)-1)<>\"\",OFFSET(DE104_3!$G$35,ROWS($G$35:G38)-1,COLUMNS($G$35:G38)-1),\"\")","v":"UNCL"},{"$f":"IF(OFFSET(DE104_3!$H$35,ROWS($H$35:H38)-1,COLUMNS($H$35:H38)-1)<>\"\",OFFSET(DE104_3!$H$35,ROWS($H$35:H38)-1,COLUMNS($H$35:H38)-1),\"\")","v":240},{"$f":"IF(OFFSET(DE104_3!$I$35,ROWS($I$35:I38)-1,COLUMNS($I$35:I38)-1)<>\"\",OFFSET(DE104_3!$I$35,ROWS($I$35:I38)-1,COLUMNS($I$35:I38)-1),\"\")","v":""},{"$f":"IF(OFFSET(DE104_3!$J$35,ROWS($J$35:J38)-1,COLUMNS($J$35:J38)-1)<>\"\",OFFSET(DE104_3!$J$35,ROWS($J$35:J38)-1,COLUMNS($J$35:J38)-1),\"\")","v":11},{"$f":"IF(OFFSET(DE104_3!$K$35,ROWS($K$35:K38)-1,COLUMNS($K$35:K38)-1)<>\"\",OFFSET(DE104_3!$K$35,ROWS($K$35:K38)-1,COLUMNS($K$35:K38)-1),\"\")","v":""},{"$f":"IF(OFFSET(DE104_3!$L$35,ROWS($L$35:L38)-1,COLUMNS($L$35:L38)-1)<>\"\",OFFSET(DE104_3!$L$35,ROWS($L$35:L38)-1,COLUMNS($L$35:L38)-1),\"\")","v":""},{"$f":"IF(OFFSET(DE104_3!$M$35,ROWS($M$35:M38)-1,COLUMNS($M$35:M38)-1)<>\"\",OFFSET(DE104_3!$M$35,ROWS($M$35:M38)-1,COLUMNS($M$35:M38)-1),\"\")","v":""},{"$f":"IF(OFFSET(DE104_3!$N$35,ROWS($N$35:N38)-1,COLUMNS($N$35:N38)-1)<>\"\",OFFSET(DE104_3!$N$35,ROWS($N$35:N38)-1,COLUMNS($N$35:N38)-1),\"\")","v":""},{"$f":"IF(OFFSET(DE104_3!$O$35,ROWS($O$35:O38)-1,COLUMNS($O$35:O38)-1)<>\"\",OFFSET(DE104_3!$O$35,ROWS($O$35:O38)-1,COLUMNS($O$35:O38)-1),\"\")","v":""},{"$f":"IF(OFFSET(DE104_3!$P$35,ROWS($P$35:P38)-1,COLUMNS($P$35:P38)-1)<>\"\",OFFSET(DE104_3!$P$35,ROWS($P$35:P38)-1,COLUMNS($P$35:P38)-1),\"\")","v":""},{"$f":"IF(OFFSET(DE104_3!$Q$35,ROWS($Q$35:Q38)-1,COLUMNS($Q$35:Q38)-1)<>\"\",OFFSET(DE104_3!$Q$35,ROWS($Q$35:Q38)-1,COLUMNS($Q$35:Q38)-1),\"\")","v":""},{"$f":"IF(OFFSET(DE104_3!$R$35,ROWS($R$35:R38)-1,COLUMNS($R$35:R38)-1)<>\"\",OFFSET(DE104_3!$R$35,ROWS($R$35:R38)-1,COLUMNS($R$35:R38)-1),\"\")","v":""},{"$f":"IF(OFFSET(DE104_3!$S$35,ROWS($S$35:S38)-1,COLUMNS($S$35:S38)-1)<>\"\",OFFSET(DE104_3!$S$35,ROWS($S$35:S38)-1,COLUMNS($S$35:S38)-1),\"\")","v":""},{"$f":"IF(OFFSET(DE104_3!$T$35,ROWS($T$35:T38)-1,COLUMNS($T$35:T38)-1)<>\"\",OFFSET(DE104_3!$T$35,ROWS($T$35:T38)-1,COLUMNS($T$35:T38)-1),\"\")","v":""},{"$f":"IF(OFFSET(DE104_3!$U$35,ROWS($U$35:U38)-1,COLUMNS($U$35:U38)-1)<>\"\",OFFSET(DE104_3!$U$35,ROWS($U$35:U38)-1,COLUMNS($U$35:U38)-1),\"\")","v":""},{"$f":"IF(OFFSET(DE104_3!$V$35,ROWS($V$35:V38)-1,COLUMNS($V$35:V38)-1)<>\"\",OFFSET(DE104_3!$V$35,ROWS($V$35:V38)-1,COLUMNS($V$35:V38)-1),\"\")","v":""},{"$f":"IF(OFFSET(DE104_3!$W$35,ROWS($W$35:W38)-1,COLUMNS($W$35:W38)-1)<>\"\",OFFSET(DE104_3!$W$35,ROWS($W$35:W38)-1,COLUMNS($W$35:W38)-1),\"\")","v":""},{"$f":"IF(OFFSET(DE104_3!$X$35,ROWS($X$35:X38)-1,COLUMNS($X$35:X38)-1)<>\"\",OFFSET(DE104_3!$X$35,ROWS($X$35:X38)-1,COLUMNS($X$35:X38)-1),\"\")","v":918.28},{"$f":"IF(OFFSET(DE104_3!$Y$35,ROWS($Y$35:Y38)-1,COLUMNS($Y$35:Y38)-1)<>\"\",OFFSET(DE104_3!$Y$35,ROWS($Y$35:Y38)-1,COLUMNS($Y$35:Y38)-1),\"\")","v":923.08},{"$f":"IF(OFFSET(DE104_3!$Z$35,ROWS($Z$35:Z38)-1,COLUMNS($Z$35:Z38)-1)<>\"\",OFFSET(DE104_3!$Z$35,ROWS($Z$35:Z38)-1,COLUMNS($Z$35:Z38)-1),\"\")","v":""},{"$f":"IF(OFFSET(DE104_3!$AA$35,ROWS($AA$35:AA38)-1,COLUMNS($AA$35:AA38)-1)<>\"\",OFFSET(DE104_3!$AA$35,ROWS($AA$35:AA38)-1,COLUMNS($AA$35:AA38)-1),\"\")","v":""},{"$f":"IF(OFFSET(DE104_3!$AB$35,ROWS($AB$35:AB38)-1,COLUMNS($AB$35:AB38)-1)<>\"\",OFFSET(DE104_3!$AB$35,ROWS($AB$35:AB38)-1,COLUMNS($AB$35:AB38)-1),\"\")","v":128},{"$f":"IF(OFFSET(DE104_3!$AC$35,ROWS($AC$35:AC38)-1,COLUMNS($AC$35:AC38)-1)<>\"\",OFFSET(DE104_3!$AC$35,ROWS($AC$35:AC38)-1,COLUMNS($AC$35:AC38)-1),\"\")","v":112},{"$f":"IF(OFFSET(DE104_3!$AD$35,ROWS($AD$35:AD38)-1,COLUMNS($AD$35:AD38)-1)<>\"\",OFFSET(DE104_3!$AD$35,ROWS($AD$35:AD38)-1,COLUMNS($AD$35:AD38)-1),\"\")","v":""},{"$f":"IF(OFFSET(DE104_3!$AE$35,ROWS($AE$35:AE38)-1,COLUMNS($AE$35:AE38)-1)<>\"\",OFFSET(DE104_3!$AE$35,ROWS($AE$35:AE38)-1,COLUMNS($AE$35:AE38)-1),\"\")","v":""},{"$f":"IF(OFFSET(DE104_3!$AF$35,ROWS($AF$35:AF38)-1,COLUMNS($AF$35:AF38)-1)<>\"\",OFFSET(DE104_3!$AF$35,ROWS($AF$35:AF38)-1,COLUMNS($AF$35:AF38)-1),\"\")","v":""},{"$f":"IF(OFFSET(DE104_3!$AG$35,ROWS($AG$35:AG38)-1,COLUMNS($AG$35:AG38)-1)<>\"\",OFFSET(DE104_3!$AG$35,ROWS($AG$35:AG38)-1,COLUMNS($AG$35:AG38)-1),\"\")","v":""},{"$f":"IF(OFFSET(DE104_3!$AH$35,ROWS($AH$35:AH38)-1,COLUMNS($AH$35:AH38)-1)<>\"\",OFFSET(DE104_3!$AH$35,ROWS($AH$35:AH38)-1,COLUMNS($AH$35:AH38)-1),\"\")","v":""},{"$f":"IF(OFFSET(DE104_3!$AI$35,ROWS($AI$35:AI38)-1,COLUMNS($AI$35:AI38)-1)<>\"\",OFFSET(DE104_3!$AI$35,ROWS($AI$35:AI38)-1,COLUMNS($AI$35:AI38)-1),\"\")","v":""},{"$f":"IF(OFFSET(DE104_3!$AJ$35,ROWS($AJ$35:AJ38)-1,COLUMNS($AJ$35:AJ38)-1)<>\"\",OFFSET(DE104_3!$AJ$35,ROWS($AJ$35:AJ38)-1,COLUMNS($AJ$35:AJ38)-1),\"\")","v":""},{"$f":"IF(OFFSET(DE104_3!$AK$35,ROWS($AK$35:AK38)-1,COLUMNS($AK$35:AK38)-1)<>\"\",OFFSET(DE104_3!$AK$35,ROWS($AK$35:AK38)-1,COLUMNS($AK$35:AK38)-1),\"\")","v":""},{"$f":"IF(OFFSET(DE104_3!$AL$35,ROWS($AL$35:AL38)-1,COLUMNS($AL$35:AL38)-1)<>\"\",OFFSET(DE104_3!$AL$35,ROWS($AL$35:AL38)-1,COLUMNS($AL$35:AL38)-1),\"\")","v":128.59259259259258},{"$f":"IF(OFFSET(DE104_3!$AM$35,ROWS($AM$35:AM38)-1,COLUMNS($AM$35:AM38)-1)<>\"\",OFFSET(DE104_3!$AM$35,ROWS($AM$35:AM38)-1,COLUMNS($AM$35:AM38)-1),\"\")","v":""},{"$f":"IF(OFFSET(DE104_3!$AN$35,ROWS($AN$35:AN38)-1,COLUMNS($AN$35:AN38)-1)<>\"\",OFFSET(DE104_3!$AN$35,ROWS($AN$35:AN38)-1,COLUMNS($AN$35:AN38)-1),\"\")","v":""},{"$f":"IF(OFFSET(DE104_3!$AO$35,ROWS($AO$35:AO38)-1,COLUMNS($AO$35:AO38)-1)<>\"\",OFFSET(DE104_3!$AO$35,ROWS($AO$35:AO38)-1,COLUMNS($AO$35:AO38)-1),\"\")","v":""},{"$f":"IF(OFFSET(DE104_3!$AP$35,ROWS($AP$35:AP38)-1,COLUMNS($AP$35:AP38)-1)<>\"\",OFFSET(DE104_3!$AP$35,ROWS($AP$35:AP38)-1,COLUMNS($AP$35:AP38)-1),\"\")","v":""},{"$f":"IF(OFFSET(DE104_3!$AQ$35,ROWS($AQ$35:AQ38)-1,COLUMNS($AQ$35:AQ38)-1)<>\"\",OFFSET(DE104_3!$AQ$35,ROWS($AQ$35:AQ38)-1,COLUMNS($AQ$35:AQ38)-1),\"\")","v":""}]
[{"$f":"IF(OFFSET(DE104_3!$C$35,ROWS($C$35:C39)-1,COLUMNS($C$35:C39)-1)<>\"\",OFFSET(DE104_3!$C$35,ROWS($C$35:C39)-1,COLUMNS($C$35:C39)-1),\"\")","v":""},{"$f":"IF(OFFSET(DE104_3!$D$35,ROWS($D$35:D39)-1,COLUMNS($D$35:D39)-1)<>\"\",OFFSET(DE104_3!$D$35,ROWS($D$35:D39)-1,COLUMNS($D$35:D39)-1),\"\")","v":""},{"$f":"IF(OFFSET(DE104_3!$E$35,ROWS($E$35:E39)-1,COLUMNS($E$35:E39)-1)<>\"\",OFFSET(DE104_3!$E$35,ROWS($E$35:E39)-1,COLUMNS($E$35:E39)-1),\"\")","v":""},{"$f":"IF(OFFSET(DE104_3!$F$35,ROWS($F$35:F39)-1,COLUMNS($F$35:F39)-1)<>\"\",OFFSET(DE104_3!$F$35,ROWS($F$35:F39)-1,COLUMNS($F$35:F39)-1),\"\")","v":""},{"$f":"IF(OFFSET(DE104_3!$G$35,ROWS($G$35:G39)-1,COLUMNS($G$35:G39)-1)<>\"\",OFFSET(DE104_3!$G$35,ROWS($G$35:G39)-1,COLUMNS($G$35:G39)-1),\"\")","v":""},{"$f":"IF(OFFSET(DE104_3!$H$35,ROWS($H$35:H39)-1,COLUMNS($H$35:H39)-1)<>\"\",OFFSET(DE104_3!$H$35,ROWS($H$35:H39)-1,COLUMNS($H$35:H39)-1),\"\")","v":""},{"$f":"IF(OFFSET(DE104_3!$I$35,ROWS($I$35:I39)-1,COLUMNS($I$35:I39)-1)<>\"\",OFFSET(DE104_3!$I$35,ROWS($I$35:I39)-1,COLUMNS($I$35:I39)-1),\"\")","v":""},{"$f":"IF(OFFSET(DE104_3!$J$35,ROWS($J$35:J39)-1,COLUMNS($J$35:J39)-1)<>\"\",OFFSET(DE104_3!$J$35,ROWS($J$35:J39)-1,COLUMNS($J$35:J39)-1),\"\")","v":""},{"$f":"IF(OFFSET(DE104_3!$K$35,ROWS($K$35:K39)-1,COLUMNS($K$35:K39)-1)<>\"\",OFFSET(DE104_3!$K$35,ROWS($K$35:K39)-1,COLUMNS($K$35:K39)-1),\"\")","v":""},{"$f":"IF(OFFSET(DE104_3!$L$35,ROWS($L$35:L39)-1,COLUMNS($L$35:L39)-1)<>\"\",OFFSET(DE104_3!$L$35,ROWS($L$35:L39)-1,COLUMNS($L$35:L39)-1),\"\")","v":""},{"$f":"IF(OFFSET(DE104_3!$M$35,ROWS($M$35:M39)-1,COLUMNS($M$35:M39)-1)<>\"\",OFFSET(DE104_3!$M$35,ROWS($M$35:M39)-1,COLUMNS($M$35:M39)-1),\"\")","v":""},{"$f":"IF(OFFSET(DE104_3!$N$35,ROWS($N$35:N39)-1,COLUMNS($N$35:N39)-1)<>\"\",OFFSET(DE104_3!$N$35,ROWS($N$35:N39)-1,COLUMNS($N$35:N39)-1),\"\")","v":""},{"$f":"IF(OFFSET(DE104_3!$O$35,ROWS($O$35:O39)-1,COLUMNS($O$35:O39)-1)<>\"\",OFFSET(DE104_3!$O$35,ROWS($O$35:O39)-1,COLUMNS($O$35:O39)-1),\"\")","v":""},{"$f":"IF(OFFSET(DE104_3!$P$35,ROWS($P$35:P39)-1,COLUMNS($P$35:P39)-1)<>\"\",OFFSET(DE104_3!$P$35,ROWS($P$35:P39)-1,COLUMNS($P$35:P39)-1),\"\")","v":""},{"$f":"IF(OFFSET(DE104_3!$Q$35,ROWS($Q$35:Q39)-1,COLUMNS($Q$35:Q39)-1)<>\"\",OFFSET(DE104_3!$Q$35,ROWS($Q$35:Q39)-1,COLUMNS($Q$35:Q39)-1),\"\")","v":""},{"$f":"IF(OFFSET(DE104_3!$R$35,ROWS($R$35:R39)-1,COLUMNS($R$35:R39)-1)<>\"\",OFFSET(DE104_3!$R$35,ROWS($R$35:R39)-1,COLUMNS($R$35:R39)-1),\"\")","v":""},{"$f":"IF(OFFSET(DE104_3!$S$35,ROWS($S$35:S39)-1,COLUMNS($S$35:S39)-1)<>\"\",OFFSET(DE104_3!$S$35,ROWS($S$35:S39)-1,COLUMNS($S$35:S39)-1),\"\")","v":""},{"$f":"IF(OFFSET(DE104_3!$T$35,ROWS($T$35:T39)-1,COLUMNS($T$35:T39)-1)<>\"\",OFFSET(DE104_3!$T$35,ROWS($T$35:T39)-1,COLUMNS($T$35:T39)-1),\"\")","v":""},{"$f":"IF(OFFSET(DE104_3!$U$35,ROWS($U$35:U39)-1,COLUMNS($U$35:U39)-1)<>\"\",OFFSET(DE104_3!$U$35,ROWS($U$35:U39)-1,COLUMNS($U$35:U39)-1),\"\")","v":""},{"$f":"IF(OFFSET(DE104_3!$V$35,ROWS($V$35:V39)-1,COLUMNS($V$35:V39)-1)<>\"\",OFFSET(DE104_3!$V$35,ROWS($V$35:V39)-1,COLUMNS($V$35:V39)-1),\"\")","v":""},{"$f":"IF(OFFSET(DE104_3!$W$35,ROWS($W$35:W39)-1,COLUMNS($W$35:W39)-1)<>\"\",OFFSET(DE104_3!$W$35,ROWS($W$35:W39)-1,COLUMNS($W$35:W39)-1),\"\")","v":""},{"$f":"IF(OFFSET(DE104_3!$X$35,ROWS($X$35:X39)-1,COLUMNS($X$35:X39)-1)<>\"\",OFFSET(DE104_3!$X$35,ROWS($X$35:X39)-1,COLUMNS($X$35:X39)-1),\"\")","v":""},{"$f":"IF(OFFSET(DE104_3!$Y$35,ROWS($Y$35:Y39)-1,COLUMNS($Y$35:Y39)-1)<>\"\",OFFSET(DE104_3!$Y$35,ROWS($Y$35:Y39)-1,COLUMNS($Y$35:Y39)-1),\"\")","v":""},{"$f":"IF(OFFSET(DE104_3!$Z$35,ROWS($Z$35:Z39)-1,COLUMNS($Z$35:Z39)-1)<>\"\",OFFSET(DE104_3!$Z$35,ROWS($Z$35:Z39)-1,COLUMNS($Z$35:Z39)-1),\"\")","v":""},{"$f":"IF(OFFSET(DE104_3!$AA$35,ROWS($AA$35:AA39)-1,COLUMNS($AA$35:AA39)-1)<>\"\",OFFSET(DE104_3!$AA$35,ROWS($AA$35:AA39)-1,COLUMNS($AA$35:AA39)-1),\"\")","v":""},{"$f":"IF(OFFSET(DE104_3!$AB$35,ROWS($AB$35:AB39)-1,COLUMNS($AB$35:AB39)-1)<>\"\",OFFSET(DE104_3!$AB$35,ROWS($AB$35:AB39)-1,COLUMNS($AB$35:AB39)-1),\"\")","v":""},{"$f":"IF(OFFSET(DE104_3!$AC$35,ROWS($AC$35:AC39)-1,COLUMNS($AC$35:AC39)-1)<>\"\",OFFSET(DE104_3!$AC$35,ROWS($AC$35:AC39)-1,COLUMNS($AC$35:AC39)-1),\"\")","v":""},{"$f":"IF(OFFSET(DE104_3!$AD$35,ROWS($AD$35:AD39)-1,COLUMNS($AD$35:AD39)-1)<>\"\",OFFSET(DE104_3!$AD$35,ROWS($AD$35:AD39)-1,COLUMNS($AD$35:AD39)-1),\"\")","v":""},{"$f":"IF(OFFSET(DE104_3!$AE$35,ROWS($AE$35:AE39)-1,COLUMNS($AE$35:AE39)-1)<>\"\",OFFSET(DE104_3!$AE$35,ROWS($AE$35:AE39)-1,COLUMNS($AE$35:AE39)-1),\"\")","v":""},{"$f":"IF(OFFSET(DE104_3!$AF$35,ROWS($AF$35:AF39)-1,COLUMNS($AF$35:AF39)-1)<>\"\",OFFSET(DE104_3!$AF$35,ROWS($AF$35:AF39)-1,COLUMNS($AF$35:AF39)-1),\"\")","v":""},{"$f":"IF(OFFSET(DE104_3!$AG$35,ROWS($AG$35:AG39)-1,COLUMNS($AG$35:AG39)-1)<>\"\",OFFSET(DE104_3!$AG$35,ROWS($AG$35:AG39)-1,COLUMNS($AG$35:AG39)-1),\"\")","v":""},{"$f":"IF(OFFSET(DE104_3!$AH$35,ROWS($AH$35:AH39)-1,COLUMNS($AH$35:AH39)-1)<>\"\",OFFSET(DE104_3!$AH$35,ROWS($AH$35:AH39)-1,COLUMNS($AH$35:AH39)-1),\"\")","v":""},{"$f":"IF(OFFSET(DE104_3!$AI$35,ROWS($AI$35:AI39)-1,COLUMNS($AI$35:AI39)-1)<>\"\",OFFSET(DE104_3!$AI$35,ROWS($AI$35:AI39)-1,COLUMNS($AI$35:AI39)-1),\"\")","v":""},{"$f":"IF(OFFSET(DE104_3!$AJ$35,ROWS($AJ$35:AJ39)-1,COLUMNS($AJ$35:AJ39)-1)<>\"\",OFFSET(DE104_3!$AJ$35,ROWS($AJ$35:AJ39)-1,COLUMNS($AJ$35:AJ39)-1),\"\")","v":""},{"$f":"IF(OFFSET(DE104_3!$AK$35,ROWS($AK$35:AK39)-1,COLUMNS($AK$35:AK39)-1)<>\"\",OFFSET(DE104_3!$AK$35,ROWS($AK$35:AK39)-1,COLUMNS($AK$35:AK39)-1),\"\")","v":""},{"$f":"IF(OFFSET(DE104_3!$AL$35,ROWS($AL$35:AL39)-1,COLUMNS($AL$35:AL39)-1)<>\"\",OFFSET(DE104_3!$AL$35,ROWS($AL$35:AL39)-1,COLUMNS($AL$35:AL39)-1),\"\")","v":""},{"$f":"IF(OFFSET(DE104_3!$AM$35,ROWS($AM$35:AM39)-1,COLUMNS($AM$35:AM39)-1)<>\"\",OFFSET(DE104_3!$AM$35,ROWS($AM$35:AM39)-1,COLUMNS($AM$35:AM39)-1),\"\")","v":""},{"$f":"IF(OFFSET(DE104_3!$AN$35,ROWS($AN$35:AN39)-1,COLUMNS($AN$35:AN39)-1)<>\"\",OFFSET(DE104_3!$AN$35,ROWS($AN$35:AN39)-1,COLUMNS($AN$35:AN39)-1),\"\")","v":""},{"$f":"IF(OFFSET(DE104_3!$AO$35,ROWS($AO$35:AO39)-1,COLUMNS($AO$35:AO39)-1)<>\"\",OFFSET(DE104_3!$AO$35,ROWS($AO$35:AO39)-1,COLUMNS($AO$35:AO39)-1),\"\")","v":""},{"$f":"IF(OFFSET(DE104_3!$AP$35,ROWS($AP$35:AP39)-1,COLUMNS($AP$35:AP39)-1)<>\"\",OFFSET(DE104_3!$AP$35,ROWS($AP$35:AP39)-1,COLUMNS($AP$35:AP39)-1),\"\")","v":""},{"$f":"IF(OFFSET(DE104_3!$AQ$35,ROWS($AQ$35:AQ39)-1,COLUMNS($AQ$35:AQ39)-1)<>\"\",OFFSET(DE104_3!$AQ$35,ROWS($AQ$35:AQ39)-1,COLUMNS($AQ$35:AQ39)-1),\"\")","v":""}]
[{"$f":"IF(OFFSET(DE104_3!$C$35,ROWS($C$35:C40)-1,COLUMNS($C$35:C40)-1)<>\"\",OFFSET(DE104_3!$C$35,ROWS($C$35:C40)-1,COLUMNS($C$35:C40)-1),\"\")","v":""},{"$f":"IF(OFFSET(DE104_3!$D$35,ROWS($D$35:D40)-1,COLUMNS($D$35:D40)-1)<>\"\",OFFSET(DE104_3!$D$35,ROWS($D$35:D40)-1,COLUMNS($D$35:D40)-1),\"\")","v":""},{"$f":"IF(OFFSET(DE104_3!$E$35,ROWS($E$35:E40)-1,COLUMNS($E$35:E40)-1)<>\"\",OFFSET(DE104_3!$E$35,ROWS($E$35:E40)-1,COLUMNS($E$35:E40)-1),\"\")","v":""},{"$f":"IF(OFFSET(DE104_3!$F$35,ROWS($F$35:F40)-1,COLUMNS($F$35:F40)-1)<>\"\",OFFSET(DE104_3!$F$35,ROWS($F$35:F40)-1,COLUMNS($F$35:F40)-1),\"\")","v":""},{"$f":"IF(OFFSET(DE104_3!$G$35,ROWS($G$35:G40)-1,COLUMNS($G$35:G40)-1)<>\"\",OFFSET(DE104_3!$G$35,ROWS($G$35:G40)-1,COLUMNS($G$35:G40)-1),\"\")","v":""},{"$f":"IF(OFFSET(DE104_3!$H$35,ROWS($H$35:H40)-1,COLUMNS($H$35:H40)-1)<>\"\",OFFSET(DE104_3!$H$35,ROWS($H$35:H40)-1,COLUMNS($H$35:H40)-1),\"\")","v":""},{"$f":"IF(OFFSET(DE104_3!$I$35,ROWS($I$35:I40)-1,COLUMNS($I$35:I40)-1)<>\"\",OFFSET(DE104_3!$I$35,ROWS($I$35:I40)-1,COLUMNS($I$35:I40)-1),\"\")","v":""},{"$f":"IF(OFFSET(DE104_3!$J$35,ROWS($J$35:J40)-1,COLUMNS($J$35:J40)-1)<>\"\",OFFSET(DE104_3!$J$35,ROWS($J$35:J40)-1,COLUMNS($J$35:J40)-1),\"\")","v":""},{"$f":"IF(OFFSET(DE104_3!$K$35,ROWS($K$35:K40)-1,COLUMNS($K$35:K40)-1)<>\"\",OFFSET(DE104_3!$K$35,ROWS($K$35:K40)-1,COLUMNS($K$35:K40)-1),\"\")","v":""},{"$f":"IF(OFFSET(DE104_3!$L$35,ROWS($L$35:L40)-1,COLUMNS($L$35:L40)-1)<>\"\",OFFSET(DE104_3!$L$35,ROWS($L$35:L40)-1,COLUMNS($L$35:L40)-1),\"\")","v":""},{"$f":"IF(OFFSET(DE104_3!$M$35,ROWS($M$35:M40)-1,COLUMNS($M$35:M40)-1)<>\"\",OFFSET(DE104_3!$M$35,ROWS($M$35:M40)-1,COLUMNS($M$35:M40)-1),\"\")","v":""},{"$f":"IF(OFFSET(DE104_3!$N$35,ROWS($N$35:N40)-1,COLUMNS($N$35:N40)-1)<>\"\",OFFSET(DE104_3!$N$35,ROWS($N$35:N40)-1,COLUMNS($N$35:N40)-1),\"\")","v":""},{"$f":"IF(OFFSET(DE104_3!$O$35,ROWS($O$35:O40)-1,COLUMNS($O$35:O40)-1)<>\"\",OFFSET(DE104_3!$O$35,ROWS($O$35:O40)-1,COLUMNS($O$35:O40)-1),\"\")","v":""},{"$f":"IF(OFFSET(DE104_3!$P$35,ROWS($P$35:P40)-1,COLUMNS($P$35:P40)-1)<>\"\",OFFSET(DE104_3!$P$35,ROWS($P$35:P40)-1,COLUMNS($P$35:P40)-1),\"\")","v":""},{"$f":"IF(OFFSET(DE104_3!$Q$35,ROWS($Q$35:Q40)-1,COLUMNS($Q$35:Q40)-1)<>\"\",OFFSET(DE104_3!$Q$35,ROWS($Q$35:Q40)-1,COLUMNS($Q$35:Q40)-1),\"\")","v":""},{"$f":"IF(OFFSET(DE104_3!$R$35,ROWS($R$35:R40)-1,COLUMNS($R$35:R40)-1)<>\"\",OFFSET(DE104_3!$R$35,ROWS($R$35:R40)-1,COLUMNS($R$35:R40)-1),\"\")","v":""},{"$f":"IF(OFFSET(DE104_3!$S$35,ROWS($S$35:S40)-1,COLUMNS($S$35:S40)-1)<>\"\",OFFSET(DE104_3!$S$35,ROWS($S$35:S40)-1,COLUMNS($S$35:S40)-1),\"\")","v":""},{"$f":"IF(OFFSET(DE104_3!$T$35,ROWS($T$35:T40)-1,COLUMNS($T$35:T40)-1)<>\"\",OFFSET(DE104_3!$T$35,ROWS($T$35:T40)-1,COLUMNS($T$35:T40)-1),\"\")","v":""},{"$f":"IF(OFFSET(DE104_3!$U$35,ROWS($U$35:U40)-1,COLUMNS($U$35:U40)-1)<>\"\",OFFSET(DE104_3!$U$35,ROWS($U$35:U40)-1,COLUMNS($U$35:U40)-1),\"\")","v":""},{"$f":"IF(OFFSET(DE104_3!$V$35,ROWS($V$35:V40)-1,COLUMNS($V$35:V40)-1)<>\"\",OFFSET(DE104_3!$V$35,ROWS($V$35:V40)-1,COLUMNS($V$35:V40)-1),\"\")","v":""},{"$f":"IF(OFFSET(DE104_3!$W$35,ROWS($W$35:W40)-1,COLUMNS($W$35:W40)-1)<>\"\",OFFSET(DE104_3!$W$35,ROWS($W$35:W40)-1,COLUMNS($W$35:W40)-1),\"\")","v":""},{"$f":"IF(OFFSET(DE104_3!$X$35,ROWS($X$35:X40)-1,COLUMNS($X$35:X40)-1)<>\"\",OFFSET(DE104_3!$X$35,ROWS($X$35:X40)-1,COLUMNS($X$35:X40)-1),\"\")","v":""},{"$f":"IF(OFFSET(DE104_3!$Y$35,ROWS($Y$35:Y40)-1,COLUMNS($Y$35:Y40)-1)<>\"\",OFFSET(DE104_3!$Y$35,ROWS($Y$35:Y40)-1,COLUMNS($Y$35:Y40)-1),\"\")","v":""},{"$f":"IF(OFFSET(DE104_3!$Z$35,ROWS($Z$35:Z40)-1,COLUMNS($Z$35:Z40)-1)<>\"\",OFFSET(DE104_3!$Z$35,ROWS($Z$35:Z40)-1,COLUMNS($Z$35:Z40)-1),\"\")","v":""},{"$f":"IF(OFFSET(DE104_3!$AA$35,ROWS($AA$35:AA40)-1,COLUMNS($AA$35:AA40)-1)<>\"\",OFFSET(DE104_3!$AA$35,ROWS($AA$35:AA40)-1,COLUMNS($AA$35:AA40)-1),\"\")","v":""},{"$f":"IF(OFFSET(DE104_3!$AB$35,ROWS($AB$35:AB40)-1,COLUMNS($AB$35:AB40)-1)<>\"\",OFFSET(DE104_3!$AB$35,ROWS($AB$35:AB40)-1,COLUMNS($AB$35:AB40)-1),\"\")","v":""},{"$f":"IF(OFFSET(DE104_3!$AC$35,ROWS($AC$35:AC40)-1,COLUMNS($AC$35:AC40)-1)<>\"\",OFFSET(DE104_3!$AC$35,ROWS($AC$35:AC40)-1,COLUMNS($AC$35:AC40)-1),\"\")","v":""},{"$f":"IF(OFFSET(DE104_3!$AD$35,ROWS($AD$35:AD40)-1,COLUMNS($AD$35:AD40)-1)<>\"\",OFFSET(DE104_3!$AD$35,ROWS($AD$35:AD40)-1,COLUMNS($AD$35:AD40)-1),\"\")","v":""},{"$f":"IF(OFFSET(DE104_3!$AE$35,ROWS($AE$35:AE40)-1,COLUMNS($AE$35:AE40)-1)<>\"\",OFFSET(DE104_3!$AE$35,ROWS($AE$35:AE40)-1,COLUMNS($AE$35:AE40)-1),\"\")","v":""},{"$f":"IF(OFFSET(DE104_3!$AF$35,ROWS($AF$35:AF40)-1,COLUMNS($AF$35:AF40)-1)<>\"\",OFFSET(DE104_3!$AF$35,ROWS($AF$35:AF40)-1,COLUMNS($AF$35:AF40)-1),\"\")","v":""},{"$f":"IF(OFFSET(DE104_3!$AG$35,ROWS($AG$35:AG40)-1,COLUMNS($AG$35:AG40)-1)<>\"\",OFFSET(DE104_3!$AG$35,ROWS($AG$35:AG40)-1,COLUMNS($AG$35:AG40)-1),\"\")","v":""},{"$f":"IF(OFFSET(DE104_3!$AH$35,ROWS($AH$35:AH40)-1,COLUMNS($AH$35:AH40)-1)<>\"\",OFFSET(DE104_3!$AH$35,ROWS($AH$35:AH40)-1,COLUMNS($AH$35:AH40)-1),\"\")","v":""},{"$f":"IF(OFFSET(DE104_3!$AI$35,ROWS($AI$35:AI40)-1,COLUMNS($AI$35:AI40)-1)<>\"\",OFFSET(DE104_3!$AI$35,ROWS($AI$35:AI40)-1,COLUMNS($AI$35:AI40)-1),\"\")","v":""},{"$f":"IF(OFFSET(DE104_3!$AJ$35,ROWS($AJ$35:AJ40)-1,COLUMNS($AJ$35:AJ40)-1)<>\"\",OFFSET(DE104_3!$AJ$35,ROWS($AJ$35:AJ40)-1,COLUMNS($AJ$35:AJ40)-1),\"\")","v":""},{"$f":"IF(OFFSET(DE104_3!$AK$35,ROWS($AK$35:AK40)-1,COLUMNS($AK$35:AK40)-1)<>\"\",OFFSET(DE104_3!$AK$35,ROWS($AK$35:AK40)-1,COLUMNS($AK$35:AK40)-1),\"\")","v":""},{"$f":"IF(OFFSET(DE104_3!$AL$35,ROWS($AL$35:AL40)-1,COLUMNS($AL$35:AL40)-1)<>\"\",OFFSET(DE104_3!$AL$35,ROWS($AL$35:AL40)-1,COLUMNS($AL$35:AL40)-1),\"\")","v":""},{"$f":"IF(OFFSET(DE104_3!$AM$35,ROWS($AM$35:AM40)-1,COLUMNS($AM$35:AM40)-1)<>\"\",OFFSET(DE104_3!$AM$35,ROWS($AM$35:AM40)-1,COLUMNS($AM$35:AM40)-1),\"\")","v":""},{"$f":"IF(OFFSET(DE104_3!$AN$35,ROWS($AN$35:AN40)-1,COLUMNS($AN$35:AN40)-1)<>\"\",OFFSET(DE104_3!$AN$35,ROWS($AN$35:AN40)-1,COLUMNS($AN$35:AN40)-1),\"\")","v":""},{"$f":"IF(OFFSET(DE104_3!$AO$35,ROWS($AO$35:AO40)-1,COLUMNS($AO$35:AO40)-1)<>\"\",OFFSET(DE104_3!$AO$35,ROWS($AO$35:AO40)-1,COLUMNS($AO$35:AO40)-1),\"\")","v":""},{"$f":"IF(OFFSET(DE104_3!$AP$35,ROWS($AP$35:AP40)-1,COLUMNS($AP$35:AP40)-1)<>\"\",OFFSET(DE104_3!$AP$35,ROWS($AP$35:AP40)-1,COLUMNS($AP$35:AP40)-1),\"\")","v":""},{"$f":"IF(OFFSET(DE104_3!$AQ$35,ROWS($AQ$35:AQ40)-1,COLUMNS($AQ$35:AQ40)-1)<>\"\",OFFSET(DE104_3!$AQ$35,ROWS($AQ$35:AQ40)-1,COLUMNS($AQ$35:AQ40)-1),\"\")","v":""}]
[{"$f":"IF(OFFSET(DE104_3!$C$35,ROWS($C$35:C41)-1,COLUMNS($C$35:C41)-1)<>\"\",OFFSET(DE104_3!$C$35,ROWS($C$35:C41)-1,COLUMNS($C$35:C41)-1),\"\")","v":""},{"$f":"IF(OFFSET(DE104_3!$D$35,ROWS($D$35:D41)-1,COLUMNS($D$35:D41)-1)<>\"\",OFFSET(DE104_3!$D$35,ROWS($D$35:D41)-1,COLUMNS($D$35:D41)-1),\"\")","v":""},{"$f":"IF(OFFSET(DE104_3!$E$35,ROWS($E$35:E41)-1,COLUMNS($E$35:E41)-1)<>\"\",OFFSET(DE104_3!$E$35,ROWS($E$35:E41)-1,COLUMNS($E$35:E41)-1),\"\")","v":""},{"$f":"IF(OFFSET(DE104_3!$F$35,ROWS($F$35:F41)-1,COLUMNS($F$35:F41)-1)<>\"\",OFFSET(DE104_3!$F$35,ROWS($F$35:F41)-1,COLUMNS($F$35:F41)-1),\"\")","v":""},{"$f":"IF(OFFSET(DE104_3!$G$35,ROWS($G$35:G41)-1,COLUMNS($G$35:G41)-1)<>\"\",OFFSET(DE104_3!$G$35,ROWS($G$35:G41)-1,COLUMNS($G$35:G41)-1),\"\")","v":""},{"$f":"IF(OFFSET(DE104_3!$H$35,ROWS($H$35:H41)-1,COLUMNS($H$35:H41)-1)<>\"\",OFFSET(DE104_3!$H$35,ROWS($H$35:H41)-1,COLUMNS($H$35:H41)-1),\"\")","v":""},{"$f":"IF(OFFSET(DE104_3!$I$35,ROWS($I$35:I41)-1,COLUMNS($I$35:I41)-1)<>\"\",OFFSET(DE104_3!$I$35,ROWS($I$35:I41)-1,COLUMNS($I$35:I41)-1),\"\")","v":""},{"$f":"IF(OFFSET(DE104_3!$J$35,ROWS($J$35:J41)-1,COLUMNS($J$35:J41)-1)<>\"\",OFFSET(DE104_3!$J$35,ROWS($J$35:J41)-1,COLUMNS($J$35:J41)-1),\"\")","v":""},{"$f":"IF(OFFSET(DE104_3!$K$35,ROWS($K$35:K41)-1,COLUMNS($K$35:K41)-1)<>\"\",OFFSET(DE104_3!$K$35,ROWS($K$35:K41)-1,COLUMNS($K$35:K41)-1),\"\")","v":""},{"$f":"IF(OFFSET(DE104_3!$L$35,ROWS($L$35:L41)-1,COLUMNS($L$35:L41)-1)<>\"\",OFFSET(DE104_3!$L$35,ROWS($L$35:L41)-1,COLUMNS($L$35:L41)-1),\"\")","v":""},{"$f":"IF(OFFSET(DE104_3!$M$35,ROWS($M$35:M41)-1,COLUMNS($M$35:M41)-1)<>\"\",OFFSET(DE104_3!$M$35,ROWS($M$35:M41)-1,COLUMNS($M$35:M41)-1),\"\")","v":""},{"$f":"IF(OFFSET(DE104_3!$N$35,ROWS($N$35:N41)-1,COLUMNS($N$35:N41)-1)<>\"\",OFFSET(DE104_3!$N$35,ROWS($N$35:N41)-1,COLUMNS($N$35:N41)-1),\"\")","v":""},{"$f":"IF(OFFSET(DE104_3!$O$35,ROWS($O$35:O41)-1,COLUMNS($O$35:O41)-1)<>\"\",OFFSET(DE104_3!$O$35,ROWS($O$35:O41)-1,COLUMNS($O$35:O41)-1),\"\")","v":""},{"$f":"IF(OFFSET(DE104_3!$P$35,ROWS($P$35:P41)-1,COLUMNS($P$35:P41)-1)<>\"\",OFFSET(DE104_3!$P$35,ROWS($P$35:P41)-1,COLUMNS($P$35:P41)-1),\"\")","v":""},{"$f":"IF(OFFSET(DE104_3!$Q$35,ROWS($Q$35:Q41)-1,COLUMNS($Q$35:Q41)-1)<>\"\",OFFSET(DE104_3!$Q$35,ROWS($Q$35:Q41)-1,COLUMNS($Q$35:Q41)-1),\"\")","v":""},{"$f":"IF(OFFSET(DE104_3!$R$35,ROWS($R$35:R41)-1,COLUMNS($R$35:R41)-1)<>\"\",OFFSET(DE104_3!$R$35,ROWS($R$35:R41)-1,COLUMNS($R$35:R41)-1),\"\")","v":""},{"$f":"IF(OFFSET(DE104_3!$S$35,ROWS($S$35:S41)-1,COLUMNS($S$35:S41)-1)<>\"\",OFFSET(DE104_3!$S$35,ROWS($S$35:S41)-1,COLUMNS($S$35:S41)-1),\"\")","v":""},{"$f":"IF(OFFSET(DE104_3!$T$35,ROWS($T$35:T41)-1,COLUMNS($T$35:T41)-1)<>\"\",OFFSET(DE104_3!$T$35,ROWS($T$35:T41)-1,COLUMNS($T$35:T41)-1),\"\")","v":""},{"$f":"IF(OFFSET(DE104_3!$U$35,ROWS($U$35:U41)-1,COLUMNS($U$35:U41)-1)<>\"\",OFFSET(DE104_3!$U$35,ROWS($U$35:U41)-1,COLUMNS($U$35:U41)-1),\"\")","v":""},{"$f":"IF(OFFSET(DE104_3!$V$35,ROWS($V$35:V41)-1,COLUMNS($V$35:V41)-1)<>\"\",OFFSET(DE104_3!$V$35,ROWS($V$35:V41)-1,COLUMNS($V$35:V41)-1),\"\")","v":""},{"$f":"IF(OFFSET(DE104_3!$W$35,ROWS($W$35:W41)-1,COLUMNS($W$35:W41)-1)<>\"\",OFFSET(DE104_3!$W$35,ROWS($W$35:W41)-1,COLUMNS($W$35:W41)-1),\"\")","v":""},{"$f":"IF(OFFSET(DE104_3!$X$35,ROWS($X$35:X41)-1,COLUMNS($X$35:X41)-1)<>\"\",OFFSET(DE104_3!$X$35,ROWS($X$35:X41)-1,COLUMNS($X$35:X41)-1),\"\")","v":""},{"$f":"IF(OFFSET(DE104_3!$Y$35,ROWS($Y$35:Y41)-1,COLUMNS($Y$35:Y41)-1)<>\"\",OFFSET(DE104_3!$Y$35,ROWS($Y$35:Y41)-1,COLUMNS($Y$35:Y41)-1),\"\")","v":""},{"$f":"IF(OFFSET(DE104_3!$Z$35,ROWS($Z$35:Z41)-1,COLUMNS($Z$35:Z41)-1)<>\"\",OFFSET(DE104_3!$Z$35,ROWS($Z$35:Z41)-1,COLUMNS($Z$35:Z41)-1),\"\")","v":""},{"$f":"IF(OFFSET(DE104_3!$AA$35,ROWS($AA$35:AA41)-1,COLUMNS($AA$35:AA41)-1)<>\"\",OFFSET(DE104_3!$AA$35,ROWS($AA$35:AA41)-1,COLUMNS($AA$35:AA41)-1),\"\")","v":""},{"$f":"IF(OFFSET(DE104_3!$AB$35,ROWS($AB$35:AB41)-1,COLUMNS($AB$35:AB41)-1)<>\"\",OFFSET(DE104_3!$AB$35,ROWS($AB$35:AB41)-1,COLUMNS($AB$35:AB41)-1),\"\")","v":""},{"$f":"IF(OFFSET(DE104_3!$AC$35,ROWS($AC$35:AC41)-1,COLUMNS($AC$35:AC41)-1)<>\"\",OFFSET(DE104_3!$AC$35,ROWS($AC$35:AC41)-1,COLUMNS($AC$35:AC41)-1),\"\")","v":""},{"$f":"IF(OFFSET(DE104_3!$AD$35,ROWS($AD$35:AD41)-1,COLUMNS($AD$35:AD41)-1)<>\"\",OFFSET(DE104_3!$AD$35,ROWS($AD$35:AD41)-1,COLUMNS($AD$35:AD41)-1),\"\")","v":""},{"$f":"IF(OFFSET(DE104_3!$AE$35,ROWS($AE$35:AE41)-1,COLUMNS($AE$35:AE41)-1)<>\"\",OFFSET(DE104_3!$AE$35,ROWS($AE$35:AE41)-1,COLUMNS($AE$35:AE41)-1),\"\")","v":""},{"$f":"IF(OFFSET(DE104_3!$AF$35,ROWS($AF$35:AF41)-1,COLUMNS($AF$35:AF41)-1)<>\"\",OFFSET(DE104_3!$AF$35,ROWS($AF$35:AF41)-1,COLUMNS($AF$35:AF41)-1),\"\")","v":""},{"$f":"IF(OFFSET(DE104_3!$AG$35,ROWS($AG$35:AG41)-1,COLUMNS($AG$35:AG41)-1)<>\"\",OFFSET(DE104_3!$AG$35,ROWS($AG$35:AG41)-1,COLUMNS($AG$35:AG41)-1),\"\")","v":""},{"$f":"IF(OFFSET(DE104_3!$AH$35,ROWS($AH$35:AH41)-1,COLUMNS($AH$35:AH41)-1)<>\"\",OFFSET(DE104_3!$AH$35,ROWS($AH$35:AH41)-1,COLUMNS($AH$35:AH41)-1),\"\")","v":""},{"$f":"IF(OFFSET(DE104_3!$AI$35,ROWS($AI$35:AI41)-1,COLUMNS($AI$35:AI41)-1)<>\"\",OFFSET(DE104_3!$AI$35,ROWS($AI$35:AI41)-1,COLUMNS($AI$35:AI41)-1),\"\")","v":""},{"$f":"IF(OFFSET(DE104_3!$AJ$35,ROWS($AJ$35:AJ41)-1,COLUMNS($AJ$35:AJ41)-1)<>\"\",OFFSET(DE104_3!$AJ$35,ROWS($AJ$35:AJ41)-1,COLUMNS($AJ$35:AJ41)-1),\"\")","v":""},{"$f":"IF(OFFSET(DE104_3!$AK$35,ROWS($AK$35:AK41)-1,COLUMNS($AK$35:AK41)-1)<>\"\",OFFSET(DE104_3!$AK$35,ROWS($AK$35:AK41)-1,COLUMNS($AK$35:AK41)-1),\"\")","v":""},{"$f":"IF(OFFSET(DE104_3!$AL$35,ROWS($AL$35:AL41)-1,COLUMNS($AL$35:AL41)-1)<>\"\",OFFSET(DE104_3!$AL$35,ROWS($AL$35:AL41)-1,COLUMNS($AL$35:AL41)-1),\"\")","v":""},{"$f":"IF(OFFSET(DE104_3!$AM$35,ROWS($AM$35:AM41)-1,COLUMNS($AM$35:AM41)-1)<>\"\",OFFSET(DE104_3!$AM$35,ROWS($AM$35:AM41)-1,COLUMNS($AM$35:AM41)-1),\"\")","v":""},{"$f":"IF(OFFSET(DE104_3!$AN$35,ROWS($AN$35:AN41)-1,COLUMNS($AN$35:AN41)-1)<>\"\",OFFSET(DE104_3!$AN$35,ROWS($AN$35:AN41)-1,COLUMNS($AN$35:AN41)-1),\"\")","v":""},{"$f":"IF(OFFSET(DE104_3!$AO$35,ROWS($AO$35:AO41)-1,COLUMNS($AO$35:AO41)-1)<>\"\",OFFSET(DE104_3!$AO$35,ROWS($AO$35:AO41)-1,COLUMNS($AO$35:AO41)-1),\"\")","v":""},{"$f":"IF(OFFSET(DE104_3!$AP$35,ROWS($AP$35:AP41)-1,COLUMNS($AP$35:AP41)-1)<>\"\",OFFSET(DE104_3!$AP$35,ROWS($AP$35:AP41)-1,COLUMNS($AP$35:AP41)-1),\"\")","v":""},{"$f":"IF(OFFSET(DE104_3!$AQ$35,ROWS($AQ$35:AQ41)-1,COLUMNS($AQ$35:AQ41)-1)<>\"\",OFFSET(DE104_3!$AQ$35,ROWS($AQ$35:AQ41)-1,COLUMNS($AQ$35:AQ41)-1),\"\")","v":""}]
[{"$f":"IF(OFFSET(DE104_3!$C$35,ROWS($C$35:C42)-1,COLUMNS($C$35:C42)-1)<>\"\",OFFSET(DE104_3!$C$35,ROWS($C$35:C42)-1,COLUMNS($C$35:C42)-1),\"\")","v":""},{"$f":"IF(OFFSET(DE104_3!$D$35,ROWS($D$35:D42)-1,COLUMNS($D$35:D42)-1)<>\"\",OFFSET(DE104_3!$D$35,ROWS($D$35:D42)-1,COLUMNS($D$35:D42)-1),\"\")","v":""},{"$f":"IF(OFFSET(DE104_3!$E$35,ROWS($E$35:E42)-1,COLUMNS($E$35:E42)-1)<>\"\",OFFSET(DE104_3!$E$35,ROWS($E$35:E42)-1,COLUMNS($E$35:E42)-1),\"\")","v":""},{"$f":"IF(OFFSET(DE104_3!$F$35,ROWS($F$35:F42)-1,COLUMNS($F$35:F42)-1)<>\"\",OFFSET(DE104_3!$F$35,ROWS($F$35:F42)-1,COLUMNS($F$35:F42)-1),\"\")","v":""},{"$f":"IF(OFFSET(DE104_3!$G$35,ROWS($G$35:G42)-1,COLUMNS($G$35:G42)-1)<>\"\",OFFSET(DE104_3!$G$35,ROWS($G$35:G42)-1,COLUMNS($G$35:G42)-1),\"\")","v":""},{"$f":"IF(OFFSET(DE104_3!$H$35,ROWS($H$35:H42)-1,COLUMNS($H$35:H42)-1)<>\"\",OFFSET(DE104_3!$H$35,ROWS($H$35:H42)-1,COLUMNS($H$35:H42)-1),\"\")","v":""},{"$f":"IF(OFFSET(DE104_3!$I$35,ROWS($I$35:I42)-1,COLUMNS($I$35:I42)-1)<>\"\",OFFSET(DE104_3!$I$35,ROWS($I$35:I42)-1,COLUMNS($I$35:I42)-1),\"\")","v":""},{"$f":"IF(OFFSET(DE104_3!$J$35,ROWS($J$35:J42)-1,COLUMNS($J$35:J42)-1)<>\"\",OFFSET(DE104_3!$J$35,ROWS($J$35:J42)-1,COLUMNS($J$35:J42)-1),\"\")","v":""},{"$f":"IF(OFFSET(DE104_3!$K$35,ROWS($K$35:K42)-1,COLUMNS($K$35:K42)-1)<>\"\",OFFSET(DE104_3!$K$35,ROWS($K$35:K42)-1,COLUMNS($K$35:K42)-1),\"\")","v":""},{"$f":"IF(OFFSET(DE104_3!$L$35,ROWS($L$35:L42)-1,COLUMNS($L$35:L42)-1)<>\"\",OFFSET(DE104_3!$L$35,ROWS($L$35:L42)-1,COLUMNS($L$35:L42)-1),\"\")","v":""},{"$f":"IF(OFFSET(DE104_3!$M$35,ROWS($M$35:M42)-1,COLUMNS($M$35:M42)-1)<>\"\",OFFSET(DE104_3!$M$35,ROWS($M$35:M42)-1,COLUMNS($M$35:M42)-1),\"\")","v":""},{"$f":"IF(OFFSET(DE104_3!$N$35,ROWS($N$35:N42)-1,COLUMNS($N$35:N42)-1)<>\"\",OFFSET(DE104_3!$N$35,ROWS($N$35:N42)-1,COLUMNS($N$35:N42)-1),\"\")","v":""},{"$f":"IF(OFFSET(DE104_3!$O$35,ROWS($O$35:O42)-1,COLUMNS($O$35:O42)-1)<>\"\",OFFSET(DE104_3!$O$35,ROWS($O$35:O42)-1,COLUMNS($O$35:O42)-1),\"\")","v":""},{"$f":"IF(OFFSET(DE104_3!$P$35,ROWS($P$35:P42)-1,COLUMNS($P$35:P42)-1)<>\"\",OFFSET(DE104_3!$P$35,ROWS($P$35:P42)-1,COLUMNS($P$35:P42)-1),\"\")","v":""},{"$f":"IF(OFFSET(DE104_3!$Q$35,ROWS($Q$35:Q42)-1,COLUMNS($Q$35:Q42)-1)<>\"\",OFFSET(DE104_3!$Q$35,ROWS($Q$35:Q42)-1,COLUMNS($Q$35:Q42)-1),\"\")","v":""},{"$f":"IF(OFFSET(DE104_3!$R$35,ROWS($R$35:R42)-1,COLUMNS($R$35:R42)-1)<>\"\",OFFSET(DE104_3!$R$35,ROWS($R$35:R42)-1,COLUMNS($R$35:R42)-1),\"\")","v":""},{"$f":"IF(OFFSET(DE104_3!$S$35,ROWS($S$35:S42)-1,COLUMNS($S$35:S42)-1)<>\"\",OFFSET(DE104_3!$S$35,ROWS($S$35:S42)-1,COLUMNS($S$35:S42)-1),\"\")","v":""},{"$f":"IF(OFFSET(DE104_3!$T$35,ROWS($T$35:T42)-1,COLUMNS($T$35:T42)-1)<>\"\",OFFSET(DE104_3!$T$35,ROWS($T$35:T42)-1,COLUMNS($T$35:T42)-1),\"\")","v":""},{"$f":"IF(OFFSET(DE104_3!$U$35,ROWS($U$35:U42)-1,COLUMNS($U$35:U42)-1)<>\"\",OFFSET(DE104_3!$U$35,ROWS($U$35:U42)-1,COLUMNS($U$35:U42)-1),\"\")","v":""},{"$f":"IF(OFFSET(DE104_3!$V$35,ROWS($V$35:V42)-1,COLUMNS($V$35:V42)-1)<>\"\",OFFSET(DE104_3!$V$35,ROWS($V$35:V42)-1,COLUMNS($V$35:V42)-1),\"\")","v":""},{"$f":"IF(OFFSET(DE104_3!$W$35,ROWS($W$35:W42)-1,COLUMNS($W$35:W42)-1)<>\"\",OFFSET(DE104_3!$W$35,ROWS($W$35:W42)-1,COLUMNS($W$35:W42)-1),\"\")","v":""},{"$f":"IF(OFFSET(DE104_3!$X$35,ROWS($X$35:X42)-1,COLUMNS($X$35:X42)-1)<>\"\",OFFSET(DE104_3!$X$35,ROWS($X$35:X42)-1,COLUMNS($X$35:X42)-1),\"\")","v":""},{"$f":"IF(OFFSET(DE104_3!$Y$35,ROWS($Y$35:Y42)-1,COLUMNS($Y$35:Y42)-1)<>\"\",OFFSET(DE104_3!$Y$35,ROWS($Y$35:Y42)-1,COLUMNS($Y$35:Y42)-1),\"\")","v":""},{"$f":"IF(OFFSET(DE104_3!$Z$35,ROWS($Z$35:Z42)-1,COLUMNS($Z$35:Z42)-1)<>\"\",OFFSET(DE104_3!$Z$35,ROWS($Z$35:Z42)-1,COLUMNS($Z$35:Z42)-1),\"\")","v":""},{"$f":"IF(OFFSET(DE104_3!$AA$35,ROWS($AA$35:AA42)-1,COLUMNS($AA$35:AA42)-1)<>\"\",OFFSET(DE104_3!$AA$35,ROWS($AA$35:AA42)-1,COLUMNS($AA$35:AA42)-1),\"\")","v":""},{"$f":"IF(OFFSET(DE104_3!$AB$35,ROWS($AB$35:AB42)-1,COLUMNS($AB$35:AB42)-1)<>\"\",OFFSET(DE104_3!$AB$35,ROWS($AB$35:AB42)-1,COLUMNS($AB$35:AB42)-1),\"\")","v":""},{"$f":"IF(OFFSET(DE104_3!$AC$35,ROWS($AC$35:AC42)-1,COLUMNS($AC$35:AC42)-1)<>\"\",OFFSET(DE104_3!$AC$35,ROWS($AC$35:AC42)-1,COLUMNS($AC$35:AC42)-1),\"\")","v":""},{"$f":"IF(OFFSET(DE104_3!$AD$35,ROWS($AD$35:AD42)-1,COLUMNS($AD$35:AD42)-1)<>\"\",OFFSET(DE104_3!$AD$35,ROWS($AD$35:AD42)-1,COLUMNS($AD$35:AD42)-1),\"\")","v":""},{"$f":"IF(OFFSET(DE104_3!$AE$35,ROWS($AE$35:AE42)-1,COLUMNS($AE$35:AE42)-1)<>\"\",OFFSET(DE104_3!$AE$35,ROWS($AE$35:AE42)-1,COLUMNS($AE$35:AE42)-1),\"\")","v":""},{"$f":"IF(OFFSET(DE104_3!$AF$35,ROWS($AF$35:AF42)-1,COLUMNS($AF$35:AF42)-1)<>\"\",OFFSET(DE104_3!$AF$35,ROWS($AF$35:AF42)-1,COLUMNS($AF$35:AF42)-1),\"\")","v":""},{"$f":"IF(OFFSET(DE104_3!$AG$35,ROWS($AG$35:AG42)-1,COLUMNS($AG$35:AG42)-1)<>\"\",OFFSET(DE104_3!$AG$35,ROWS($AG$35:AG42)-1,COLUMNS($AG$35:AG42)-1),\"\")","v":""},{"$f":"IF(OFFSET(DE104_3!$AH$35,ROWS($AH$35:AH42)-1,COLUMNS($AH$35:AH42)-1)<>\"\",OFFSET(DE104_3!$AH$35,ROWS($AH$35:AH42)-1,COLUMNS($AH$35:AH42)-1),\"\")","v":""},{"$f":"IF(OFFSET(DE104_3!$AI$35,ROWS($AI$35:AI42)-1,COLUMNS($AI$35:AI42)-1)<>\"\",OFFSET(DE104_3!$AI$35,ROWS($AI$35:AI42)-1,COLUMNS($AI$35:AI42)-1),\"\")","v":""},{"$f":"IF(OFFSET(DE104_3!$AJ$35,ROWS($AJ$35:AJ42)-1,COLUMNS($AJ$35:AJ42)-1)<>\"\",OFFSET(DE104_3!$AJ$35,ROWS($AJ$35:AJ42)-1,COLUMNS($AJ$35:AJ42)-1),\"\")","v":""},{"$f":"IF(OFFSET(DE104_3!$AK$35,ROWS($AK$35:AK42)-1,COLUMNS($AK$35:AK42)-1)<>\"\",OFFSET(DE104_3!$AK$35,ROWS($AK$35:AK42)-1,COLUMNS($AK$35:AK42)-1),\"\")","v":""},{"$f":"IF(OFFSET(DE104_3!$AL$35,ROWS($AL$35:AL42)-1,COLUMNS($AL$35:AL42)-1)<>\"\",OFFSET(DE104_3!$AL$35,ROWS($AL$35:AL42)-1,COLUMNS($AL$35:AL42)-1),\"\")","v":""},{"$f":"IF(OFFSET(DE104_3!$AM$35,ROWS($AM$35:AM42)-1,COLUMNS($AM$35:AM42)-1)<>\"\",OFFSET(DE104_3!$AM$35,ROWS($AM$35:AM42)-1,COLUMNS($AM$35:AM42)-1),\"\")","v":""},{"$f":"IF(OFFSET(DE104_3!$AN$35,ROWS($AN$35:AN42)-1,COLUMNS($AN$35:AN42)-1)<>\"\",OFFSET(DE104_3!$AN$35,ROWS($AN$35:AN42)-1,COLUMNS($AN$35:AN42)-1),\"\")","v":""},{"$f":"IF(OFFSET(DE104_3!$AO$35,ROWS($AO$35:AO42)-1,COLUMNS($AO$35:AO42)-1)<>\"\",OFFSET(DE104_3!$AO$35,ROWS($AO$35:AO42)-1,COLUMNS($AO$35:AO42)-1),\"\")","v":""},{"$f":"IF(OFFSET(DE104_3!$AP$35,ROWS($AP$35:AP42)-1,COLUMNS($AP$35:AP42)-1)<>\"\",OFFSET(DE104_3!$AP$35,ROWS($AP$35:AP42)-1,COLUMNS($AP$35:AP42)-1),\"\")","v":""},{"$f":"IF(OFFSET(DE104_3!$AQ$35,ROWS($AQ$35:AQ42)-1,COLUMNS($AQ$35:AQ42)-1)<>\"\",OFFSET(DE104_3!$AQ$35,ROWS($AQ$35:AQ42)-1,COLUMNS($AQ$35:AQ42)-1),\"\")","v":""}]
[{"$f":"IF(OFFSET(DE104_3!$C$35,ROWS($C$35:C43)-1,COLUMNS($C$35:C43)-1)<>\"\",OFFSET(DE104_3!$C$35,ROWS($C$35:C43)-1,COLUMNS($C$35:C43)-1),\"\")","v":""},{"$f":"IF(OFFSET(DE104_3!$D$35,ROWS($D$35:D43)-1,COLUMNS($D$35:D43)-1)<>\"\",OFFSET(DE104_3!$D$35,ROWS($D$35:D43)-1,COLUMNS($D$35:D43)-1),\"\")","v":""},{"$f":"IF(OFFSET(DE104_3!$E$35,ROWS($E$35:E43)-1,COLUMNS($E$35:E43)-1)<>\"\",OFFSET(DE104_3!$E$35,ROWS($E$35:E43)-1,COLUMNS($E$35:E43)-1),\"\")","v":""},{"$f":"IF(OFFSET(DE104_3!$F$35,ROWS($F$35:F43)-1,COLUMNS($F$35:F43)-1)<>\"\",OFFSET(DE104_3!$F$35,ROWS($F$35:F43)-1,COLUMNS($F$35:F43)-1),\"\")","v":""},{"$f":"IF(OFFSET(DE104_3!$G$35,ROWS($G$35:G43)-1,COLUMNS($G$35:G43)-1)<>\"\",OFFSET(DE104_3!$G$35,ROWS($G$35:G43)-1,COLUMNS($G$35:G43)-1),\"\")","v":""},{"$f":"IF(OFFSET(DE104_3!$H$35,ROWS($H$35:H43)-1,COLUMNS($H$35:H43)-1)<>\"\",OFFSET(DE104_3!$H$35,ROWS($H$35:H43)-1,COLUMNS($H$35:H43)-1),\"\")","v":""},{"$f":"IF(OFFSET(DE104_3!$I$35,ROWS($I$35:I43)-1,COLUMNS($I$35:I43)-1)<>\"\",OFFSET(DE104_3!$I$35,ROWS($I$35:I43)-1,COLUMNS($I$35:I43)-1),\"\")","v":""},{"$f":"IF(OFFSET(DE104_3!$J$35,ROWS($J$35:J43)-1,COLUMNS($J$35:J43)-1)<>\"\",OFFSET(DE104_3!$J$35,ROWS($J$35:J43)-1,COLUMNS($J$35:J43)-1),\"\")","v":""},{"$f":"IF(OFFSET(DE104_3!$K$35,ROWS($K$35:K43)-1,COLUMNS($K$35:K43)-1)<>\"\",OFFSET(DE104_3!$K$35,ROWS($K$35:K43)-1,COLUMNS($K$35:K43)-1),\"\")","v":""},{"$f":"IF(OFFSET(DE104_3!$L$35,ROWS($L$35:L43)-1,COLUMNS($L$35:L43)-1)<>\"\",OFFSET(DE104_3!$L$35,ROWS($L$35:L43)-1,COLUMNS($L$35:L43)-1),\"\")","v":""},{"$f":"IF(OFFSET(DE104_3!$M$35,ROWS($M$35:M43)-1,COLUMNS($M$35:M43)-1)<>\"\",OFFSET(DE104_3!$M$35,ROWS($M$35:M43)-1,COLUMNS($M$35:M43)-1),\"\")","v":""},{"$f":"IF(OFFSET(DE104_3!$N$35,ROWS($N$35:N43)-1,COLUMNS($N$35:N43)-1)<>\"\",OFFSET(DE104_3!$N$35,ROWS($N$35:N43)-1,COLUMNS($N$35:N43)-1),\"\")","v":""},{"$f":"IF(OFFSET(DE104_3!$O$35,ROWS($O$35:O43)-1,COLUMNS($O$35:O43)-1)<>\"\",OFFSET(DE104_3!$O$35,ROWS($O$35:O43)-1,COLUMNS($O$35:O43)-1),\"\")","v":""},{"$f":"IF(OFFSET(DE104_3!$P$35,ROWS($P$35:P43)-1,COLUMNS($P$35:P43)-1)<>\"\",OFFSET(DE104_3!$P$35,ROWS($P$35:P43)-1,COLUMNS($P$35:P43)-1),\"\")","v":""},{"$f":"IF(OFFSET(DE104_3!$Q$35,ROWS($Q$35:Q43)-1,COLUMNS($Q$35:Q43)-1)<>\"\",OFFSET(DE104_3!$Q$35,ROWS($Q$35:Q43)-1,COLUMNS($Q$35:Q43)-1),\"\")","v":""},{"$f":"IF(OFFSET(DE104_3!$R$35,ROWS($R$35:R43)-1,COLUMNS($R$35:R43)-1)<>\"\",OFFSET(DE104_3!$R$35,ROWS($R$35:R43)-1,COLUMNS($R$35:R43)-1),\"\")","v":""},{"$f":"IF(OFFSET(DE104_3!$S$35,ROWS($S$35:S43)-1,COLUMNS($S$35:S43)-1)<>\"\",OFFSET(DE104_3!$S$35,ROWS($S$35:S43)-1,COLUMNS($S$35:S43)-1),\"\")","v":""},{"$f":"IF(OFFSET(DE104_3!$T$35,ROWS($T$35:T43)-1,COLUMNS($T$35:T43)-1)<>\"\",OFFSET(DE104_3!$T$35,ROWS($T$35:T43)-1,COLUMNS($T$35:T43)-1),\"\")","v":""},{"$f":"IF(OFFSET(DE104_3!$U$35,ROWS($U$35:U43)-1,COLUMNS($U$35:U43)-1)<>\"\",OFFSET(DE104_3!$U$35,ROWS($U$35:U43)-1,COLUMNS($U$35:U43)-1),\"\")","v":""},{"$f":"IF(OFFSET(DE104_3!$V$35,ROWS($V$35:V43)-1,COLUMNS($V$35:V43)-1)<>\"\",OFFSET(DE104_3!$V$35,ROWS($V$35:V43)-1,COLUMNS($V$35:V43)-1),\"\")","v":""},{"$f":"IF(OFFSET(DE104_3!$W$35,ROWS($W$35:W43)-1,COLUMNS($W$35:W43)-1)<>\"\",OFFSET(DE104_3!$W$35,ROWS($W$35:W43)-1,COLUMNS($W$35:W43)-1),\"\")","v":""},{"$f":"IF(OFFSET(DE104_3!$X$35,ROWS($X$35:X43)-1,COLUMNS($X$35:X43)-1)<>\"\",OFFSET(DE104_3!$X$35,ROWS($X$35:X43)-1,COLUMNS($X$35:X43)-1),\"\")","v":""},{"$f":"IF(OFFSET(DE104_3!$Y$35,ROWS($Y$35:Y43)-1,COLUMNS($Y$35:Y43)-1)<>\"\",OFFSET(DE104_3!$Y$35,ROWS($Y$35:Y43)-1,COLUMNS($Y$35:Y43)-1),\"\")","v":""},{"$f":"IF(OFFSET(DE104_3!$Z$35,ROWS($Z$35:Z43)-1,COLUMNS($Z$35:Z43)-1)<>\"\",OFFSET(DE104_3!$Z$35,ROWS($Z$35:Z43)-1,COLUMNS($Z$35:Z43)-1),\"\")","v":""},{"$f":"IF(OFFSET(DE104_3!$AA$35,ROWS($AA$35:AA43)-1,COLUMNS($AA$35:AA43)-1)<>\"\",OFFSET(DE104_3!$AA$35,ROWS($AA$35:AA43)-1,COLUMNS($AA$35:AA43)-1),\"\")","v":""},{"$f":"IF(OFFSET(DE104_3!$AB$35,ROWS($AB$35:AB43)-1,COLUMNS($AB$35:AB43)-1)<>\"\",OFFSET(DE104_3!$AB$35,ROWS($AB$35:AB43)-1,COLUMNS($AB$35:AB43)-1),\"\")","v":""},{"$f":"IF(OFFSET(DE104_3!$AC$35,ROWS($AC$35:AC43)-1,COLUMNS($AC$35:AC43)-1)<>\"\",OFFSET(DE104_3!$AC$35,ROWS($AC$35:AC43)-1,COLUMNS($AC$35:AC43)-1),\"\")","v":""},{"$f":"IF(OFFSET(DE104_3!$AD$35,ROWS($AD$35:AD43)-1,COLUMNS($AD$35:AD43)-1)<>\"\",OFFSET(DE104_3!$AD$35,ROWS($AD$35:AD43)-1,COLUMNS($AD$35:AD43)-1),\"\")","v":""},{"$f":"IF(OFFSET(DE104_3!$AE$35,ROWS($AE$35:AE43)-1,COLUMNS($AE$35:AE43)-1)<>\"\",OFFSET(DE104_3!$AE$35,ROWS($AE$35:AE43)-1,COLUMNS($AE$35:AE43)-1),\"\")","v":""},{"$f":"IF(OFFSET(DE104_3!$AF$35,ROWS($AF$35:AF43)-1,COLUMNS($AF$35:AF43)-1)<>\"\",OFFSET(DE104_3!$AF$35,ROWS($AF$35:AF43)-1,COLUMNS($AF$35:AF43)-1),\"\")","v":""},{"$f":"IF(OFFSET(DE104_3!$AG$35,ROWS($AG$35:AG43)-1,COLUMNS($AG$35:AG43)-1)<>\"\",OFFSET(DE104_3!$AG$35,ROWS($AG$35:AG43)-1,COLUMNS($AG$35:AG43)-1),\"\")","v":""},{"$f":"IF(OFFSET(DE104_3!$AH$35,ROWS($AH$35:AH43)-1,COLUMNS($AH$35:AH43)-1)<>\"\",OFFSET(DE104_3!$AH$35,ROWS($AH$35:AH43)-1,COLUMNS($AH$35:AH43)-1),\"\")","v":""},{"$f":"IF(OFFSET(DE104_3!$AI$35,ROWS($AI$35:AI43)-1,COLUMNS($AI$35:AI43)-1)<>\"\",OFFSET(DE104_3!$AI$35,ROWS($AI$35:AI43)-1,COLUMNS($AI$35:AI43)-1),\"\")","v":""},{"$f":"IF(OFFSET(DE104_3!$AJ$35,ROWS($AJ$35:AJ43)-1,COLUMNS($AJ$35:AJ43)-1)<>\"\",OFFSET(DE104_3!$AJ$35,ROWS($AJ$35:AJ43)-1,COLUMNS($AJ$35:AJ43)-1),\"\")","v":""},{"$f":"IF(OFFSET(DE104_3!$AK$35,ROWS($AK$35:AK43)-1,COLUMNS($AK$35:AK43)-1)<>\"\",OFFSET(DE104_3!$AK$35,ROWS($AK$35:AK43)-1,COLUMNS($AK$35:AK43)-1),\"\")","v":""},{"$f":"IF(OFFSET(DE104_3!$AL$35,ROWS($AL$35:AL43)-1,COLUMNS($AL$35:AL43)-1)<>\"\",OFFSET(DE104_3!$AL$35,ROWS($AL$35:AL43)-1,COLUMNS($AL$35:AL43)-1),\"\")","v":""},{"$f":"IF(OFFSET(DE104_3!$AM$35,ROWS($AM$35:AM43)-1,COLUMNS($AM$35:AM43)-1)<>\"\",OFFSET(DE104_3!$AM$35,ROWS($AM$35:AM43)-1,COLUMNS($AM$35:AM43)-1),\"\")","v":""},{"$f":"IF(OFFSET(DE104_3!$AN$35,ROWS($AN$35:AN43)-1,COLUMNS($AN$35:AN43)-1)<>\"\",OFFSET(DE104_3!$AN$35,ROWS($AN$35:AN43)-1,COLUMNS($AN$35:AN43)-1),\"\")","v":""},{"$f":"IF(OFFSET(DE104_3!$AO$35,ROWS($AO$35:AO43)-1,COLUMNS($AO$35:AO43)-1)<>\"\",OFFSET(DE104_3!$AO$35,ROWS($AO$35:AO43)-1,COLUMNS($AO$35:AO43)-1),\"\")","v":""},{"$f":"IF(OFFSET(DE104_3!$AP$35,ROWS($AP$35:AP43)-1,COLUMNS($AP$35:AP43)-1)<>\"\",OFFSET(DE104_3!$AP$35,ROWS($AP$35:AP43)-1,COLUMNS($AP$35:AP43)-1),\"\")","v":""},{"$f":"IF(OFFSET(DE104_3!$AQ$35,ROWS($AQ$35:AQ43)-1,COLUMNS($AQ$35:AQ43)-1)<>\"\",OFFSET(DE104_3!$AQ$35,ROWS($AQ$35:AQ43)-1,COLUMNS($AQ$35:AQ43)-1),\"\")","v":""}]
[{"$f":"IF(OFFSET(DE104_3!$C$35,ROWS($C$35:C44)-1,COLUMNS($C$35:C44)-1)<>\"\",OFFSET(DE104_3!$C$35,ROWS($C$35:C44)-1,COLUMNS($C$35:C44)-1),\"\")","v":""},{"$f":"IF(OFFSET(DE104_3!$D$35,ROWS($D$35:D44)-1,COLUMNS($D$35:D44)-1)<>\"\",OFFSET(DE104_3!$D$35,ROWS($D$35:D44)-1,COLUMNS($D$35:D44)-1),\"\")","v":""},{"$f":"IF(OFFSET(DE104_3!$E$35,ROWS($E$35:E44)-1,COLUMNS($E$35:E44)-1)<>\"\",OFFSET(DE104_3!$E$35,ROWS($E$35:E44)-1,COLUMNS($E$35:E44)-1),\"\")","v":""},{"$f":"IF(OFFSET(DE104_3!$F$35,ROWS($F$35:F44)-1,COLUMNS($F$35:F44)-1)<>\"\",OFFSET(DE104_3!$F$35,ROWS($F$35:F44)-1,COLUMNS($F$35:F44)-1),\"\")","v":""},{"$f":"IF(OFFSET(DE104_3!$G$35,ROWS($G$35:G44)-1,COLUMNS($G$35:G44)-1)<>\"\",OFFSET(DE104_3!$G$35,ROWS($G$35:G44)-1,COLUMNS($G$35:G44)-1),\"\")","v":""},{"$f":"IF(OFFSET(DE104_3!$H$35,ROWS($H$35:H44)-1,COLUMNS($H$35:H44)-1)<>\"\",OFFSET(DE104_3!$H$35,ROWS($H$35:H44)-1,COLUMNS($H$35:H44)-1),\"\")","v":""},{"$f":"IF(OFFSET(DE104_3!$I$35,ROWS($I$35:I44)-1,COLUMNS($I$35:I44)-1)<>\"\",OFFSET(DE104_3!$I$35,ROWS($I$35:I44)-1,COLUMNS($I$35:I44)-1),\"\")","v":""},{"$f":"IF(OFFSET(DE104_3!$J$35,ROWS($J$35:J44)-1,COLUMNS($J$35:J44)-1)<>\"\",OFFSET(DE104_3!$J$35,ROWS($J$35:J44)-1,COLUMNS($J$35:J44)-1),\"\")","v":""},{"$f":"IF(OFFSET(DE104_3!$K$35,ROWS($K$35:K44)-1,COLUMNS($K$35:K44)-1)<>\"\",OFFSET(DE104_3!$K$35,ROWS($K$35:K44)-1,COLUMNS($K$35:K44)-1),\"\")","v":""},{"$f":"IF(OFFSET(DE104_3!$L$35,ROWS($L$35:L44)-1,COLUMNS($L$35:L44)-1)<>\"\",OFFSET(DE104_3!$L$35,ROWS($L$35:L44)-1,COLUMNS($L$35:L44)-1),\"\")","v":""},{"$f":"IF(OFFSET(DE104_3!$M$35,ROWS($M$35:M44)-1,COLUMNS($M$35:M44)-1)<>\"\",OFFSET(DE104_3!$M$35,ROWS($M$35:M44)-1,COLUMNS($M$35:M44)-1),\"\")","v":""},{"$f":"IF(OFFSET(DE104_3!$N$35,ROWS($N$35:N44)-1,COLUMNS($N$35:N44)-1)<>\"\",OFFSET(DE104_3!$N$35,ROWS($N$35:N44)-1,COLUMNS($N$35:N44)-1),\"\")","v":""},{"$f":"IF(OFFSET(DE104_3!$O$35,ROWS($O$35:O44)-1,COLUMNS($O$35:O44)-1)<>\"\",OFFSET(DE104_3!$O$35,ROWS($O$35:O44)-1,COLUMNS($O$35:O44)-1),\"\")","v":""},{"$f":"IF(OFFSET(DE104_3!$P$35,ROWS($P$35:P44)-1,COLUMNS($P$35:P44)-1)<>\"\",OFFSET(DE104_3!$P$35,ROWS($P$35:P44)-1,COLUMNS($P$35:P44)-1),\"\")","v":""},{"$f":"IF(OFFSET(DE104_3!$Q$35,ROWS($Q$35:Q44)-1,COLUMNS($Q$35:Q44)-1)<>\"\",OFFSET(DE104_3!$Q$35,ROWS($Q$35:Q44)-1,COLUMNS($Q$35:Q44)-1),\"\")","v":""},{"$f":"IF(OFFSET(DE104_3!$R$35,ROWS($R$35:R44)-1,COLUMNS($R$35:R44)-1)<>\"\",OFFSET(DE104_3!$R$35,ROWS($R$35:R44)-1,COLUMNS($R$35:R44)-1),\"\")","v":""},{"$f":"IF(OFFSET(DE104_3!$S$35,ROWS($S$35:S44)-1,COLUMNS($S$35:S44)-1)<>\"\",OFFSET(DE104_3!$S$35,ROWS($S$35:S44)-1,COLUMNS($S$35:S44)-1),\"\")","v":""},{"$f":"IF(OFFSET(DE104_3!$T$35,ROWS($T$35:T44)-1,COLUMNS($T$35:T44)-1)<>\"\",OFFSET(DE104_3!$T$35,ROWS($T$35:T44)-1,COLUMNS($T$35:T44)-1),\"\")","v":""},{"$f":"IF(OFFSET(DE104_3!$U$35,ROWS($U$35:U44)-1,COLUMNS($U$35:U44)-1)<>\"\",OFFSET(DE104_3!$U$35,ROWS($U$35:U44)-1,COLUMNS($U$35:U44)-1),\"\")","v":""},{"$f":"IF(OFFSET(DE104_3!$V$35,ROWS($V$35:V44)-1,COLUMNS($V$35:V44)-1)<>\"\",OFFSET(DE104_3!$V$35,ROWS($V$35:V44)-1,COLUMNS($V$35:V44)-1),\"\")","v":""},{"$f":"IF(OFFSET(DE104_3!$W$35,ROWS($W$35:W44)-1,COLUMNS($W$35:W44)-1)<>\"\",OFFSET(DE104_3!$W$35,ROWS($W$35:W44)-1,COLUMNS($W$35:W44)-1),\"\")","v":""},{"$f":"IF(OFFSET(DE104_3!$X$35,ROWS($X$35:X44)-1,COLUMNS($X$35:X44)-1)<>\"\",OFFSET(DE104_3!$X$35,ROWS($X$35:X44)-1,COLUMNS($X$35:X44)-1),\"\")","v":""},{"$f":"IF(OFFSET(DE104_3!$Y$35,ROWS($Y$35:Y44)-1,COLUMNS($Y$35:Y44)-1)<>\"\",OFFSET(DE104_3!$Y$35,ROWS($Y$35:Y44)-1,COLUMNS($Y$35:Y44)-1),\"\")","v":""},{"$f":"IF(OFFSET(DE104_3!$Z$35,ROWS($Z$35:Z44)-1,COLUMNS($Z$35:Z44)-1)<>\"\",OFFSET(DE104_3!$Z$35,ROWS($Z$35:Z44)-1,COLUMNS($Z$35:Z44)-1),\"\")","v":""},{"$f":"IF(OFFSET(DE104_3!$AA$35,ROWS($AA$35:AA44)-1,COLUMNS($AA$35:AA44)-1)<>\"\",OFFSET(DE104_3!$AA$35,ROWS($AA$35:AA44)-1,COLUMNS($AA$35:AA44)-1),\"\")","v":""},{"$f":"IF(OFFSET(DE104_3!$AB$35,ROWS($AB$35:AB44)-1,COLUMNS($AB$35:AB44)-1)<>\"\",OFFSET(DE104_3!$AB$35,ROWS($AB$35:AB44)-1,COLUMNS($AB$35:AB44)-1),\"\")","v":""},{"$f":"IF(OFFSET(DE104_3!$AC$35,ROWS($AC$35:AC44)-1,COLUMNS($AC$35:AC44)-1)<>\"\",OFFSET(DE104_3!$AC$35,ROWS($AC$35:AC44)-1,COLUMNS($AC$35:AC44)-1),\"\")","v":""},{"$f":"IF(OFFSET(DE104_3!$AD$35,ROWS($AD$35:AD44)-1,COLUMNS($AD$35:AD44)-1)<>\"\",OFFSET(DE104_3!$AD$35,ROWS($AD$35:AD44)-1,COLUMNS($AD$35:AD44)-1),\"\")","v":""},{"$f":"IF(OFFSET(DE104_3!$AE$35,ROWS($AE$35:AE44)-1,COLUMNS($AE$35:AE44)-1)<>\"\",OFFSET(DE104_3!$AE$35,ROWS($AE$35:AE44)-1,COLUMNS($AE$35:AE44)-1),\"\")","v":""},{"$f":"IF(OFFSET(DE104_3!$AF$35,ROWS($AF$35:AF44)-1,COLUMNS($AF$35:AF44)-1)<>\"\",OFFSET(DE104_3!$AF$35,ROWS($AF$35:AF44)-1,COLUMNS($AF$35:AF44)-1),\"\")","v":""},{"$f":"IF(OFFSET(DE104_3!$AG$35,ROWS($AG$35:AG44)-1,COLUMNS($AG$35:AG44)-1)<>\"\",OFFSET(DE104_3!$AG$35,ROWS($AG$35:AG44)-1,COLUMNS($AG$35:AG44)-1),\"\")","v":""},{"$f":"IF(OFFSET(DE104_3!$AH$35,ROWS($AH$35:AH44)-1,COLUMNS($AH$35:AH44)-1)<>\"\",OFFSET(DE104_3!$AH$35,ROWS($AH$35:AH44)-1,COLUMNS($AH$35:AH44)-1),\"\")","v":""},{"$f":"IF(OFFSET(DE104_3!$AI$35,ROWS($AI$35:AI44)-1,COLUMNS($AI$35:AI44)-1)<>\"\",OFFSET(DE104_3!$AI$35,ROWS($AI$35:AI44)-1,COLUMNS($AI$35:AI44)-1),\"\")","v":""},{"$f":"IF(OFFSET(DE104_3!$AJ$35,ROWS($AJ$35:AJ44)-1,COLUMNS($AJ$35:AJ44)-1)<>\"\",OFFSET(DE104_3!$AJ$35,ROWS($AJ$35:AJ44)-1,COLUMNS($AJ$35:AJ44)-1),\"\")","v":""},{"$f":"IF(OFFSET(DE104_3!$AK$35,ROWS($AK$35:AK44)-1,COLUMNS($AK$35:AK44)-1)<>\"\",OFFSET(DE104_3!$AK$35,ROWS($AK$35:AK44)-1,COLUMNS($AK$35:AK44)-1),\"\")","v":""},{"$f":"IF(OFFSET(DE104_3!$AL$35,ROWS($AL$35:AL44)-1,COLUMNS($AL$35:AL44)-1)<>\"\",OFFSET(DE104_3!$AL$35,ROWS($AL$35:AL44)-1,COLUMNS($AL$35:AL44)-1),\"\")","v":""},{"$f":"IF(OFFSET(DE104_3!$AM$35,ROWS($AM$35:AM44)-1,COLUMNS($AM$35:AM44)-1)<>\"\",OFFSET(DE104_3!$AM$35,ROWS($AM$35:AM44)-1,COLUMNS($AM$35:AM44)-1),\"\")","v":""},{"$f":"IF(OFFSET(DE104_3!$AN$35,ROWS($AN$35:AN44)-1,COLUMNS($AN$35:AN44)-1)<>\"\",OFFSET(DE104_3!$AN$35,ROWS($AN$35:AN44)-1,COLUMNS($AN$35:AN44)-1),\"\")","v":""},{"$f":"IF(OFFSET(DE104_3!$AO$35,ROWS($AO$35:AO44)-1,COLUMNS($AO$35:AO44)-1)<>\"\",OFFSET(DE104_3!$AO$35,ROWS($AO$35:AO44)-1,COLUMNS($AO$35:AO44)-1),\"\")","v":""},{"$f":"IF(OFFSET(DE104_3!$AP$35,ROWS($AP$35:AP44)-1,COLUMNS($AP$35:AP44)-1)<>\"\",OFFSET(DE104_3!$AP$35,ROWS($AP$35:AP44)-1,COLUMNS($AP$35:AP44)-1),\"\")","v":""},{"$f":"IF(OFFSET(DE104_3!$AQ$35,ROWS($AQ$35:AQ44)-1,COLUMNS($AQ$35:AQ44)-1)<>\"\",OFFSET(DE104_3!$AQ$35,ROWS($AQ$35:AQ44)-1,COLUMNS($AQ$35:AQ44)-1),\"\")","v":""}]
[{"$f":"IF(OFFSET(DE104_3!$C$35,ROWS($C$35:C45)-1,COLUMNS($C$35:C45)-1)<>\"\",OFFSET(DE104_3!$C$35,ROWS($C$35:C45)-1,COLUMNS($C$35:C45)-1),\"\")","v":""},{"$f":"IF(OFFSET(DE104_3!$D$35,ROWS($D$35:D45)-1,COLUMNS($D$35:D45)-1)<>\"\",OFFSET(DE104_3!$D$35,ROWS($D$35:D45)-1,COLUMNS($D$35:D45)-1),\"\")","v":""},{"$f":"IF(OFFSET(DE104_3!$E$35,ROWS($E$35:E45)-1,COLUMNS($E$35:E45)-1)<>\"\",OFFSET(DE104_3!$E$35,ROWS($E$35:E45)-1,COLUMNS($E$35:E45)-1),\"\")","v":""},{"$f":"IF(OFFSET(DE104_3!$F$35,ROWS($F$35:F45)-1,COLUMNS($F$35:F45)-1)<>\"\",OFFSET(DE104_3!$F$35,ROWS($F$35:F45)-1,COLUMNS($F$35:F45)-1),\"\")","v":""},{"$f":"IF(OFFSET(DE104_3!$G$35,ROWS($G$35:G45)-1,COLUMNS($G$35:G45)-1)<>\"\",OFFSET(DE104_3!$G$35,ROWS($G$35:G45)-1,COLUMNS($G$35:G45)-1),\"\")","v":""},{"$f":"IF(OFFSET(DE104_3!$H$35,ROWS($H$35:H45)-1,COLUMNS($H$35:H45)-1)<>\"\",OFFSET(DE104_3!$H$35,ROWS($H$35:H45)-1,COLUMNS($H$35:H45)-1),\"\")","v":""},{"$f":"IF(OFFSET(DE104_3!$I$35,ROWS($I$35:I45)-1,COLUMNS($I$35:I45)-1)<>\"\",OFFSET(DE104_3!$I$35,ROWS($I$35:I45)-1,COLUMNS($I$35:I45)-1),\"\")","v":""},{"$f":"IF(OFFSET(DE104_3!$J$35,ROWS($J$35:J45)-1,COLUMNS($J$35:J45)-1)<>\"\",OFFSET(DE104_3!$J$35,ROWS($J$35:J45)-1,COLUMNS($J$35:J45)-1),\"\")","v":""},{"$f":"IF(OFFSET(DE104_3!$K$35,ROWS($K$35:K45)-1,COLUMNS($K$35:K45)-1)<>\"\",OFFSET(DE104_3!$K$35,ROWS($K$35:K45)-1,COLUMNS($K$35:K45)-1),\"\")","v":""},{"$f":"IF(OFFSET(DE104_3!$L$35,ROWS($L$35:L45)-1,COLUMNS($L$35:L45)-1)<>\"\",OFFSET(DE104_3!$L$35,ROWS($L$35:L45)-1,COLUMNS($L$35:L45)-1),\"\")","v":""},{"$f":"IF(OFFSET(DE104_3!$M$35,ROWS($M$35:M45)-1,COLUMNS($M$35:M45)-1)<>\"\",OFFSET(DE104_3!$M$35,ROWS($M$35:M45)-1,COLUMNS($M$35:M45)-1),\"\")","v":""},{"$f":"IF(OFFSET(DE104_3!$N$35,ROWS($N$35:N45)-1,COLUMNS($N$35:N45)-1)<>\"\",OFFSET(DE104_3!$N$35,ROWS($N$35:N45)-1,COLUMNS($N$35:N45)-1),\"\")","v":""},{"$f":"IF(OFFSET(DE104_3!$O$35,ROWS($O$35:O45)-1,COLUMNS($O$35:O45)-1)<>\"\",OFFSET(DE104_3!$O$35,ROWS($O$35:O45)-1,COLUMNS($O$35:O45)-1),\"\")","v":""},{"$f":"IF(OFFSET(DE104_3!$P$35,ROWS($P$35:P45)-1,COLUMNS($P$35:P45)-1)<>\"\",OFFSET(DE104_3!$P$35,ROWS($P$35:P45)-1,COLUMNS($P$35:P45)-1),\"\")","v":""},{"$f":"IF(OFFSET(DE104_3!$Q$35,ROWS($Q$35:Q45)-1,COLUMNS($Q$35:Q45)-1)<>\"\",OFFSET(DE104_3!$Q$35,ROWS($Q$35:Q45)-1,COLUMNS($Q$35:Q45)-1),\"\")","v":""},{"$f":"IF(OFFSET(DE104_3!$R$35,ROWS($R$35:R45)-1,COLUMNS($R$35:R45)-1)<>\"\",OFFSET(DE104_3!$R$35,ROWS($R$35:R45)-1,COLUMNS($R$35:R45)-1),\"\")","v":""},{"$f":"IF(OFFSET(DE104_3!$S$35,ROWS($S$35:S45)-1,COLUMNS($S$35:S45)-1)<>\"\",OFFSET(DE104_3!$S$35,ROWS($S$35:S45)-1,COLUMNS($S$35:S45)-1),\"\")","v":""},{"$f":"IF(OFFSET(DE104_3!$T$35,ROWS($T$35:T45)-1,COLUMNS($T$35:T45)-1)<>\"\",OFFSET(DE104_3!$T$35,ROWS($T$35:T45)-1,COLUMNS($T$35:T45)-1),\"\")","v":""},{"$f":"IF(OFFSET(DE104_3!$U$35,ROWS($U$35:U45)-1,COLUMNS($U$35:U45)-1)<>\"\",OFFSET(DE104_3!$U$35,ROWS($U$35:U45)-1,COLUMNS($U$35:U45)-1),\"\")","v":""},{"$f":"IF(OFFSET(DE104_3!$V$35,ROWS($V$35:V45)-1,COLUMNS($V$35:V45)-1)<>\"\",OFFSET(DE104_3!$V$35,ROWS($V$35:V45)-1,COLUMNS($V$35:V45)-1),\"\")","v":""},{"$f":"IF(OFFSET(DE104_3!$W$35,ROWS($W$35:W45)-1,COLUMNS($W$35:W45)-1)<>\"\",OFFSET(DE104_3!$W$35,ROWS($W$35:W45)-1,COLUMNS($W$35:W45)-1),\"\")","v":""},{"$f":"IF(OFFSET(DE104_3!$X$35,ROWS($X$35:X45)-1,COLUMNS($X$35:X45)-1)<>\"\",OFFSET(DE104_3!$X$35,ROWS($X$35:X45)-1,COLUMNS($X$35:X45)-1),\"\")","v":""},{"$f":"IF(OFFSET(DE104_3!$Y$35,ROWS($Y$35:Y45)-1,COLUMNS($Y$35:Y45)-1)<>\"\",OFFSET(DE104_3!$Y$35,ROWS($Y$35:Y45)-1,COLUMNS($Y$35:Y45)-1),\"\")","v":""},{"$f":"IF(OFFSET(DE104_3!$Z$35,ROWS($Z$35:Z45)-1,COLUMNS($Z$35:Z45)-1)<>\"\",OFFSET(DE104_3!$Z$35,ROWS($Z$35:Z45)-1,COLUMNS($Z$35:Z45)-1),\"\")","v":""},{"$f":"IF(OFFSET(DE104_3!$AA$35,ROWS($AA$35:AA45)-1,COLUMNS($AA$35:AA45)-1)<>\"\",OFFSET(DE104_3!$AA$35,ROWS($AA$35:AA45)-1,COLUMNS($AA$35:AA45)-1),\"\")","v":""},{"$f":"IF(OFFSET(DE104_3!$AB$35,ROWS($AB$35:AB45)-1,COLUMNS($AB$35:AB45)-1)<>\"\",OFFSET(DE104_3!$AB$35,ROWS($AB$35:AB45)-1,COLUMNS($AB$35:AB45)-1),\"\")","v":""},{"$f":"IF(OFFSET(DE104_3!$AC$35,ROWS($AC$35:AC45)-1,COLUMNS($AC$35:AC45)-1)<>\"\",OFFSET(DE104_3!$AC$35,ROWS($AC$35:AC45)-1,COLUMNS($AC$35:AC45)-1),\"\")","v":""},{"$f":"IF(OFFSET(DE104_3!$AD$35,ROWS($AD$35:AD45)-1,COLUMNS($AD$35:AD45)-1)<>\"\",OFFSET(DE104_3!$AD$35,ROWS($AD$35:AD45)-1,COLUMNS($AD$35:AD45)-1),\"\")","v":""},{"$f":"IF(OFFSET(DE104_3!$AE$35,ROWS($AE$35:AE45)-1,COLUMNS($AE$35:AE45)-1)<>\"\",OFFSET(DE104_3!$AE$35,ROWS($AE$35:AE45)-1,COLUMNS($AE$35:AE45)-1),\"\")","v":""},{"$f":"IF(OFFSET(DE104_3!$AF$35,ROWS($AF$35:AF45)-1,COLUMNS($AF$35:AF45)-1)<>\"\",OFFSET(DE104_3!$AF$35,ROWS($AF$35:AF45)-1,COLUMNS($AF$35:AF45)-1),\"\")","v":""},{"$f":"IF(OFFSET(DE104_3!$AG$35,ROWS($AG$35:AG45)-1,COLUMNS($AG$35:AG45)-1)<>\"\",OFFSET(DE104_3!$AG$35,ROWS($AG$35:AG45)-1,COLUMNS($AG$35:AG45)-1),\"\")","v":""},{"$f":"IF(OFFSET(DE104_3!$AH$35,ROWS($AH$35:AH45)-1,COLUMNS($AH$35:AH45)-1)<>\"\",OFFSET(DE104_3!$AH$35,ROWS($AH$35:AH45)-1,COLUMNS($AH$35:AH45)-1),\"\")","v":""},{"$f":"IF(OFFSET(DE104_3!$AI$35,ROWS($AI$35:AI45)-1,COLUMNS($AI$35:AI45)-1)<>\"\",OFFSET(DE104_3!$AI$35,ROWS($AI$35:AI45)-1,COLUMNS($AI$35:AI45)-1),\"\")","v":""},{"$f":"IF(OFFSET(DE104_3!$AJ$35,ROWS($AJ$35:AJ45)-1,COLUMNS($AJ$35:AJ45)-1)<>\"\",OFFSET(DE104_3!$AJ$35,ROWS($AJ$35:AJ45)-1,COLUMNS($AJ$35:AJ45)-1),\"\")","v":""},{"$f":"IF(OFFSET(DE104_3!$AK$35,ROWS($AK$35:AK45)-1,COLUMNS($AK$35:AK45)-1)<>\"\",OFFSET(DE104_3!$AK$35,ROWS($AK$35:AK45)-1,COLUMNS($AK$35:AK45)-1),\"\")","v":""},{"$f":"IF(OFFSET(DE104_3!$AL$35,ROWS($AL$35:AL45)-1,COLUMNS($AL$35:AL45)-1)<>\"\",OFFSET(DE104_3!$AL$35,ROWS($AL$35:AL45)-1,COLUMNS($AL$35:AL45)-1),\"\")","v":""},{"$f":"IF(OFFSET(DE104_3!$AM$35,ROWS($AM$35:AM45)-1,COLUMNS($AM$35:AM45)-1)<>\"\",OFFSET(DE104_3!$AM$35,ROWS($AM$35:AM45)-1,COLUMNS($AM$35:AM45)-1),\"\")","v":""},{"$f":"IF(OFFSET(DE104_3!$AN$35,ROWS($AN$35:AN45)-1,COLUMNS($AN$35:AN45)-1)<>\"\",OFFSET(DE104_3!$AN$35,ROWS($AN$35:AN45)-1,COLUMNS($AN$35:AN45)-1),\"\")","v":""},{"$f":"IF(OFFSET(DE104_3!$AO$35,ROWS($AO$35:AO45)-1,COLUMNS($AO$35:AO45)-1)<>\"\",OFFSET(DE104_3!$AO$35,ROWS($AO$35:AO45)-1,COLUMNS($AO$35:AO45)-1),\"\")","v":""},{"$f":"IF(OFFSET(DE104_3!$AP$35,ROWS($AP$35:AP45)-1,COLUMNS($AP$35:AP45)-1)<>\"\",OFFSET(DE104_3!$AP$35,ROWS($AP$35:AP45)-1,COLUMNS($AP$35:AP45)-1),\"\")","v":""},{"$f":"IF(OFFSET(DE104_3!$AQ$35,ROWS($AQ$35:AQ45)-1,COLUMNS($AQ$35:AQ45)-1)<>\"\",OFFSET(DE104_3!$AQ$35,ROWS($AQ$35:AQ45)-1,COLUMNS($AQ$35:AQ45)-1),\"\")","v":""}]
[{"$f":"IF(OFFSET(DE104_3!$C$35,ROWS($C$35:C46)-1,COLUMNS($C$35:C46)-1)<>\"\",OFFSET(DE104_3!$C$35,ROWS($C$35:C46)-1,COLUMNS($C$35:C46)-1),\"\")","v":""},{"$f":"IF(OFFSET(DE104_3!$D$35,ROWS($D$35:D46)-1,COLUMNS($D$35:D46)-1)<>\"\",OFFSET(DE104_3!$D$35,ROWS($D$35:D46)-1,COLUMNS($D$35:D46)-1),\"\")","v":""},{"$f":"IF(OFFSET(DE104_3!$E$35,ROWS($E$35:E46)-1,COLUMNS($E$35:E46)-1)<>\"\",OFFSET(DE104_3!$E$35,ROWS($E$35:E46)-1,COLUMNS($E$35:E46)-1),\"\")","v":""},{"$f":"IF(OFFSET(DE104_3!$F$35,ROWS($F$35:F46)-1,COLUMNS($F$35:F46)-1)<>\"\",OFFSET(DE104_3!$F$35,ROWS($F$35:F46)-1,COLUMNS($F$35:F46)-1),\"\")","v":""},{"$f":"IF(OFFSET(DE104_3!$G$35,ROWS($G$35:G46)-1,COLUMNS($G$35:G46)-1)<>\"\",OFFSET(DE104_3!$G$35,ROWS($G$35:G46)-1,COLUMNS($G$35:G46)-1),\"\")","v":""},{"$f":"IF(OFFSET(DE104_3!$H$35,ROWS($H$35:H46)-1,COLUMNS($H$35:H46)-1)<>\"\",OFFSET(DE104_3!$H$35,ROWS($H$35:H46)-1,COLUMNS($H$35:H46)-1),\"\")","v":""},{"$f":"IF(OFFSET(DE104_3!$I$35,ROWS($I$35:I46)-1,COLUMNS($I$35:I46)-1)<>\"\",OFFSET(DE104_3!$I$35,ROWS($I$35:I46)-1,COLUMNS($I$35:I46)-1),\"\")","v":""},{"$f":"IF(OFFSET(DE104_3!$J$35,ROWS($J$35:J46)-1,COLUMNS($J$35:J46)-1)<>\"\",OFFSET(DE104_3!$J$35,ROWS($J$35:J46)-1,COLUMNS($J$35:J46)-1),\"\")","v":""},{"$f":"IF(OFFSET(DE104_3!$K$35,ROWS($K$35:K46)-1,COLUMNS($K$35:K46)-1)<>\"\",OFFSET(DE104_3!$K$35,ROWS($K$35:K46)-1,COLUMNS($K$35:K46)-1),\"\")","v":""},{"$f":"IF(OFFSET(DE104_3!$L$35,ROWS($L$35:L46)-1,COLUMNS($L$35:L46)-1)<>\"\",OFFSET(DE104_3!$L$35,ROWS($L$35:L46)-1,COLUMNS($L$35:L46)-1),\"\")","v":""},{"$f":"IF(OFFSET(DE104_3!$M$35,ROWS($M$35:M46)-1,COLUMNS($M$35:M46)-1)<>\"\",OFFSET(DE104_3!$M$35,ROWS($M$35:M46)-1,COLUMNS($M$35:M46)-1),\"\")","v":""},{"$f":"IF(OFFSET(DE104_3!$N$35,ROWS($N$35:N46)-1,COLUMNS($N$35:N46)-1)<>\"\",OFFSET(DE104_3!$N$35,ROWS($N$35:N46)-1,COLUMNS($N$35:N46)-1),\"\")","v":""},{"$f":"IF(OFFSET(DE104_3!$O$35,ROWS($O$35:O46)-1,COLUMNS($O$35:O46)-1)<>\"\",OFFSET(DE104_3!$O$35,ROWS($O$35:O46)-1,COLUMNS($O$35:O46)-1),\"\")","v":""},{"$f":"IF(OFFSET(DE104_3!$P$35,ROWS($P$35:P46)-1,COLUMNS($P$35:P46)-1)<>\"\",OFFSET(DE104_3!$P$35,ROWS($P$35:P46)-1,COLUMNS($P$35:P46)-1),\"\")","v":""},{"$f":"IF(OFFSET(DE104_3!$Q$35,ROWS($Q$35:Q46)-1,COLUMNS($Q$35:Q46)-1)<>\"\",OFFSET(DE104_3!$Q$35,ROWS($Q$35:Q46)-1,COLUMNS($Q$35:Q46)-1),\"\")","v":""},{"$f":"IF(OFFSET(DE104_3!$R$35,ROWS($R$35:R46)-1,COLUMNS($R$35:R46)-1)<>\"\",OFFSET(DE104_3!$R$35,ROWS($R$35:R46)-1,COLUMNS($R$35:R46)-1),\"\")","v":""},{"$f":"IF(OFFSET(DE104_3!$S$35,ROWS($S$35:S46)-1,COLUMNS($S$35:S46)-1)<>\"\",OFFSET(DE104_3!$S$35,ROWS($S$35:S46)-1,COLUMNS($S$35:S46)-1),\"\")","v":""},{"$f":"IF(OFFSET(DE104_3!$T$35,ROWS($T$35:T46)-1,COLUMNS($T$35:T46)-1)<>\"\",OFFSET(DE104_3!$T$35,ROWS($T$35:T46)-1,COLUMNS($T$35:T46)-1),\"\")","v":""},{"$f":"IF(OFFSET(DE104_3!$U$35,ROWS($U$35:U46)-1,COLUMNS($U$35:U46)-1)<>\"\",OFFSET(DE104_3!$U$35,ROWS($U$35:U46)-1,COLUMNS($U$35:U46)-1),\"\")","v":""},{"$f":"IF(OFFSET(DE104_3!$V$35,ROWS($V$35:V46)-1,COLUMNS($V$35:V46)-1)<>\"\",OFFSET(DE104_3!$V$35,ROWS($V$35:V46)-1,COLUMNS($V$35:V46)-1),\"\")","v":""},{"$f":"IF(OFFSET(DE104_3!$W$35,ROWS($W$35:W46)-1,COLUMNS($W$35:W46)-1)<>\"\",OFFSET(DE104_3!$W$35,ROWS($W$35:W46)-1,COLUMNS($W$35:W46)-1),\"\")","v":""},{"$f":"IF(OFFSET(DE104_3!$X$35,ROWS($X$35:X46)-1,COLUMNS($X$35:X46)-1)<>\"\",OFFSET(DE104_3!$X$35,ROWS($X$35:X46)-1,COLUMNS($X$35:X46)-1),\"\")","v":""},{"$f":"IF(OFFSET(DE104_3!$Y$35,ROWS($Y$35:Y46)-1,COLUMNS($Y$35:Y46)-1)<>\"\",OFFSET(DE104_3!$Y$35,ROWS($Y$35:Y46)-1,COLUMNS($Y$35:Y46)-1),\"\")","v":""},{"$f":"IF(OFFSET(DE104_3!$Z$35,ROWS($Z$35:Z46)-1,COLUMNS($Z$35:Z46)-1)<>\"\",OFFSET(DE104_3!$Z$35,ROWS($Z$35:Z46)-1,COLUMNS($Z$35:Z46)-1),\"\")","v":""},{"$f":"IF(OFFSET(DE104_3!$AA$35,ROWS($AA$35:AA46)-1,COLUMNS($AA$35:AA46)-1)<>\"\",OFFSET(DE104_3!$AA$35,ROWS($AA$35:AA46)-1,COLUMNS($AA$35:AA46)-1),\"\")","v":""},{"$f":"IF(OFFSET(DE104_3!$AB$35,ROWS($AB$35:AB46)-1,COLUMNS($AB$35:AB46)-1)<>\"\",OFFSET(DE104_3!$AB$35,ROWS($AB$35:AB46)-1,COLUMNS($AB$35:AB46)-1),\"\")","v":""},{"$f":"IF(OFFSET(DE104_3!$AC$35,ROWS($AC$35:AC46)-1,COLUMNS($AC$35:AC46)-1)<>\"\",OFFSET(DE104_3!$AC$35,ROWS($AC$35:AC46)-1,COLUMNS($AC$35:AC46)-1),\"\")","v":""},{"$f":"IF(OFFSET(DE104_3!$AD$35,ROWS($AD$35:AD46)-1,COLUMNS($AD$35:AD46)-1)<>\"\",OFFSET(DE104_3!$AD$35,ROWS($AD$35:AD46)-1,COLUMNS($AD$35:AD46)-1),\"\")","v":""},{"$f":"IF(OFFSET(DE104_3!$AE$35,ROWS($AE$35:AE46)-1,COLUMNS($AE$35:AE46)-1)<>\"\",OFFSET(DE104_3!$AE$35,ROWS($AE$35:AE46)-1,COLUMNS($AE$35:AE46)-1),\"\")","v":""},{"$f":"IF(OFFSET(DE104_3!$AF$35,ROWS($AF$35:AF46)-1,COLUMNS($AF$35:AF46)-1)<>\"\",OFFSET(DE104_3!$AF$35,ROWS($AF$35:AF46)-1,COLUMNS($AF$35:AF46)-1),\"\")","v":""},{"$f":"IF(OFFSET(DE104_3!$AG$35,ROWS($AG$35:AG46)-1,COLUMNS($AG$35:AG46)-1)<>\"\",OFFSET(DE104_3!$AG$35,ROWS($AG$35:AG46)-1,COLUMNS($AG$35:AG46)-1),\"\")","v":""},{"$f":"IF(OFFSET(DE104_3!$AH$35,ROWS($AH$35:AH46)-1,COLUMNS($AH$35:AH46)-1)<>\"\",OFFSET(DE104_3!$AH$35,ROWS($AH$35:AH46)-1,COLUMNS($AH$35:AH46)-1),\"\")","v":""},{"$f":"IF(OFFSET(DE104_3!$AI$35,ROWS($AI$35:AI46)-1,COLUMNS($AI$35:AI46)-1)<>\"\",OFFSET(DE104_3!$AI$35,ROWS($AI$35:AI46)-1,COLUMNS($AI$35:AI46)-1),\"\")","v":""},{"$f":"IF(OFFSET(DE104_3!$AJ$35,ROWS($AJ$35:AJ46)-1,COLUMNS($AJ$35:AJ46)-1)<>\"\",OFFSET(DE104_3!$AJ$35,ROWS($AJ$35:AJ46)-1,COLUMNS($AJ$35:AJ46)-1),\"\")","v":""},{"$f":"IF(OFFSET(DE104_3!$AK$35,ROWS($AK$35:AK46)-1,COLUMNS($AK$35:AK46)-1)<>\"\",OFFSET(DE104_3!$AK$35,ROWS($AK$35:AK46)-1,COLUMNS($AK$35:AK46)-1),\"\")","v":""},{"$f":"IF(OFFSET(DE104_3!$AL$35,ROWS($AL$35:AL46)-1,COLUMNS($AL$35:AL46)-1)<>\"\",OFFSET(DE104_3!$AL$35,ROWS($AL$35:AL46)-1,COLUMNS($AL$35:AL46)-1),\"\")","v":""},{"$f":"IF(OFFSET(DE104_3!$AM$35,ROWS($AM$35:AM46)-1,COLUMNS($AM$35:AM46)-1)<>\"\",OFFSET(DE104_3!$AM$35,ROWS($AM$35:AM46)-1,COLUMNS($AM$35:AM46)-1),\"\")","v":""},{"$f":"IF(OFFSET(DE104_3!$AN$35,ROWS($AN$35:AN46)-1,COLUMNS($AN$35:AN46)-1)<>\"\",OFFSET(DE104_3!$AN$35,ROWS($AN$35:AN46)-1,COLUMNS($AN$35:AN46)-1),\"\")","v":""},{"$f":"IF(OFFSET(DE104_3!$AO$35,ROWS($AO$35:AO46)-1,COLUMNS($AO$35:AO46)-1)<>\"\",OFFSET(DE104_3!$AO$35,ROWS($AO$35:AO46)-1,COLUMNS($AO$35:AO46)-1),\"\")","v":""},{"$f":"IF(OFFSET(DE104_3!$AP$35,ROWS($AP$35:AP46)-1,COLUMNS($AP$35:AP46)-1)<>\"\",OFFSET(DE104_3!$AP$35,ROWS($AP$35:AP46)-1,COLUMNS($AP$35:AP46)-1),\"\")","v":""},{"$f":"IF(OFFSET(DE104_3!$AQ$35,ROWS($AQ$35:AQ46)-1,COLUMNS($AQ$35:AQ46)-1)<>\"\",OFFSET(DE104_3!$AQ$35,ROWS($AQ$35:AQ46)-1,COLUMNS($AQ$35:AQ46)-1),\"\")","v":""}]
[{"$f":"IF(OFFSET(DE104_3!$C$35,ROWS($C$35:C47)-1,COLUMNS($C$35:C47)-1)<>\"\",OFFSET(DE104_3!$C$35,ROWS($C$35:C47)-1,COLUMNS($C$35:C47)-1),\"\")","v":""},{"$f":"IF(OFFSET(DE104_3!$D$35,ROWS($D$35:D47)-1,COLUMNS($D$35:D47)-1)<>\"\",OFFSET(DE104_3!$D$35,ROWS($D$35:D47)-1,COLUMNS($D$35:D47)-1),\"\")","v":""},{"$f":"IF(OFFSET(DE104_3!$E$35,ROWS($E$35:E47)-1,COLUMNS($E$35:E47)-1)<>\"\",OFFSET(DE104_3!$E$35,ROWS($E$35:E47)-1,COLUMNS($E$35:E47)-1),\"\")","v":""},{"$f":"IF(OFFSET(DE104_3!$F$35,ROWS($F$35:F47)-1,COLUMNS($F$35:F47)-1)<>\"\",OFFSET(DE104_3!$F$35,ROWS($F$35:F47)-1,COLUMNS($F$35:F47)-1),\"\")","v":""},{"$f":"IF(OFFSET(DE104_3!$G$35,ROWS($G$35:G47)-1,COLUMNS($G$35:G47)-1)<>\"\",OFFSET(DE104_3!$G$35,ROWS($G$35:G47)-1,COLUMNS($G$35:G47)-1),\"\")","v":""},{"$f":"IF(OFFSET(DE104_3!$H$35,ROWS($H$35:H47)-1,COLUMNS($H$35:H47)-1)<>\"\",OFFSET(DE104_3!$H$35,ROWS($H$35:H47)-1,COLUMNS($H$35:H47)-1),\"\")","v":""},{"$f":"IF(OFFSET(DE104_3!$I$35,ROWS($I$35:I47)-1,COLUMNS($I$35:I47)-1)<>\"\",OFFSET(DE104_3!$I$35,ROWS($I$35:I47)-1,COLUMNS($I$35:I47)-1),\"\")","v":""},{"$f":"IF(OFFSET(DE104_3!$J$35,ROWS($J$35:J47)-1,COLUMNS($J$35:J47)-1)<>\"\",OFFSET(DE104_3!$J$35,ROWS($J$35:J47)-1,COLUMNS($J$35:J47)-1),\"\")","v":""},{"$f":"IF(OFFSET(DE104_3!$K$35,ROWS($K$35:K47)-1,COLUMNS($K$35:K47)-1)<>\"\",OFFSET(DE104_3!$K$35,ROWS($K$35:K47)-1,COLUMNS($K$35:K47)-1),\"\")","v":""},{"$f":"IF(OFFSET(DE104_3!$L$35,ROWS($L$35:L47)-1,COLUMNS($L$35:L47)-1)<>\"\",OFFSET(DE104_3!$L$35,ROWS($L$35:L47)-1,COLUMNS($L$35:L47)-1),\"\")","v":""},{"$f":"IF(OFFSET(DE104_3!$M$35,ROWS($M$35:M47)-1,COLUMNS($M$35:M47)-1)<>\"\",OFFSET(DE104_3!$M$35,ROWS($M$35:M47)-1,COLUMNS($M$35:M47)-1),\"\")","v":""},{"$f":"IF(OFFSET(DE104_3!$N$35,ROWS($N$35:N47)-1,COLUMNS($N$35:N47)-1)<>\"\",OFFSET(DE104_3!$N$35,ROWS($N$35:N47)-1,COLUMNS($N$35:N47)-1),\"\")","v":""},{"$f":"IF(OFFSET(DE104_3!$O$35,ROWS($O$35:O47)-1,COLUMNS($O$35:O47)-1)<>\"\",OFFSET(DE104_3!$O$35,ROWS($O$35:O47)-1,COLUMNS($O$35:O47)-1),\"\")","v":""},{"$f":"IF(OFFSET(DE104_3!$P$35,ROWS($P$35:P47)-1,COLUMNS($P$35:P47)-1)<>\"\",OFFSET(DE104_3!$P$35,ROWS($P$35:P47)-1,COLUMNS($P$35:P47)-1),\"\")","v":""},{"$f":"IF(OFFSET(DE104_3!$Q$35,ROWS($Q$35:Q47)-1,COLUMNS($Q$35:Q47)-1)<>\"\",OFFSET(DE104_3!$Q$35,ROWS($Q$35:Q47)-1,COLUMNS($Q$35:Q47)-1),\"\")","v":""},{"$f":"IF(OFFSET(DE104_3!$R$35,ROWS($R$35:R47)-1,COLUMNS($R$35:R47)-1)<>\"\",OFFSET(DE104_3!$R$35,ROWS($R$35:R47)-1,COLUMNS($R$35:R47)-1),\"\")","v":""},{"$f":"IF(OFFSET(DE104_3!$S$35,ROWS($S$35:S47)-1,COLUMNS($S$35:S47)-1)<>\"\",OFFSET(DE104_3!$S$35,ROWS($S$35:S47)-1,COLUMNS($S$35:S47)-1),\"\")","v":""},{"$f":"IF(OFFSET(DE104_3!$T$35,ROWS($T$35:T47)-1,COLUMNS($T$35:T47)-1)<>\"\",OFFSET(DE104_3!$T$35,ROWS($T$35:T47)-1,COLUMNS($T$35:T47)-1),\"\")","v":""},{"$f":"IF(OFFSET(DE104_3!$U$35,ROWS($U$35:U47)-1,COLUMNS($U$35:U47)-1)<>\"\",OFFSET(DE104_3!$U$35,ROWS($U$35:U47)-1,COLUMNS($U$35:U47)-1),\"\")","v":""},{"$f":"IF(OFFSET(DE104_3!$V$35,ROWS($V$35:V47)-1,COLUMNS($V$35:V47)-1)<>\"\",OFFSET(DE104_3!$V$35,ROWS($V$35:V47)-1,COLUMNS($V$35:V47)-1),\"\")","v":""},{"$f":"IF(OFFSET(DE104_3!$W$35,ROWS($W$35:W47)-1,COLUMNS($W$35:W47)-1)<>\"\",OFFSET(DE104_3!$W$35,ROWS($W$35:W47)-1,COLUMNS($W$35:W47)-1),\"\")","v":""},{"$f":"IF(OFFSET(DE104_3!$X$35,ROWS($X$35:X47)-1,COLUMNS($X$35:X47)-1)<>\"\",OFFSET(DE104_3!$X$35,ROWS($X$35:X47)-1,COLUMNS($X$35:X47)-1),\"\")","v":""},{"$f":"IF(OFFSET(DE104_3!$Y$35,ROWS($Y$35:Y47)-1,COLUMNS($Y$35:Y47)-1)<>\"\",OFFSET(DE104_3!$Y$35,ROWS($Y$35:Y47)-1,COLUMNS($Y$35:Y47)-1),\"\")","v":""},{"$f":"IF(OFFSET(DE104_3!$Z$35,ROWS($Z$35:Z47)-1,COLUMNS($Z$35:Z47)-1)<>\"\",OFFSET(DE104_3!$Z$35,ROWS($Z$35:Z47)-1,COLUMNS($Z$35:Z47)-1),\"\")","v":""},{"$f":"IF(OFFSET(DE104_3!$AA$35,ROWS($AA$35:AA47)-1,COLUMNS($AA$35:AA47)-1)<>\"\",OFFSET(DE104_3!$AA$35,ROWS($AA$35:AA47)-1,COLUMNS($AA$35:AA47)-1),\"\")","v":""},{"$f":"IF(OFFSET(DE104_3!$AB$35,ROWS($AB$35:AB47)-1,COLUMNS($AB$35:AB47)-1)<>\"\",OFFSET(DE104_3!$AB$35,ROWS($AB$35:AB47)-1,COLUMNS($AB$35:AB47)-1),\"\")","v":""},{"$f":"IF(OFFSET(DE104_3!$AC$35,ROWS($AC$35:AC47)-1,COLUMNS($AC$35:AC47)-1)<>\"\",OFFSET(DE104_3!$AC$35,ROWS($AC$35:AC47)-1,COLUMNS($AC$35:AC47)-1),\"\")","v":""},{"$f":"IF(OFFSET(DE104_3!$AD$35,ROWS($AD$35:AD47)-1,COLUMNS($AD$35:AD47)-1)<>\"\",OFFSET(DE104_3!$AD$35,ROWS($AD$35:AD47)-1,COLUMNS($AD$35:AD47)-1),\"\")","v":""},{"$f":"IF(OFFSET(DE104_3!$AE$35,ROWS($AE$35:AE47)-1,COLUMNS($AE$35:AE47)-1)<>\"\",OFFSET(DE104_3!$AE$35,ROWS($AE$35:AE47)-1,COLUMNS($AE$35:AE47)-1),\"\")","v":""},{"$f":"IF(OFFSET(DE104_3!$AF$35,ROWS($AF$35:AF47)-1,COLUMNS($AF$35:AF47)-1)<>\"\",OFFSET(DE104_3!$AF$35,ROWS($AF$35:AF47)-1,COLUMNS($AF$35:AF47)-1),\"\")","v":""},{"$f":"IF(OFFSET(DE104_3!$AG$35,ROWS($AG$35:AG47)-1,COLUMNS($AG$35:AG47)-1)<>\"\",OFFSET(DE104_3!$AG$35,ROWS($AG$35:AG47)-1,COLUMNS($AG$35:AG47)-1),\"\")","v":""},{"$f":"IF(OFFSET(DE104_3!$AH$35,ROWS($AH$35:AH47)-1,COLUMNS($AH$35:AH47)-1)<>\"\",OFFSET(DE104_3!$AH$35,ROWS($AH$35:AH47)-1,COLUMNS($AH$35:AH47)-1),\"\")","v":""},{"$f":"IF(OFFSET(DE104_3!$AI$35,ROWS($AI$35:AI47)-1,COLUMNS($AI$35:AI47)-1)<>\"\",OFFSET(DE104_3!$AI$35,ROWS($AI$35:AI47)-1,COLUMNS($AI$35:AI47)-1),\"\")","v":""},{"$f":"IF(OFFSET(DE104_3!$AJ$35,ROWS($AJ$35:AJ47)-1,COLUMNS($AJ$35:AJ47)-1)<>\"\",OFFSET(DE104_3!$AJ$35,ROWS($AJ$35:AJ47)-1,COLUMNS($AJ$35:AJ47)-1),\"\")","v":""},{"$f":"IF(OFFSET(DE104_3!$AK$35,ROWS($AK$35:AK47)-1,COLUMNS($AK$35:AK47)-1)<>\"\",OFFSET(DE104_3!$AK$35,ROWS($AK$35:AK47)-1,COLUMNS($AK$35:AK47)-1),\"\")","v":""},{"$f":"IF(OFFSET(DE104_3!$AL$35,ROWS($AL$35:AL47)-1,COLUMNS($AL$35:AL47)-1)<>\"\",OFFSET(DE104_3!$AL$35,ROWS($AL$35:AL47)-1,COLUMNS($AL$35:AL47)-1),\"\")","v":""},{"$f":"IF(OFFSET(DE104_3!$AM$35,ROWS($AM$35:AM47)-1,COLUMNS($AM$35:AM47)-1)<>\"\",OFFSET(DE104_3!$AM$35,ROWS($AM$35:AM47)-1,COLUMNS($AM$35:AM47)-1),\"\")","v":""},{"$f":"IF(OFFSET(DE104_3!$AN$35,ROWS($AN$35:AN47)-1,COLUMNS($AN$35:AN47)-1)<>\"\",OFFSET(DE104_3!$AN$35,ROWS($AN$35:AN47)-1,COLUMNS($AN$35:AN47)-1),\"\")","v":""},{"$f":"IF(OFFSET(DE104_3!$AO$35,ROWS($AO$35:AO47)-1,COLUMNS($AO$35:AO47)-1)<>\"\",OFFSET(DE104_3!$AO$35,ROWS($AO$35:AO47)-1,COLUMNS($AO$35:AO47)-1),\"\")","v":""},{"$f":"IF(OFFSET(DE104_3!$AP$35,ROWS($AP$35:AP47)-1,COLUMNS($AP$35:AP47)-1)<>\"\",OFFSET(DE104_3!$AP$35,ROWS($AP$35:AP47)-1,COLUMNS($AP$35:AP47)-1),\"\")","v":""},{"$f":"IF(OFFSET(DE104_3!$AQ$35,ROWS($AQ$35:AQ47)-1,COLUMNS($AQ$35:AQ47)-1)<>\"\",OFFSET(DE104_3!$AQ$35,ROWS($AQ$35:AQ47)-1,COLUMNS($AQ$35:AQ47)-1),\"\")","v":""}]
[{"$f":"IF(OFFSET(DE104_3!$C$35,ROWS($C$35:C48)-1,COLUMNS($C$35:C48)-1)<>\"\",OFFSET(DE104_3!$C$35,ROWS($C$35:C48)-1,COLUMNS($C$35:C48)-1),\"\")","v":""},{"$f":"IF(OFFSET(DE104_3!$D$35,ROWS($D$35:D48)-1,COLUMNS($D$35:D48)-1)<>\"\",OFFSET(DE104_3!$D$35,ROWS($D$35:D48)-1,COLUMNS($D$35:D48)-1),\"\")","v":""},{"$f":"IF(OFFSET(DE104_3!$E$35,ROWS($E$35:E48)-1,COLUMNS($E$35:E48)-1)<>\"\",OFFSET(DE104_3!$E$35,ROWS($E$35:E48)-1,COLUMNS($E$35:E48)-1),\"\")","v":""},{"$f":"IF(OFFSET(DE104_3!$F$35,ROWS($F$35:F48)-1,COLUMNS($F$35:F48)-1)<>\"\",OFFSET(DE104_3!$F$35,ROWS($F$35:F48)-1,COLUMNS($F$35:F48)-1),\"\")","v":""},{"$f":"IF(OFFSET(DE104_3!$G$35,ROWS($G$35:G48)-1,COLUMNS($G$35:G48)-1)<>\"\",OFFSET(DE104_3!$G$35,ROWS($G$35:G48)-1,COLUMNS($G$35:G48)-1),\"\")","v":""},{"$f":"IF(OFFSET(DE104_3!$H$35,ROWS($H$35:H48)-1,COLUMNS($H$35:H48)-1)<>\"\",OFFSET(DE104_3!$H$35,ROWS($H$35:H48)-1,COLUMNS($H$35:H48)-1),\"\")","v":""},{"$f":"IF(OFFSET(DE104_3!$I$35,ROWS($I$35:I48)-1,COLUMNS($I$35:I48)-1)<>\"\",OFFSET(DE104_3!$I$35,ROWS($I$35:I48)-1,COLUMNS($I$35:I48)-1),\"\")","v":""},{"$f":"IF(OFFSET(DE104_3!$J$35,ROWS($J$35:J48)-1,COLUMNS($J$35:J48)-1)<>\"\",OFFSET(DE104_3!$J$35,ROWS($J$35:J48)-1,COLUMNS($J$35:J48)-1),\"\")","v":""},{"$f":"IF(OFFSET(DE104_3!$K$35,ROWS($K$35:K48)-1,COLUMNS($K$35:K48)-1)<>\"\",OFFSET(DE104_3!$K$35,ROWS($K$35:K48)-1,COLUMNS($K$35:K48)-1),\"\")","v":""},{"$f":"IF(OFFSET(DE104_3!$L$35,ROWS($L$35:L48)-1,COLUMNS($L$35:L48)-1)<>\"\",OFFSET(DE104_3!$L$35,ROWS($L$35:L48)-1,COLUMNS($L$35:L48)-1),\"\")","v":""},{"$f":"IF(OFFSET(DE104_3!$M$35,ROWS($M$35:M48)-1,COLUMNS($M$35:M48)-1)<>\"\",OFFSET(DE104_3!$M$35,ROWS($M$35:M48)-1,COLUMNS($M$35:M48)-1),\"\")","v":""},{"$f":"IF(OFFSET(DE104_3!$N$35,ROWS($N$35:N48)-1,COLUMNS($N$35:N48)-1)<>\"\",OFFSET(DE104_3!$N$35,ROWS($N$35:N48)-1,COLUMNS($N$35:N48)-1),\"\")","v":""},{"$f":"IF(OFFSET(DE104_3!$O$35,ROWS($O$35:O48)-1,COLUMNS($O$35:O48)-1)<>\"\",OFFSET(DE104_3!$O$35,ROWS($O$35:O48)-1,COLUMNS($O$35:O48)-1),\"\")","v":""},{"$f":"IF(OFFSET(DE104_3!$P$35,ROWS($P$35:P48)-1,COLUMNS($P$35:P48)-1)<>\"\",OFFSET(DE104_3!$P$35,ROWS($P$35:P48)-1,COLUMNS($P$35:P48)-1),\"\")","v":""},{"$f":"IF(OFFSET(DE104_3!$Q$35,ROWS($Q$35:Q48)-1,COLUMNS($Q$35:Q48)-1)<>\"\",OFFSET(DE104_3!$Q$35,ROWS($Q$35:Q48)-1,COLUMNS($Q$35:Q48)-1),\"\")","v":""},{"$f":"IF(OFFSET(DE104_3!$R$35,ROWS($R$35:R48)-1,COLUMNS($R$35:R48)-1)<>\"\",OFFSET(DE104_3!$R$35,ROWS($R$35:R48)-1,COLUMNS($R$35:R48)-1),\"\")","v":""},{"$f":"IF(OFFSET(DE104_3!$S$35,ROWS($S$35:S48)-1,COLUMNS($S$35:S48)-1)<>\"\",OFFSET(DE104_3!$S$35,ROWS($S$35:S48)-1,COLUMNS($S$35:S48)-1),\"\")","v":""},{"$f":"IF(OFFSET(DE104_3!$T$35,ROWS($T$35:T48)-1,COLUMNS($T$35:T48)-1)<>\"\",OFFSET(DE104_3!$T$35,ROWS($T$35:T48)-1,COLUMNS($T$35:T48)-1),\"\")","v":""},{"$f":"IF(OFFSET(DE104_3!$U$35,ROWS($U$35:U48)-1,COLUMNS($U$35:U48)-1)<>\"\",OFFSET(DE104_3!$U$35,ROWS($U$35:U48)-1,COLUMNS($U$35:U48)-1),\"\")","v":""},{"$f":"IF(OFFSET(DE104_3!$V$35,ROWS($V$35:V48)-1,COLUMNS($V$35:V48)-1)<>\"\",OFFSET(DE104_3!$V$35,ROWS($V$35:V48)-1,COLUMNS($V$35:V48)-1),\"\")","v":""},{"$f":"IF(OFFSET(DE104_3!$W$35,ROWS($W$35:W48)-1,COLUMNS($W$35:W48)-1)<>\"\",OFFSET(DE104_3!$W$35,ROWS($W$35:W48)-1,COLUMNS($W$35:W48)-1),\"\")","v":""},{"$f":"IF(OFFSET(DE104_3!$X$35,ROWS($X$35:X48)-1,COLUMNS($X$35:X48)-1)<>\"\",OFFSET(DE104_3!$X$35,ROWS($X$35:X48)-1,COLUMNS($X$35:X48)-1),\"\")","v":""},{"$f":"IF(OFFSET(DE104_3!$Y$35,ROWS($Y$35:Y48)-1,COLUMNS($Y$35:Y48)-1)<>\"\",OFFSET(DE104_3!$Y$35,ROWS($Y$35:Y48)-1,COLUMNS($Y$35:Y48)-1),\"\")","v":""},{"$f":"IF(OFFSET(DE104_3!$Z$35,ROWS($Z$35:Z48)-1,COLUMNS($Z$35:Z48)-1)<>\"\",OFFSET(DE104_3!$Z$35,ROWS($Z$35:Z48)-1,COLUMNS($Z$35:Z48)-1),\"\")","v":""},{"$f":"IF(OFFSET(DE104_3!$AA$35,ROWS($AA$35:AA48)-1,COLUMNS($AA$35:AA48)-1)<>\"\",OFFSET(DE104_3!$AA$35,ROWS($AA$35:AA48)-1,COLUMNS($AA$35:AA48)-1),\"\")","v":""},{"$f":"IF(OFFSET(DE104_3!$AB$35,ROWS($AB$35:AB48)-1,COLUMNS($AB$35:AB48)-1)<>\"\",OFFSET(DE104_3!$AB$35,ROWS($AB$35:AB48)-1,COLUMNS($AB$35:AB48)-1),\"\")","v":""},{"$f":"IF(OFFSET(DE104_3!$AC$35,ROWS($AC$35:AC48)-1,COLUMNS($AC$35:AC48)-1)<>\"\",OFFSET(DE104_3!$AC$35,ROWS($AC$35:AC48)-1,COLUMNS($AC$35:AC48)-1),\"\")","v":""},{"$f":"IF(OFFSET(DE104_3!$AD$35,ROWS($AD$35:AD48)-1,COLUMNS($AD$35:AD48)-1)<>\"\",OFFSET(DE104_3!$AD$35,ROWS($AD$35:AD48)-1,COLUMNS($AD$35:AD48)-1),\"\")","v":""},{"$f":"IF(OFFSET(DE104_3!$AE$35,ROWS($AE$35:AE48)-1,COLUMNS($AE$35:AE48)-1)<>\"\",OFFSET(DE104_3!$AE$35,ROWS($AE$35:AE48)-1,COLUMNS($AE$35:AE48)-1),\"\")","v":""},{"$f":"IF(OFFSET(DE104_3!$AF$35,ROWS($AF$35:AF48)-1,COLUMNS($AF$35:AF48)-1)<>\"\",OFFSET(DE104_3!$AF$35,ROWS($AF$35:AF48)-1,COLUMNS($AF$35:AF48)-1),\"\")","v":""},{"$f":"IF(OFFSET(DE104_3!$AG$35,ROWS($AG$35:AG48)-1,COLUMNS($AG$35:AG48)-1)<>\"\",OFFSET(DE104_3!$AG$35,ROWS($AG$35:AG48)-1,COLUMNS($AG$35:AG48)-1),\"\")","v":""},{"$f":"IF(OFFSET(DE104_3!$AH$35,ROWS($AH$35:AH48)-1,COLUMNS($AH$35:AH48)-1)<>\"\",OFFSET(DE104_3!$AH$35,ROWS($AH$35:AH48)-1,COLUMNS($AH$35:AH48)-1),\"\")","v":""},{"$f":"IF(OFFSET(DE104_3!$AI$35,ROWS($AI$35:AI48)-1,COLUMNS($AI$35:AI48)-1)<>\"\",OFFSET(DE104_3!$AI$35,ROWS($AI$35:AI48)-1,COLUMNS($AI$35:AI48)-1),\"\")","v":""},{"$f":"IF(OFFSET(DE104_3!$AJ$35,ROWS($AJ$35:AJ48)-1,COLUMNS($AJ$35:AJ48)-1)<>\"\",OFFSET(DE104_3!$AJ$35,ROWS($AJ$35:AJ48)-1,COLUMNS($AJ$35:AJ48)-1),\"\")","v":""},{"$f":"IF(OFFSET(DE104_3!$AK$35,ROWS($AK$35:AK48)-1,COLUMNS($AK$35:AK48)-1)<>\"\",OFFSET(DE104_3!$AK$35,ROWS($AK$35:AK48)-1,COLUMNS($AK$35:AK48)-1),\"\")","v":""},{"$f":"IF(OFFSET(DE104_3!$AL$35,ROWS($AL$35:AL48)-1,COLUMNS($AL$35:AL48)-1)<>\"\",OFFSET(DE104_3!$AL$35,ROWS($AL$35:AL48)-1,COLUMNS($AL$35:AL48)-1),\"\")","v":""},{"$f":"IF(OFFSET(DE104_3!$AM$35,ROWS($AM$35:AM48)-1,COLUMNS($AM$35:AM48)-1)<>\"\",OFFSET(DE104_3!$AM$35,ROWS($AM$35:AM48)-1,COLUMNS($AM$35:AM48)-1),\"\")","v":""},{"$f":"IF(OFFSET(DE104_3!$AN$35,ROWS($AN$35:AN48)-1,COLUMNS($AN$35:AN48)-1)<>\"\",OFFSET(DE104_3!$AN$35,ROWS($AN$35:AN48)-1,COLUMNS($AN$35:AN48)-1),\"\")","v":""},{"$f":"IF(OFFSET(DE104_3!$AO$35,ROWS($AO$35:AO48)-1,COLUMNS($AO$35:AO48)-1)<>\"\",OFFSET(DE104_3!$AO$35,ROWS($AO$35:AO48)-1,COLUMNS($AO$35:AO48)-1),\"\")","v":""},{"$f":"IF(OFFSET(DE104_3!$AP$35,ROWS($AP$35:AP48)-1,COLUMNS($AP$35:AP48)-1)<>\"\",OFFSET(DE104_3!$AP$35,ROWS($AP$35:AP48)-1,COLUMNS($AP$35:AP48)-1),\"\")","v":""},{"$f":"IF(OFFSET(DE104_3!$AQ$35,ROWS($AQ$35:AQ48)-1,COLUMNS($AQ$35:AQ48)-1)<>\"\",OFFSET(DE104_3!$AQ$35,ROWS($AQ$35:AQ48)-1,COLUMNS($AQ$35:AQ48)-1),\"\")","v":""}]
[{"$f":"IF(OFFSET(DE104_3!$C$35,ROWS($C$35:C49)-1,COLUMNS($C$35:C49)-1)<>\"\",OFFSET(DE104_3!$C$35,ROWS($C$35:C49)-1,COLUMNS($C$35:C49)-1),\"\")","v":""},{"$f":"IF(OFFSET(DE104_3!$D$35,ROWS($D$35:D49)-1,COLUMNS($D$35:D49)-1)<>\"\",OFFSET(DE104_3!$D$35,ROWS($D$35:D49)-1,COLUMNS($D$35:D49)-1),\"\")","v":""},{"$f":"IF(OFFSET(DE104_3!$E$35,ROWS($E$35:E49)-1,COLUMNS($E$35:E49)-1)<>\"\",OFFSET(DE104_3!$E$35,ROWS($E$35:E49)-1,COLUMNS($E$35:E49)-1),\"\")","v":""},{"$f":"IF(OFFSET(DE104_3!$F$35,ROWS($F$35:F49)-1,COLUMNS($F$35:F49)-1)<>\"\",OFFSET(DE104_3!$F$35,ROWS($F$35:F49)-1,COLUMNS($F$35:F49)-1),\"\")","v":""},{"$f":"IF(OFFSET(DE104_3!$G$35,ROWS($G$35:G49)-1,COLUMNS($G$35:G49)-1)<>\"\",OFFSET(DE104_3!$G$35,ROWS($G$35:G49)-1,COLUMNS($G$35:G49)-1),\"\")","v":""},{"$f":"IF(OFFSET(DE104_3!$H$35,ROWS($H$35:H49)-1,COLUMNS($H$35:H49)-1)<>\"\",OFFSET(DE104_3!$H$35,ROWS($H$35:H49)-1,COLUMNS($H$35:H49)-1),\"\")","v":""},{"$f":"IF(OFFSET(DE104_3!$I$35,ROWS($I$35:I49)-1,COLUMNS($I$35:I49)-1)<>\"\",OFFSET(DE104_3!$I$35,ROWS($I$35:I49)-1,COLUMNS($I$35:I49)-1),\"\")","v":""},{"$f":"IF(OFFSET(DE104_3!$J$35,ROWS($J$35:J49)-1,COLUMNS($J$35:J49)-1)<>\"\",OFFSET(DE104_3!$J$35,ROWS($J$35:J49)-1,COLUMNS($J$35:J49)-1),\"\")","v":""},{"$f":"IF(OFFSET(DE104_3!$K$35,ROWS($K$35:K49)-1,COLUMNS($K$35:K49)-1)<>\"\",OFFSET(DE104_3!$K$35,ROWS($K$35:K49)-1,COLUMNS($K$35:K49)-1),\"\")","v":""},{"$f":"IF(OFFSET(DE104_3!$L$35,ROWS($L$35:L49)-1,COLUMNS($L$35:L49)-1)<>\"\",OFFSET(DE104_3!$L$35,ROWS($L$35:L49)-1,COLUMNS($L$35:L49)-1),\"\")","v":""},{"$f":"IF(OFFSET(DE104_3!$M$35,ROWS($M$35:M49)-1,COLUMNS($M$35:M49)-1)<>\"\",OFFSET(DE104_3!$M$35,ROWS($M$35:M49)-1,COLUMNS($M$35:M49)-1),\"\")","v":""},{"$f":"IF(OFFSET(DE104_3!$N$35,ROWS($N$35:N49)-1,COLUMNS($N$35:N49)-1)<>\"\",OFFSET(DE104_3!$N$35,ROWS($N$35:N49)-1,COLUMNS($N$35:N49)-1),\"\")","v":""},{"$f":"IF(OFFSET(DE104_3!$O$35,ROWS($O$35:O49)-1,COLUMNS($O$35:O49)-1)<>\"\",OFFSET(DE104_3!$O$35,ROWS($O$35:O49)-1,COLUMNS($O$35:O49)-1),\"\")","v":""},{"$f":"IF(OFFSET(DE104_3!$P$35,ROWS($P$35:P49)-1,COLUMNS($P$35:P49)-1)<>\"\",OFFSET(DE104_3!$P$35,ROWS($P$35:P49)-1,COLUMNS($P$35:P49)-1),\"\")","v":""},{"$f":"IF(OFFSET(DE104_3!$Q$35,ROWS($Q$35:Q49)-1,COLUMNS($Q$35:Q49)-1)<>\"\",OFFSET(DE104_3!$Q$35,ROWS($Q$35:Q49)-1,COLUMNS($Q$35:Q49)-1),\"\")","v":""},{"$f":"IF(OFFSET(DE104_3!$R$35,ROWS($R$35:R49)-1,COLUMNS($R$35:R49)-1)<>\"\",OFFSET(DE104_3!$R$35,ROWS($R$35:R49)-1,COLUMNS($R$35:R49)-1),\"\")","v":""},{"$f":"IF(OFFSET(DE104_3!$S$35,ROWS($S$35:S49)-1,COLUMNS($S$35:S49)-1)<>\"\",OFFSET(DE104_3!$S$35,ROWS($S$35:S49)-1,COLUMNS($S$35:S49)-1),\"\")","v":""},{"$f":"IF(OFFSET(DE104_3!$T$35,ROWS($T$35:T49)-1,COLUMNS($T$35:T49)-1)<>\"\",OFFSET(DE104_3!$T$35,ROWS($T$35:T49)-1,COLUMNS($T$35:T49)-1),\"\")","v":""},{"$f":"IF(OFFSET(DE104_3!$U$35,ROWS($U$35:U49)-1,COLUMNS($U$35:U49)-1)<>\"\",OFFSET(DE104_3!$U$35,ROWS($U$35:U49)-1,COLUMNS($U$35:U49)-1),\"\")","v":""},{"$f":"IF(OFFSET(DE104_3!$V$35,ROWS($V$35:V49)-1,COLUMNS($V$35:V49)-1)<>\"\",OFFSET(DE104_3!$V$35,ROWS($V$35:V49)-1,COLUMNS($V$35:V49)-1),\"\")","v":""},{"$f":"IF(OFFSET(DE104_3!$W$35,ROWS($W$35:W49)-1,COLUMNS($W$35:W49)-1)<>\"\",OFFSET(DE104_3!$W$35,ROWS($W$35:W49)-1,COLUMNS($W$35:W49)-1),\"\")","v":""},{"$f":"IF(OFFSET(DE104_3!$X$35,ROWS($X$35:X49)-1,COLUMNS($X$35:X49)-1)<>\"\",OFFSET(DE104_3!$X$35,ROWS($X$35:X49)-1,COLUMNS($X$35:X49)-1),\"\")","v":""},{"$f":"IF(OFFSET(DE104_3!$Y$35,ROWS($Y$35:Y49)-1,COLUMNS($Y$35:Y49)-1)<>\"\",OFFSET(DE104_3!$Y$35,ROWS($Y$35:Y49)-1,COLUMNS($Y$35:Y49)-1),\"\")","v":""},{"$f":"IF(OFFSET(DE104_3!$Z$35,ROWS($Z$35:Z49)-1,COLUMNS($Z$35:Z49)-1)<>\"\",OFFSET(DE104_3!$Z$35,ROWS($Z$35:Z49)-1,COLUMNS($Z$35:Z49)-1),\"\")","v":""},{"$f":"IF(OFFSET(DE104_3!$AA$35,ROWS($AA$35:AA49)-1,COLUMNS($AA$35:AA49)-1)<>\"\",OFFSET(DE104_3!$AA$35,ROWS($AA$35:AA49)-1,COLUMNS($AA$35:AA49)-1),\"\")","v":""},{"$f":"IF(OFFSET(DE104_3!$AB$35,ROWS($AB$35:AB49)-1,COLUMNS($AB$35:AB49)-1)<>\"\",OFFSET(DE104_3!$AB$35,ROWS($AB$35:AB49)-1,COLUMNS($AB$35:AB49)-1),\"\")","v":""},{"$f":"IF(OFFSET(DE104_3!$AC$35,ROWS($AC$35:AC49)-1,COLUMNS($AC$35:AC49)-1)<>\"\",OFFSET(DE104_3!$AC$35,ROWS($AC$35:AC49)-1,COLUMNS($AC$35:AC49)-1),\"\")","v":""},{"$f":"IF(OFFSET(DE104_3!$AD$35,ROWS($AD$35:AD49)-1,COLUMNS($AD$35:AD49)-1)<>\"\",OFFSET(DE104_3!$AD$35,ROWS($AD$35:AD49)-1,COLUMNS($AD$35:AD49)-1),\"\")","v":""},{"$f":"IF(OFFSET(DE104_3!$AE$35,ROWS($AE$35:AE49)-1,COLUMNS($AE$35:AE49)-1)<>\"\",OFFSET(DE104_3!$AE$35,ROWS($AE$35:AE49)-1,COLUMNS($AE$35:AE49)-1),\"\")","v":""},{"$f":"IF(OFFSET(DE104_3!$AF$35,ROWS($AF$35:AF49)-1,COLUMNS($AF$35:AF49)-1)<>\"\",OFFSET(DE104_3!$AF$35,ROWS($AF$35:AF49)-1,COLUMNS($AF$35:AF49)-1),\"\")","v":""},{"$f":"IF(OFFSET(DE104_3!$AG$35,ROWS($AG$35:AG49)-1,COLUMNS($AG$35:AG49)-1)<>\"\",OFFSET(DE104_3!$AG$35,ROWS($AG$35:AG49)-1,COLUMNS($AG$35:AG49)-1),\"\")","v":""},{"$f":"IF(OFFSET(DE104_3!$AH$35,ROWS($AH$35:AH49)-1,COLUMNS($AH$35:AH49)-1)<>\"\",OFFSET(DE104_3!$AH$35,ROWS($AH$35:AH49)-1,COLUMNS($AH$35:AH49)-1),\"\")","v":""},{"$f":"IF(OFFSET(DE104_3!$AI$35,ROWS($AI$35:AI49)-1,COLUMNS($AI$35:AI49)-1)<>\"\",OFFSET(DE104_3!$AI$35,ROWS($AI$35:AI49)-1,COLUMNS($AI$35:AI49)-1),\"\")","v":""},{"$f":"IF(OFFSET(DE104_3!$AJ$35,ROWS($AJ$35:AJ49)-1,COLUMNS($AJ$35:AJ49)-1)<>\"\",OFFSET(DE104_3!$AJ$35,ROWS($AJ$35:AJ49)-1,COLUMNS($AJ$35:AJ49)-1),\"\")","v":""},{"$f":"IF(OFFSET(DE104_3!$AK$35,ROWS($AK$35:AK49)-1,COLUMNS($AK$35:AK49)-1)<>\"\",OFFSET(DE104_3!$AK$35,ROWS($AK$35:AK49)-1,COLUMNS($AK$35:AK49)-1),\"\")","v":""},{"$f":"IF(OFFSET(DE104_3!$AL$35,ROWS($AL$35:AL49)-1,COLUMNS($AL$35:AL49)-1)<>\"\",OFFSET(DE104_3!$AL$35,ROWS($AL$35:AL49)-1,COLUMNS($AL$35:AL49)-1),\"\")","v":""},{"$f":"IF(OFFSET(DE104_3!$AM$35,ROWS($AM$35:AM49)-1,COLUMNS($AM$35:AM49)-1)<>\"\",OFFSET(DE104_3!$AM$35,ROWS($AM$35:AM49)-1,COLUMNS($AM$35:AM49)-1),\"\")","v":""},{"$f":"IF(OFFSET(DE104_3!$AN$35,ROWS($AN$35:AN49)-1,COLUMNS($AN$35:AN49)-1)<>\"\",OFFSET(DE104_3!$AN$35,ROWS($AN$35:AN49)-1,COLUMNS($AN$35:AN49)-1),\"\")","v":""},{"$f":"IF(OFFSET(DE104_3!$AO$35,ROWS($AO$35:AO49)-1,COLUMNS($AO$35:AO49)-1)<>\"\",OFFSET(DE104_3!$AO$35,ROWS($AO$35:AO49)-1,COLUMNS($AO$35:AO49)-1),\"\")","v":""},{"$f":"IF(OFFSET(DE104_3!$AP$35,ROWS($AP$35:AP49)-1,COLUMNS($AP$35:AP49)-1)<>\"\",OFFSET(DE104_3!$AP$35,ROWS($AP$35:AP49)-1,COLUMNS($AP$35:AP49)-1),\"\")","v":""},{"$f":"IF(OFFSET(DE104_3!$AQ$35,ROWS($AQ$35:AQ49)-1,COLUMNS($AQ$35:AQ49)-1)<>\"\",OFFSET(DE104_3!$AQ$35,ROWS($AQ$35:AQ49)-1,COLUMNS($AQ$35:AQ49)-1),\"\")","v":""}]
[{"$f":"IF(OFFSET(DE104_3!$C$35,ROWS($C$35:C50)-1,COLUMNS($C$35:C50)-1)<>\"\",OFFSET(DE104_3!$C$35,ROWS($C$35:C50)-1,COLUMNS($C$35:C50)-1),\"\")","v":""},{"$f":"IF(OFFSET(DE104_3!$D$35,ROWS($D$35:D50)-1,COLUMNS($D$35:D50)-1)<>\"\",OFFSET(DE104_3!$D$35,ROWS($D$35:D50)-1,COLUMNS($D$35:D50)-1),\"\")","v":"TOTALS:"},{"$f":"IF(OFFSET(DE104_3!$E$35,ROWS($E$35:E50)-1,COLUMNS($E$35:E50)-1)<>\"\",OFFSET(DE104_3!$E$35,ROWS($E$35:E50)-1,COLUMNS($E$35:E50)-1),\"\")","v":""},{"$f":"IF(OFFSET(DE104_3!$F$35,ROWS($F$35:F50)-1,COLUMNS($F$35:F50)-1)<>\"\",OFFSET(DE104_3!$F$35,ROWS($F$35:F50)-1,COLUMNS($F$35:F50)-1),\"\")","v":""},{"$f":"IF(OFFSET(DE104_3!$G$35,ROWS($G$35:G50)-1,COLUMNS($G$35:G50)-1)<>\"\",OFFSET(DE104_3!$G$35,ROWS($G$35:G50)-1,COLUMNS($G$35:G50)-1),\"\")","v":""},{"$f":"IF(OFFSET(DE104_3!$H$35,ROWS($H$35:H50)-1,COLUMNS($H$35:H50)-1)<>\"\",OFFSET(DE104_3!$H$35,ROWS($H$35:H50)-1,COLUMNS($H$35:H50)-1),\"\")","v":""},{"$f":"IF(OFFSET(DE104_3!$I$35,ROWS($I$35:I50)-1,COLUMNS($I$35:I50)-1)<>\"\",OFFSET(DE104_3!$I$35,ROWS($I$35:I50)-1,COLUMNS($I$35:I50)-1),\"\")","v":""},{"$f":"IF(OFFSET(DE104_3!$J$35,ROWS($J$35:J50)-1,COLUMNS($J$35:J50)-1)<>\"\",OFFSET(DE104_3!$J$35,ROWS($J$35:J50)-1,COLUMNS($J$35:J50)-1),\"\")","v":""},{"$f":"IF(OFFSET(DE104_3!$K$35,ROWS($K$35:K50)-1,COLUMNS($K$35:K50)-1)<>\"\",OFFSET(DE104_3!$K$35,ROWS($K$35:K50)-1,COLUMNS($K$35:K50)-1),\"\")","v":""},{"$f":"IF(OFFSET(DE104_3!$L$35,ROWS($L$35:L50)-1,COLUMNS($L$35:L50)-1)<>\"\",OFFSET(DE104_3!$L$35,ROWS($L$35:L50)-1,COLUMNS($L$35:L50)-1),\"\")","v":""},{"$f":"IF(OFFSET(DE104_3!$M$35,ROWS($M$35:M50)-1,COLUMNS($M$35:M50)-1)<>\"\",OFFSET(DE104_3!$M$35,ROWS($M$35:M50)-1,COLUMNS($M$35:M50)-1),\"\")","v":""},{"$f":"IF(OFFSET(DE104_3!$N$35,ROWS($N$35:N50)-1,COLUMNS($N$35:N50)-1)<>\"\",OFFSET(DE104_3!$N$35,ROWS($N$35:N50)-1,COLUMNS($N$35:N50)-1),\"\")","v":""},{"$f":"IF(OFFSET(DE104_3!$O$35,ROWS($O$35:O50)-1,COLUMNS($O$35:O50)-1)<>\"\",OFFSET(DE104_3!$O$35,ROWS($O$35:O50)-1,COLUMNS($O$35:O50)-1),\"\")","v":""},{"$f":"IF(OFFSET(DE104_3!$P$35,ROWS($P$35:P50)-1,COLUMNS($P$35:P50)-1)<>\"\",OFFSET(DE104_3!$P$35,ROWS($P$35:P50)-1,COLUMNS($P$35:P50)-1),\"\")","v":""},{"$f":"IF(OFFSET(DE104_3!$Q$35,ROWS($Q$35:Q50)-1,COLUMNS($Q$35:Q50)-1)<>\"\",OFFSET(DE104_3!$Q$35,ROWS($Q$35:Q50)-1,COLUMNS($Q$35:Q50)-1),\"\")","v":""},{"$f":"IF(OFFSET(DE104_3!$R$35,ROWS($R$35:R50)-1,COLUMNS($R$35:R50)-1)<>\"\",OFFSET(DE104_3!$R$35,ROWS($R$35:R50)-1,COLUMNS($R$35:R50)-1),\"\")","v":""},{"$f":"IF(OFFSET(DE104_3!$S$35,ROWS($S$35:S50)-1,COLUMNS($S$35:S50)-1)<>\"\",OFFSET(DE104_3!$S$35,ROWS($S$35:S50)-1,COLUMNS($S$35:S50)-1),\"\")","v":""},{"$f":"IF(OFFSET(DE104_3!$T$35,ROWS($T$35:T50)-1,COLUMNS($T$35:T50)-1)<>\"\",OFFSET(DE104_3!$T$35,ROWS($T$35:T50)-1,COLUMNS($T$35:T50)-1),\"\")","v":""},{"$f":"IF(OFFSET(DE104_3!$U$35,ROWS($U$35:U50)-1,COLUMNS($U$35:U50)-1)<>\"\",OFFSET(DE104_3!$U$35,ROWS($U$35:U50)-1,COLUMNS($U$35:U50)-1),\"\")","v":""},{"$f":"IF(OFFSET(DE104_3!$V$35,ROWS($V$35:V50)-1,COLUMNS($V$35:V50)-1)<>\"\",OFFSET(DE104_3!$V$35,ROWS($V$35:V50)-1,COLUMNS($V$35:V50)-1),\"\")","v":""},{"$f":"IF(OFFSET(DE104_3!$W$35,ROWS($W$35:W50)-1,COLUMNS($W$35:W50)-1)<>\"\",OFFSET(DE104_3!$W$35,ROWS($W$35:W50)-1,COLUMNS($W$35:W50)-1),\"\")","v":""},{"$f":"IF(OFFSET(DE104_3!$X$35,ROWS($X$35:X50)-1,COLUMNS($X$35:X50)-1)<>\"\",OFFSET(DE104_3!$X$35,ROWS($X$35:X50)-1,COLUMNS($X$35:X50)-1),\"\")","v":""},{"$f":"IF(OFFSET(DE104_3!$Y$35,ROWS($Y$35:Y50)-1,COLUMNS($Y$35:Y50)-1)<>\"\",OFFSET(DE104_3!$Y$35,ROWS($Y$35:Y50)-1,COLUMNS($Y$35:Y50)-1),\"\")","v":""},{"$f":"IF(OFFSET(DE104_3!$Z$35,ROWS($Z$35:Z50)-1,COLUMNS($Z$35:Z50)-1)<>\"\",OFFSET(DE104_3!$Z$35,ROWS($Z$35:Z50)-1,COLUMNS($Z$35:Z50)-1),\"\")","v":""},{"$f":"IF(OFFSET(DE104_3!$AA$35,ROWS($AA$35:AA50)-1,COLUMNS($AA$35:AA50)-1)<>\"\",OFFSET(DE104_3!$AA$35,ROWS($AA$35:AA50)-1,COLUMNS($AA$35:AA50)-1),\"\")","v":""},{"$f":"IF(OFFSET(DE104_3!$AB$35,ROWS($AB$35:AB50)-1,COLUMNS($AB$35:AB50)-1)<>\"\",OFFSET(DE104_3!$AB$35,ROWS($AB$35:AB50)-1,COLUMNS($AB$35:AB50)-1),\"\")","v":""},{"$f":"IF(OFFSET(DE104_3!$AC$35,ROWS($AC$35:AC50)-1,COLUMNS($AC$35:AC50)-1)<>\"\",OFFSET(DE104_3!$AC$35,ROWS($AC$35:AC50)-1,COLUMNS($AC$35:AC50)-1),\"\")","v":""},{"$f":"IF(OFFSET(DE104_3!$AD$35,ROWS($AD$35:AD50)-1,COLUMNS($AD$35:AD50)-1)<>\"\",OFFSET(DE104_3!$AD$35,ROWS($AD$35:AD50)-1,COLUMNS($AD$35:AD50)-1),\"\")","v":""},{"$f":"IF(OFFSET(DE104_3!$AE$35,ROWS($AE$35:AE50)-1,COLUMNS($AE$35:AE50)-1)<>\"\",OFFSET(DE104_3!$AE$35,ROWS($AE$35:AE50)-1,COLUMNS($AE$35:AE50)-1),\"\")","v":""},{"$f":"IF(OFFSET(DE104_3!$AF$35,ROWS($AF$35:AF50)-1,COLUMNS($AF$35:AF50)-1)<>\"\",OFFSET(DE104_3!$AF$35,ROWS($AF$35:AF50)-1,COLUMNS($AF$35:AF50)-1),\"\")","v":""},{"$f":"IF(OFFSET(DE104_3!$AG$35,ROWS($AG$35:AG50)-1,COLUMNS($AG$35:AG50)-1)<>\"\",OFFSET(DE104_3!$AG$35,ROWS($AG$35:AG50)-1,COLUMNS($AG$35:AG50)-1),\"\")","v":""},{"$f":"IF(OFFSET(DE104_3!$AH$35,ROWS($AH$35:AH50)-1,COLUMNS($AH$35:AH50)-1)<>\"\",OFFSET(DE104_3!$AH$35,ROWS($AH$35:AH50)-1,COLUMNS($AH$35:AH50)-1),\"\")","v":""},{"$f":"IF(OFFSET(DE104_3!$AI$35,ROWS($AI$35:AI50)-1,COLUMNS($AI$35:AI50)-1)<>\"\",OFFSET(DE104_3!$AI$35,ROWS($AI$35:AI50)-1,COLUMNS($AI$35:AI50)-1),\"\")","v":""},{"$f":"IF(OFFSET(DE104_3!$AJ$35,ROWS($AJ$35:AJ50)-1,COLUMNS($AJ$35:AJ50)-1)<>\"\",OFFSET(DE104_3!$AJ$35,ROWS($AJ$35:AJ50)-1,COLUMNS($AJ$35:AJ50)-1),\"\")","v":""},{"$f":"IF(OFFSET(DE104_3!$AK$35,ROWS($AK$35:AK50)-1,COLUMNS($AK$35:AK50)-1)<>\"\",OFFSET(DE104_3!$AK$35,ROWS($AK$35:AK50)-1,COLUMNS($AK$35:AK50)-1),\"\")","v":""},{"$f":"IF(OFFSET(DE104_3!$AL$35,ROWS($AL$35:AL50)-1,COLUMNS($AL$35:AL50)-1)<>\"\",OFFSET(DE104_3!$AL$35,ROWS($AL$35:AL50)-1,COLUMNS($AL$35:AL50)-1),\"\")","v":161.61111111111109},{"$f":"IF(OFFSET(DE104_3!$AM$35,ROWS($AM$35:AM50)-1,COLUMNS($AM$35:AM50)-1)<>\"\",OFFSET(DE104_3!$AM$35,ROWS($AM$35:AM50)-1,COLUMNS($AM$35:AM50)-1),\"\")","v":0},{"$f":"IF(OFFSET(DE104_3!$AN$35,ROWS($AN$35:AN50)-1,COLUMNS($AN$35:AN50)-1)<>\"\",OFFSET(DE104_3!$AN$35,ROWS($AN$35:AN50)-1,COLUMNS($AN$35:AN50)-1),\"\")","v":0},{"$f":"IF(OFFSET(DE104_3!$AO$35,ROWS($AO$35:AO50)-1,COLUMNS($AO$35:AO50)-1)<>\"\",OFFSET(DE104_3!$AO$35,ROWS($AO$35:AO50)-1,COLUMNS($AO$35:AO50)-1),\"\")","v":0},{"$f":"IF(OFFSET(DE104_3!$AP$35,ROWS($AP$35:AP50)-1,COLUMNS($AP$35:AP50)-1)<>\"\",OFFSET(DE104_3!$AP$35,ROWS($AP$35:AP50)-1,COLUMNS($AP$35:AP50)-1),\"\")","v":0},{"$f":"IF(OFFSET(DE104_3!$AQ$35,ROWS($AQ$35:AQ50)-1,COLUMNS($AQ$35:AQ50)-1)<>\"\",OFFSET(DE104_3!$AQ$35,ROWS($AQ$35:AQ50)-1,COLUMNS($AQ$35:AQ50)-1),\"\")","v":""}]
[{"$f":"IF(OFFSET(DE104_3!$C$35,ROWS($C$35:C51)-1,COLUMNS($C$35:C51)-1)<>\"\",OFFSET(DE104_3!$C$35,ROWS($C$35:C51)-1,COLUMNS($C$35:C51)-1),\"\")","v":""},{"$f":"IF(OFFSET(DE104_3!$D$35,ROWS($D$35:D51)-1,COLUMNS($D$35:D51)-1)<>\"\",OFFSET(DE104_3!$D$35,ROWS($D$35:D51)-1,COLUMNS($D$35:D51)-1),\"\")","v":""},{"$f":"IF(OFFSET(DE104_3!$E$35,ROWS($E$35:E51)-1,COLUMNS($E$35:E51)-1)<>\"\",OFFSET(DE104_3!$E$35,ROWS($E$35:E51)-1,COLUMNS($E$35:E51)-1),\"\")","v":""},{"$f":"IF(OFFSET(DE104_3!$F$35,ROWS($F$35:F51)-1,COLUMNS($F$35:F51)-1)<>\"\",OFFSET(DE104_3!$F$35,ROWS($F$35:F51)-1,COLUMNS($F$35:F51)-1),\"\")","v":""},{"$f":"IF(OFFSET(DE104_3!$G$35,ROWS($G$35:G51)-1,COLUMNS($G$35:G51)-1)<>\"\",OFFSET(DE104_3!$G$35,ROWS($G$35:G51)-1,COLUMNS($G$35:G51)-1),\"\")","v":""},{"$f":"IF(OFFSET(DE104_3!$H$35,ROWS($H$35:H51)-1,COLUMNS($H$35:H51)-1)<>\"\",OFFSET(DE104_3!$H$35,ROWS($H$35:H51)-1,COLUMNS($H$35:H51)-1),\"\")","v":""},{"$f":"IF(OFFSET(DE104_3!$I$35,ROWS($I$35:I51)-1,COLUMNS($I$35:I51)-1)<>\"\",OFFSET(DE104_3!$I$35,ROWS($I$35:I51)-1,COLUMNS($I$35:I51)-1),\"\")","v":""},{"$f":"IF(OFFSET(DE104_3!$J$35,ROWS($J$35:J51)-1,COLUMNS($J$35:J51)-1)<>\"\",OFFSET(DE104_3!$J$35,ROWS($J$35:J51)-1,COLUMNS($J$35:J51)-1),\"\")","v":""},{"$f":"IF(OFFSET(DE104_3!$K$35,ROWS($K$35:K51)-1,COLUMNS($K$35:K51)-1)<>\"\",OFFSET(DE104_3!$K$35,ROWS($K$35:K51)-1,COLUMNS($K$35:K51)-1),\"\")","v":""},{"$f":"IF(OFFSET(DE104_3!$L$35,ROWS($L$35:L51)-1,COLUMNS($L$35:L51)-1)<>\"\",OFFSET(DE104_3!$L$35,ROWS($L$35:L51)-1,COLUMNS($L$35:L51)-1),\"\")","v":""},{"$f":"IF(OFFSET(DE104_3!$M$35,ROWS($M$35:M51)-1,COLUMNS($M$35:M51)-1)<>\"\",OFFSET(DE104_3!$M$35,ROWS($M$35:M51)-1,COLUMNS($M$35:M51)-1),\"\")","v":""},{"$f":"IF(OFFSET(DE104_3!$N$35,ROWS($N$35:N51)-1,COLUMNS($N$35:N51)-1)<>\"\",OFFSET(DE104_3!$N$35,ROWS($N$35:N51)-1,COLUMNS($N$35:N51)-1),\"\")","v":""},{"$f":"IF(OFFSET(DE104_3!$O$35,ROWS($O$35:O51)-1,COLUMNS($O$35:O51)-1)<>\"\",OFFSET(DE104_3!$O$35,ROWS($O$35:O51)-1,COLUMNS($O$35:O51)-1),\"\")","v":""},{"$f":"IF(OFFSET(DE104_3!$P$35,ROWS($P$35:P51)-1,COLUMNS($P$35:P51)-1)<>\"\",OFFSET(DE104_3!$P$35,ROWS($P$35:P51)-1,COLUMNS($P$35:P51)-1),\"\")","v":""},{"$f":"IF(OFFSET(DE104_3!$Q$35,ROWS($Q$35:Q51)-1,COLUMNS($Q$35:Q51)-1)<>\"\",OFFSET(DE104_3!$Q$35,ROWS($Q$35:Q51)-1,COLUMNS($Q$35:Q51)-1),\"\")","v":""},{"$f":"IF(OFFSET(DE104_3!$R$35,ROWS($R$35:R51)-1,COLUMNS($R$35:R51)-1)<>\"\",OFFSET(DE104_3!$R$35,ROWS($R$35:R51)-1,COLUMNS($R$35:R51)-1),\"\")","v":""},{"$f":"IF(OFFSET(DE104_3!$S$35,ROWS($S$35:S51)-1,COLUMNS($S$35:S51)-1)<>\"\",OFFSET(DE104_3!$S$35,ROWS($S$35:S51)-1,COLUMNS($S$35:S51)-1),\"\")","v":""},{"$f":"IF(OFFSET(DE104_3!$T$35,ROWS($T$35:T51)-1,COLUMNS($T$35:T51)-1)<>\"\",OFFSET(DE104_3!$T$35,ROWS($T$35:T51)-1,COLUMNS($T$35:T51)-1),\"\")","v":""},{"$f":"IF(OFFSET(DE104_3!$U$35,ROWS($U$35:U51)-1,COLUMNS($U$35:U51)-1)<>\"\",OFFSET(DE104_3!$U$35,ROWS($U$35:U51)-1,COLUMNS($U$35:U51)-1),\"\")","v":""},{"$f":"IF(OFFSET(DE104_3!$V$35,ROWS($V$35:V51)-1,COLUMNS($V$35:V51)-1)<>\"\",OFFSET(DE104_3!$V$35,ROWS($V$35:V51)-1,COLUMNS($V$35:V51)-1),\"\")","v":""},{"$f":"IF(OFFSET(DE104_3!$W$35,ROWS($W$35:W51)-1,COLUMNS($W$35:W51)-1)<>\"\",OFFSET(DE104_3!$W$35,ROWS($W$35:W51)-1,COLUMNS($W$35:W51)-1),\"\")","v":""},{"$f":"IF(OFFSET(DE104_3!$X$35,ROWS($X$35:X51)-1,COLUMNS($X$35:X51)-1)<>\"\",OFFSET(DE104_3!$X$35,ROWS($X$35:X51)-1,COLUMNS($X$35:X51)-1),\"\")","v":""},{"$f":"IF(OFFSET(DE104_3!$Y$35,ROWS($Y$35:Y51)-1,COLUMNS($Y$35:Y51)-1)<>\"\",OFFSET(DE104_3!$Y$35,ROWS($Y$35:Y51)-1,COLUMNS($Y$35:Y51)-1),\"\")","v":""},{"$f":"IF(OFFSET(DE104_3!$Z$35,ROWS($Z$35:Z51)-1,COLUMNS($Z$35:Z51)-1)<>\"\",OFFSET(DE104_3!$Z$35,ROWS($Z$35:Z51)-1,COLUMNS($Z$35:Z51)-1),\"\")","v":""},{"$f":"IF(OFFSET(DE104_3!$AA$35,ROWS($AA$35:AA51)-1,COLUMNS($AA$35:AA51)-1)<>\"\",OFFSET(DE104_3!$AA$35,ROWS($AA$35:AA51)-1,COLUMNS($AA$35:AA51)-1),\"\")","v":""},{"$f":"IF(OFFSET(DE104_3!$AB$35,ROWS($AB$35:AB51)-1,COLUMNS($AB$35:AB51)-1)<>\"\",OFFSET(DE104_3!$AB$35,ROWS($AB$35:AB51)-1,COLUMNS($AB$35:AB51)-1),\"\")","v":""},{"$f":"IF(OFFSET(DE104_3!$AC$35,ROWS($AC$35:AC51)-1,COLUMNS($AC$35:AC51)-1)<>\"\",OFFSET(DE104_3!$AC$35,ROWS($AC$35:AC51)-1,COLUMNS($AC$35:AC51)-1),\"\")","v":""},{"$f":"IF(OFFSET(DE104_3!$AD$35,ROWS($AD$35:AD51)-1,COLUMNS($AD$35:AD51)-1)<>\"\",OFFSET(DE104_3!$AD$35,ROWS($AD$35:AD51)-1,COLUMNS($AD$35:AD51)-1),\"\")","v":""},{"$f":"IF(OFFSET(DE104_3!$AE$35,ROWS($AE$35:AE51)-1,COLUMNS($AE$35:AE51)-1)<>\"\",OFFSET(DE104_3!$AE$35,ROWS($AE$35:AE51)-1,COLUMNS($AE$35:AE51)-1),\"\")","v":""},{"$f":"IF(OFFSET(DE104_3!$AF$35,ROWS($AF$35:AF51)-1,COLUMNS($AF$35:AF51)-1)<>\"\",OFFSET(DE104_3!$AF$35,ROWS($AF$35:AF51)-1,COLUMNS($AF$35:AF51)-1),\"\")","v":""},{"$f":"IF(OFFSET(DE104_3!$AG$35,ROWS($AG$35:AG51)-1,COLUMNS($AG$35:AG51)-1)<>\"\",OFFSET(DE104_3!$AG$35,ROWS($AG$35:AG51)-1,COLUMNS($AG$35:AG51)-1),\"\")","v":""},{"$f":"IF(OFFSET(DE104_3!$AH$35,ROWS($AH$35:AH51)-1,COLUMNS($AH$35:AH51)-1)<>\"\",OFFSET(DE104_3!$AH$35,ROWS($AH$35:AH51)-1,COLUMNS($AH$35:AH51)-1),\"\")","v":""},{"$f":"IF(OFFSET(DE104_3!$AI$35,ROWS($AI$35:AI51)-1,COLUMNS($AI$35:AI51)-1)<>\"\",OFFSET(DE104_3!$AI$35,ROWS($AI$35:AI51)-1,COLUMNS($AI$35:AI51)-1),\"\")","v":""},{"$f":"IF(OFFSET(DE104_3!$AJ$35,ROWS($AJ$35:AJ51)-1,COLUMNS($AJ$35:AJ51)-1)<>\"\",OFFSET(DE104_3!$AJ$35,ROWS($AJ$35:AJ51)-1,COLUMNS($AJ$35:AJ51)-1),\"\")","v":""},{"$f":"IF(OFFSET(DE104_3!$AK$35,ROWS($AK$35:AK51)-1,COLUMNS($AK$35:AK51)-1)<>\"\",OFFSET(DE104_3!$AK$35,ROWS($AK$35:AK51)-1,COLUMNS($AK$35:AK51)-1),\"\")","v":""},{"$f":"IF(OFFSET(DE104_3!$AL$35,ROWS($AL$35:AL51)-1,COLUMNS($AL$35:AL51)-1)<>\"\",OFFSET(DE104_3!$AL$35,ROWS($AL$35:AL51)-1,COLUMNS($AL$35:AL51)-1),\"\")","v":""},{"$f":"IF(OFFSET(DE104_3!$AM$35,ROWS($AM$35:AM51)-1,COLUMNS($AM$35:AM51)-1)<>\"\",OFFSET(DE104_3!$AM$35,ROWS($AM$35:AM51)-1,COLUMNS($AM$35:AM51)-1),\"\")","v":""},{"$f":"IF(OFFSET(DE104_3!$AN$35,ROWS($AN$35:AN51)-1,COLUMNS($AN$35:AN51)-1)<>\"\",OFFSET(DE104_3!$AN$35,ROWS($AN$35:AN51)-1,COLUMNS($AN$35:AN51)-1),\"\")","v":""},{"$f":"IF(OFFSET(DE104_3!$AO$35,ROWS($AO$35:AO51)-1,COLUMNS($AO$35:AO51)-1)<>\"\",OFFSET(DE104_3!$AO$35,ROWS($AO$35:AO51)-1,COLUMNS($AO$35:AO51)-1),\"\")","v":""},{"$f":"IF(OFFSET(DE104_3!$AP$35,ROWS($AP$35:AP51)-1,COLUMNS($AP$35:AP51)-1)<>\"\",OFFSET(DE104_3!$AP$35,ROWS($AP$35:AP51)-1,COLUMNS($AP$35:AP51)-1),\"\")","v":""},{"$f":"IF(OFFSET(DE104_3!$AQ$35,ROWS($AQ$35:AQ51)-1,COLUMNS($AQ$35:AQ51)-1)<>\"\",OFFSET(DE104_3!$AQ$35,ROWS($AQ$35:AQ51)-1,COLUMNS($AQ$35:AQ51)-1),\"\")","v":""}]
[{"$f":"IF(OFFSET(DE104_3!$C$35,ROWS($C$35:C52)-1,COLUMNS($C$35:C52)-1)<>\"\",OFFSET(DE104_3!$C$35,ROWS($C$35:C52)-1,COLUMNS($C$35:C52)-1),\"\")","v":""},{"$f":"IF(OFFSET(DE104_3!$D$35,ROWS($D$35:D52)-1,COLUMNS($D$35:D52)-1)<>\"\",OFFSET(DE104_3!$D$35,ROWS($D$35:D52)-1,COLUMNS($D$35:D52)-1),\"\")","v":""},{"$f":"IF(OFFSET(DE104_3!$E$35,ROWS($E$35:E52)-1,COLUMNS($E$35:E52)-1)<>\"\",OFFSET(DE104_3!$E$35,ROWS($E$35:E52)-1,COLUMNS($E$35:E52)-1),\"\")","v":""},{"$f":"IF(OFFSET(DE104_3!$F$35,ROWS($F$35:F52)-1,COLUMNS($F$35:F52)-1)<>\"\",OFFSET(DE104_3!$F$35,ROWS($F$35:F52)-1,COLUMNS($F$35:F52)-1),\"\")","v":""},{"$f":"IF(OFFSET(DE104_3!$G$35,ROWS($G$35:G52)-1,COLUMNS($G$35:G52)-1)<>\"\",OFFSET(DE104_3!$G$35,ROWS($G$35:G52)-1,COLUMNS($G$35:G52)-1),\"\")","v":""},{"$f":"IF(OFFSET(DE104_3!$H$35,ROWS($H$35:H52)-1,COLUMNS($H$35:H52)-1)<>\"\",OFFSET(DE104_3!$H$35,ROWS($H$35:H52)-1,COLUMNS($H$35:H52)-1),\"\")","v":""},{"$f":"IF(OFFSET(DE104_3!$I$35,ROWS($I$35:I52)-1,COLUMNS($I$35:I52)-1)<>\"\",OFFSET(DE104_3!$I$35,ROWS($I$35:I52)-1,COLUMNS($I$35:I52)-1),\"\")","v":""},{"$f":"IF(OFFSET(DE104_3!$J$35,ROWS($J$35:J52)-1,COLUMNS($J$35:J52)-1)<>\"\",OFFSET(DE104_3!$J$35,ROWS($J$35:J52)-1,COLUMNS($J$35:J52)-1),\"\")","v":""},{"$f":"IF(OFFSET(DE104_3!$K$35,ROWS($K$35:K52)-1,COLUMNS($K$35:K52)-1)<>\"\",OFFSET(DE104_3!$K$35,ROWS($K$35:K52)-1,COLUMNS($K$35:K52)-1),\"\")","v":""},{"$f":"IF(OFFSET(DE104_3!$L$35,ROWS($L$35:L52)-1,COLUMNS($L$35:L52)-1)<>\"\",OFFSET(DE104_3!$L$35,ROWS($L$35:L52)-1,COLUMNS($L$35:L52)-1),\"\")","v":""},{"$f":"IF(OFFSET(DE104_3!$M$35,ROWS($M$35:M52)-1,COLUMNS($M$35:M52)-1)<>\"\",OFFSET(DE104_3!$M$35,ROWS($M$35:M52)-1,COLUMNS($M$35:M52)-1),\"\")","v":""},{"$f":"IF(OFFSET(DE104_3!$N$35,ROWS($N$35:N52)-1,COLUMNS($N$35:N52)-1)<>\"\",OFFSET(DE104_3!$N$35,ROWS($N$35:N52)-1,COLUMNS($N$35:N52)-1),\"\")","v":""},{"$f":"IF(OFFSET(DE104_3!$O$35,ROWS($O$35:O52)-1,COLUMNS($O$35:O52)-1)<>\"\",OFFSET(DE104_3!$O$35,ROWS($O$35:O52)-1,COLUMNS($O$35:O52)-1),\"\")","v":""},{"$f":"IF(OFFSET(DE104_3!$P$35,ROWS($P$35:P52)-1,COLUMNS($P$35:P52)-1)<>\"\",OFFSET(DE104_3!$P$35,ROWS($P$35:P52)-1,COLUMNS($P$35:P52)-1),\"\")","v":""},{"$f":"IF(OFFSET(DE104_3!$Q$35,ROWS($Q$35:Q52)-1,COLUMNS($Q$35:Q52)-1)<>\"\",OFFSET(DE104_3!$Q$35,ROWS($Q$35:Q52)-1,COLUMNS($Q$35:Q52)-1),\"\")","v":""},{"$f":"IF(OFFSET(DE104_3!$R$35,ROWS($R$35:R52)-1,COLUMNS($R$35:R52)-1)<>\"\",OFFSET(DE104_3!$R$35,ROWS($R$35:R52)-1,COLUMNS($R$35:R52)-1),\"\")","v":""},{"$f":"IF(OFFSET(DE104_3!$S$35,ROWS($S$35:S52)-1,COLUMNS($S$35:S52)-1)<>\"\",OFFSET(DE104_3!$S$35,ROWS($S$35:S52)-1,COLUMNS($S$35:S52)-1),\"\")","v":""},{"$f":"IF(OFFSET(DE104_3!$T$35,ROWS($T$35:T52)-1,COLUMNS($T$35:T52)-1)<>\"\",OFFSET(DE104_3!$T$35,ROWS($T$35:T52)-1,COLUMNS($T$35:T52)-1),\"\")","v":""},{"$f":"IF(OFFSET(DE104_3!$U$35,ROWS($U$35:U52)-1,COLUMNS($U$35:U52)-1)<>\"\",OFFSET(DE104_3!$U$35,ROWS($U$35:U52)-1,COLUMNS($U$35:U52)-1),\"\")","v":""},{"$f":"IF(OFFSET(DE104_3!$V$35,ROWS($V$35:V52)-1,COLUMNS($V$35:V52)-1)<>\"\",OFFSET(DE104_3!$V$35,ROWS($V$35:V52)-1,COLUMNS($V$35:V52)-1),\"\")","v":""},{"$f":"IF(OFFSET(DE104_3!$W$35,ROWS($W$35:W52)-1,COLUMNS($W$35:W52)-1)<>\"\",OFFSET(DE104_3!$W$35,ROWS($W$35:W52)-1,COLUMNS($W$35:W52)-1),\"\")","v":""},{"$f":"IF(OFFSET(DE104_3!$X$35,ROWS($X$35:X52)-1,COLUMNS($X$35:X52)-1)<>\"\",OFFSET(DE104_3!$X$35,ROWS($X$35:X52)-1,COLUMNS($X$35:X52)-1),\"\")","v":""},{"$f":"IF(OFFSET(DE104_3!$Y$35,ROWS($Y$35:Y52)-1,COLUMNS($Y$35:Y52)-1)<>\"\",OFFSET(DE104_3!$Y$35,ROWS($Y$35:Y52)-1,COLUMNS($Y$35:Y52)-1),\"\")","v":""},{"$f":"IF(OFFSET(DE104_3!$Z$35,ROWS($Z$35:Z52)-1,COLUMNS($Z$35:Z52)-1)<>\"\",OFFSET(DE104_3!$Z$35,ROWS($Z$35:Z52)-1,COLUMNS($Z$35:Z52)-1),\"\")","v":""},{"$f":"IF(OFFSET(DE104_3!$AA$35,ROWS($AA$35:AA52)-1,COLUMNS($AA$35:AA52)-1)<>\"\",OFFSET(DE104_3!$AA$35,ROWS($AA$35:AA52)-1,COLUMNS($AA$35:AA52)-1),\"\")","v":""},{"$f":"IF(OFFSET(DE104_3!$AB$35,ROWS($AB$35:AB52)-1,COLUMNS($AB$35:AB52)-1)<>\"\",OFFSET(DE104_3!$AB$35,ROWS($AB$35:AB52)-1,COLUMNS($AB$35:AB52)-1),\"\")","v":""},{"$f":"IF(OFFSET(DE104_3!$AC$35,ROWS($AC$35:AC52)-1,COLUMNS($AC$35:AC52)-1)<>\"\",OFFSET(DE104_3!$AC$35,ROWS($AC$35:AC52)-1,COLUMNS($AC$35:AC52)-1),\"\")","v":""},{"$f":"IF(OFFSET(DE104_3!$AD$35,ROWS($AD$35:AD52)-1,COLUMNS($AD$35:AD52)-1)<>\"\",OFFSET(DE104_3!$AD$35,ROWS($AD$35:AD52)-1,COLUMNS($AD$35:AD52)-1),\"\")","v":""},{"$f":"IF(OFFSET(DE104_3!$AE$35,ROWS($AE$35:AE52)-1,COLUMNS($AE$35:AE52)-1)<>\"\",OFFSET(DE104_3!$AE$35,ROWS($AE$35:AE52)-1,COLUMNS($AE$35:AE52)-1),\"\")","v":""},{"$f":"IF(OFFSET(DE104_3!$AF$35,ROWS($AF$35:AF52)-1,COLUMNS($AF$35:AF52)-1)<>\"\",OFFSET(DE104_3!$AF$35,ROWS($AF$35:AF52)-1,COLUMNS($AF$35:AF52)-1),\"\")","v":""},{"$f":"IF(OFFSET(DE104_3!$AG$35,ROWS($AG$35:AG52)-1,COLUMNS($AG$35:AG52)-1)<>\"\",OFFSET(DE104_3!$AG$35,ROWS($AG$35:AG52)-1,COLUMNS($AG$35:AG52)-1),\"\")","v":""},{"$f":"IF(OFFSET(DE104_3!$AH$35,ROWS($AH$35:AH52)-1,COLUMNS($AH$35:AH52)-1)<>\"\",OFFSET(DE104_3!$AH$35,ROWS($AH$35:AH52)-1,COLUMNS($AH$35:AH52)-1),\"\")","v":""},{"$f":"IF(OFFSET(DE104_3!$AI$35,ROWS($AI$35:AI52)-1,COLUMNS($AI$35:AI52)-1)<>\"\",OFFSET(DE104_3!$AI$35,ROWS($AI$35:AI52)-1,COLUMNS($AI$35:AI52)-1),\"\")","v":""},{"$f":"IF(OFFSET(DE104_3!$AJ$35,ROWS($AJ$35:AJ52)-1,COLUMNS($AJ$35:AJ52)-1)<>\"\",OFFSET(DE104_3!$AJ$35,ROWS($AJ$35:AJ52)-1,COLUMNS($AJ$35:AJ52)-1),\"\")","v":""},{"$f":"IF(OFFSET(DE104_3!$AK$35,ROWS($AK$35:AK52)-1,COLUMNS($AK$35:AK52)-1)<>\"\",OFFSET(DE104_3!$AK$35,ROWS($AK$35:AK52)-1,COLUMNS($AK$35:AK52)-1),\"\")","v":""},{"$f":"IF(OFFSET(DE104_3!$AL$35,ROWS($AL$35:AL52)-1,COLUMNS($AL$35:AL52)-1)<>\"\",OFFSET(DE104_3!$AL$35,ROWS($AL$35:AL52)-1,COLUMNS($AL$35:AL52)-1),\"\")","v":""},{"$f":"IF(OFFSET(DE104_3!$AM$35,ROWS($AM$35:AM52)-1,COLUMNS($AM$35:AM52)-1)<>\"\",OFFSET(DE104_3!$AM$35,ROWS($AM$35:AM52)-1,COLUMNS($AM$35:AM52)-1),\"\")","v":""},{"$f":"IF(OFFSET(DE104_3!$AN$35,ROWS($AN$35:AN52)-1,COLUMNS($AN$35:AN52)-1)<>\"\",OFFSET(DE104_3!$AN$35,ROWS($AN$35:AN52)-1,COLUMNS($AN$35:AN52)-1),\"\")","v":""},{"$f":"IF(OFFSET(DE104_3!$AO$35,ROWS($AO$35:AO52)-1,COLUMNS($AO$35:AO52)-1)<>\"\",OFFSET(DE104_3!$AO$35,ROWS($AO$35:AO52)-1,COLUMNS($AO$35:AO52)-1),\"\")","v":""},{"$f":"IF(OFFSET(DE104_3!$AP$35,ROWS($AP$35:AP52)-1,COLUMNS($AP$35:AP52)-1)<>\"\",OFFSET(DE104_3!$AP$35,ROWS($AP$35:AP52)-1,COLUMNS($AP$35:AP52)-1),\"\")","v":""},{"$f":"IF(OFFSET(DE104_3!$AQ$35,ROWS($AQ$35:AQ52)-1,COLUMNS($AQ$35:AQ52)-1)<>\"\",OFFSET(DE104_3!$AQ$35,ROWS($AQ$35:AQ52)-1,COLUMNS($AQ$35:AQ52)-1),\"\")","v":""}]
[{"$f":"IF(OFFSET(DE104_3!$C$35,ROWS($C$35:C53)-1,COLUMNS($C$35:C53)-1)<>\"\",OFFSET(DE104_3!$C$35,ROWS($C$35:C53)-1,COLUMNS($C$35:C53)-1),\"\")","v":""},{"$f":"IF(OFFSET(DE104_3!$D$35,ROWS($D$35:D53)-1,COLUMNS($D$35:D53)-1)<>\"\",OFFSET(DE104_3!$D$35,ROWS($D$35:D53)-1,COLUMNS($D$35:D53)-1),\"\")","v":""},{"$f":"IF(OFFSET(DE104_3!$E$35,ROWS($E$35:E53)-1,COLUMNS($E$35:E53)-1)<>\"\",OFFSET(DE104_3!$E$35,ROWS($E$35:E53)-1,COLUMNS($E$35:E53)-1),\"\")","v":""},{"$f":"IF(OFFSET(DE104_3!$F$35,ROWS($F$35:F53)-1,COLUMNS($F$35:F53)-1)<>\"\",OFFSET(DE104_3!$F$35,ROWS($F$35:F53)-1,COLUMNS($F$35:F53)-1),\"\")","v":""},{"$f":"IF(OFFSET(DE104_3!$G$35,ROWS($G$35:G53)-1,COLUMNS($G$35:G53)-1)<>\"\",OFFSET(DE104_3!$G$35,ROWS($G$35:G53)-1,COLUMNS($G$35:G53)-1),\"\")","v":""},{"$f":"IF(OFFSET(DE104_3!$H$35,ROWS($H$35:H53)-1,COLUMNS($H$35:H53)-1)<>\"\",OFFSET(DE104_3!$H$35,ROWS($H$35:H53)-1,COLUMNS($H$35:H53)-1),\"\")","v":""},{"$f":"IF(OFFSET(DE104_3!$I$35,ROWS($I$35:I53)-1,COLUMNS($I$35:I53)-1)<>\"\",OFFSET(DE104_3!$I$35,ROWS($I$35:I53)-1,COLUMNS($I$35:I53)-1),\"\")","v":""},{"$f":"IF(OFFSET(DE104_3!$J$35,ROWS($J$35:J53)-1,COLUMNS($J$35:J53)-1)<>\"\",OFFSET(DE104_3!$J$35,ROWS($J$35:J53)-1,COLUMNS($J$35:J53)-1),\"\")","v":""},{"$f":"IF(OFFSET(DE104_3!$K$35,ROWS($K$35:K53)-1,COLUMNS($K$35:K53)-1)<>\"\",OFFSET(DE104_3!$K$35,ROWS($K$35:K53)-1,COLUMNS($K$35:K53)-1),\"\")","v":""},{"$f":"IF(OFFSET(DE104_3!$L$35,ROWS($L$35:L53)-1,COLUMNS($L$35:L53)-1)<>\"\",OFFSET(DE104_3!$L$35,ROWS($L$35:L53)-1,COLUMNS($L$35:L53)-1),\"\")","v":""},{"$f":"IF(OFFSET(DE104_3!$M$35,ROWS($M$35:M53)-1,COLUMNS($M$35:M53)-1)<>\"\",OFFSET(DE104_3!$M$35,ROWS($M$35:M53)-1,COLUMNS($M$35:M53)-1),\"\")","v":""},{"$f":"IF(OFFSET(DE104_3!$N$35,ROWS($N$35:N53)-1,COLUMNS($N$35:N53)-1)<>\"\",OFFSET(DE104_3!$N$35,ROWS($N$35:N53)-1,COLUMNS($N$35:N53)-1),\"\")","v":""},{"$f":"IF(OFFSET(DE104_3!$O$35,ROWS($O$35:O53)-1,COLUMNS($O$35:O53)-1)<>\"\",OFFSET(DE104_3!$O$35,ROWS($O$35:O53)-1,COLUMNS($O$35:O53)-1),\"\")","v":""},{"$f":"IF(OFFSET(DE104_3!$P$35,ROWS($P$35:P53)-1,COLUMNS($P$35:P53)-1)<>\"\",OFFSET(DE104_3!$P$35,ROWS($P$35:P53)-1,COLUMNS($P$35:P53)-1),\"\")","v":""},{"$f":"IF(OFFSET(DE104_3!$Q$35,ROWS($Q$35:Q53)-1,COLUMNS($Q$35:Q53)-1)<>\"\",OFFSET(DE104_3!$Q$35,ROWS($Q$35:Q53)-1,COLUMNS($Q$35:Q53)-1),\"\")","v":""},{"$f":"IF(OFFSET(DE104_3!$R$35,ROWS($R$35:R53)-1,COLUMNS($R$35:R53)-1)<>\"\",OFFSET(DE104_3!$R$35,ROWS($R$35:R53)-1,COLUMNS($R$35:R53)-1),\"\")","v":""},{"$f":"IF(OFFSET(DE104_3!$S$35,ROWS($S$35:S53)-1,COLUMNS($S$35:S53)-1)<>\"\",OFFSET(DE104_3!$S$35,ROWS($S$35:S53)-1,COLUMNS($S$35:S53)-1),\"\")","v":""},{"$f":"IF(OFFSET(DE104_3!$T$35,ROWS($T$35:T53)-1,COLUMNS($T$35:T53)-1)<>\"\",OFFSET(DE104_3!$T$35,ROWS($T$35:T53)-1,COLUMNS($T$35:T53)-1),\"\")","v":""},{"$f":"IF(OFFSET(DE104_3!$U$35,ROWS($U$35:U53)-1,COLUMNS($U$35:U53)-1)<>\"\",OFFSET(DE104_3!$U$35,ROWS($U$35:U53)-1,COLUMNS($U$35:U53)-1),\"\")","v":""},{"$f":"IF(OFFSET(DE104_3!$V$35,ROWS($V$35:V53)-1,COLUMNS($V$35:V53)-1)<>\"\",OFFSET(DE104_3!$V$35,ROWS($V$35:V53)-1,COLUMNS($V$35:V53)-1),\"\")","v":""},{"$f":"IF(OFFSET(DE104_3!$W$35,ROWS($W$35:W53)-1,COLUMNS($W$35:W53)-1)<>\"\",OFFSET(DE104_3!$W$35,ROWS($W$35:W53)-1,COLUMNS($W$35:W53)-1),\"\")","v":""},{"$f":"IF(OFFSET(DE104_3!$X$35,ROWS($X$35:X53)-1,COLUMNS($X$35:X53)-1)<>\"\",OFFSET(DE104_3!$X$35,ROWS($X$35:X53)-1,COLUMNS($X$35:X53)-1),\"\")","v":""},{"$f":"IF(OFFSET(DE104_3!$Y$35,ROWS($Y$35:Y53)-1,COLUMNS($Y$35:Y53)-1)<>\"\",OFFSET(DE104_3!$Y$35,ROWS($Y$35:Y53)-1,COLUMNS($Y$35:Y53)-1),\"\")","v":""},{"$f":"IF(OFFSET(DE104_3!$Z$35,ROWS($Z$35:Z53)-1,COLUMNS($Z$35:Z53)-1)<>\"\",OFFSET(DE104_3!$Z$35,ROWS($Z$35:Z53)-1,COLUMNS($Z$35:Z53)-1),\"\")","v":""},{"$f":"IF(OFFSET(DE104_3!$AA$35,ROWS($AA$35:AA53)-1,COLUMNS($AA$35:AA53)-1)<>\"\",OFFSET(DE104_3!$AA$35,ROWS($AA$35:AA53)-1,COLUMNS($AA$35:AA53)-1),\"\")","v":""},{"$f":"IF(OFFSET(DE104_3!$AB$35,ROWS($AB$35:AB53)-1,COLUMNS($AB$35:AB53)-1)<>\"\",OFFSET(DE104_3!$AB$35,ROWS($AB$35:AB53)-1,COLUMNS($AB$35:AB53)-1),\"\")","v":""},{"$f":"IF(OFFSET(DE104_3!$AC$35,ROWS($AC$35:AC53)-1,COLUMNS($AC$35:AC53)-1)<>\"\",OFFSET(DE104_3!$AC$35,ROWS($AC$35:AC53)-1,COLUMNS($AC$35:AC53)-1),\"\")","v":""},{"$f":"IF(OFFSET(DE104_3!$AD$35,ROWS($AD$35:AD53)-1,COLUMNS($AD$35:AD53)-1)<>\"\",OFFSET(DE104_3!$AD$35,ROWS($AD$35:AD53)-1,COLUMNS($AD$35:AD53)-1),\"\")","v":""},{"$f":"IF(OFFSET(DE104_3!$AE$35,ROWS($AE$35:AE53)-1,COLUMNS($AE$35:AE53)-1)<>\"\",OFFSET(DE104_3!$AE$35,ROWS($AE$35:AE53)-1,COLUMNS($AE$35:AE53)-1),\"\")","v":""},{"$f":"IF(OFFSET(DE104_3!$AF$35,ROWS($AF$35:AF53)-1,COLUMNS($AF$35:AF53)-1)<>\"\",OFFSET(DE104_3!$AF$35,ROWS($AF$35:AF53)-1,COLUMNS($AF$35:AF53)-1),\"\")","v":""},{"$f":"IF(OFFSET(DE104_3!$AG$35,ROWS($AG$35:AG53)-1,COLUMNS($AG$35:AG53)-1)<>\"\",OFFSET(DE104_3!$AG$35,ROWS($AG$35:AG53)-1,COLUMNS($AG$35:AG53)-1),\"\")","v":""},{"$f":"IF(OFFSET(DE104_3!$AH$35,ROWS($AH$35:AH53)-1,COLUMNS($AH$35:AH53)-1)<>\"\",OFFSET(DE104_3!$AH$35,ROWS($AH$35:AH53)-1,COLUMNS($AH$35:AH53)-1),\"\")","v":""},{"$f":"IF(OFFSET(DE104_3!$AI$35,ROWS($AI$35:AI53)-1,COLUMNS($AI$35:AI53)-1)<>\"\",OFFSET(DE104_3!$AI$35,ROWS($AI$35:AI53)-1,COLUMNS($AI$35:AI53)-1),\"\")","v":""},{"$f":"IF(OFFSET(DE104_3!$AJ$35,ROWS($AJ$35:AJ53)-1,COLUMNS($AJ$35:AJ53)-1)<>\"\",OFFSET(DE104_3!$AJ$35,ROWS($AJ$35:AJ53)-1,COLUMNS($AJ$35:AJ53)-1),\"\")","v":""},{"$f":"IF(OFFSET(DE104_3!$AK$35,ROWS($AK$35:AK53)-1,COLUMNS($AK$35:AK53)-1)<>\"\",OFFSET(DE104_3!$AK$35,ROWS($AK$35:AK53)-1,COLUMNS($AK$35:AK53)-1),\"\")","v":""},{"$f":"IF(OFFSET(DE104_3!$AL$35,ROWS($AL$35:AL53)-1,COLUMNS($AL$35:AL53)-1)<>\"\",OFFSET(DE104_3!$AL$35,ROWS($AL$35:AL53)-1,COLUMNS($AL$35:AL53)-1),\"\")","v":""},{"$f":"IF(OFFSET(DE104_3!$AM$35,ROWS($AM$35:AM53)-1,COLUMNS($AM$35:AM53)-1)<>\"\",OFFSET(DE104_3!$AM$35,ROWS($AM$35:AM53)-1,COLUMNS($AM$35:AM53)-1),\"\")","v":""},{"$f":"IF(OFFSET(DE104_3!$AN$35,ROWS($AN$35:AN53)-1,COLUMNS($AN$35:AN53)-1)<>\"\",OFFSET(DE104_3!$AN$35,ROWS($AN$35:AN53)-1,COLUMNS($AN$35:AN53)-1),\"\")","v":""},{"$f":"IF(OFFSET(DE104_3!$AO$35,ROWS($AO$35:AO53)-1,COLUMNS($AO$35:AO53)-1)<>\"\",OFFSET(DE104_3!$AO$35,ROWS($AO$35:AO53)-1,COLUMNS($AO$35:AO53)-1),\"\")","v":""},{"$f":"IF(OFFSET(DE104_3!$AP$35,ROWS($AP$35:AP53)-1,COLUMNS($AP$35:AP53)-1)<>\"\",OFFSET(DE104_3!$AP$35,ROWS($AP$35:AP53)-1,COLUMNS($AP$35:AP53)-1),\"\")","v":""},{"$f":"IF(OFFSET(DE104_3!$AQ$35,ROWS($AQ$35:AQ53)-1,COLUMNS($AQ$35:AQ53)-1)<>\"\",OFFSET(DE104_3!$AQ$35,ROWS($AQ$35:AQ53)-1,COLUMNS($AQ$35:AQ53)-1),\"\")","v":""}]
[{"$f":"IF(OFFSET(DE104_3!$C$35,ROWS($C$35:C54)-1,COLUMNS($C$35:C54)-1)<>\"\",OFFSET(DE104_3!$C$35,ROWS($C$35:C54)-1,COLUMNS($C$35:C54)-1),\"\")","v":""},{"$f":"IF(OFFSET(DE104_3!$D$35,ROWS($D$35:D54)-1,COLUMNS($D$35:D54)-1)<>\"\",OFFSET(DE104_3!$D$35,ROWS($D$35:D54)-1,COLUMNS($D$35:D54)-1),\"\")","v":""},{"$f":"IF(OFFSET(DE104_3!$E$35,ROWS($E$35:E54)-1,COLUMNS($E$35:E54)-1)<>\"\",OFFSET(DE104_3!$E$35,ROWS($E$35:E54)-1,COLUMNS($E$35:E54)-1),\"\")","v":""},{"$f":"IF(OFFSET(DE104_3!$F$35,ROWS($F$35:F54)-1,COLUMNS($F$35:F54)-1)<>\"\",OFFSET(DE104_3!$F$35,ROWS($F$35:F54)-1,COLUMNS($F$35:F54)-1),\"\")","v":""},{"$f":"IF(OFFSET(DE104_3!$G$35,ROWS($G$35:G54)-1,COLUMNS($G$35:G54)-1)<>\"\",OFFSET(DE104_3!$G$35,ROWS($G$35:G54)-1,COLUMNS($G$35:G54)-1),\"\")","v":""},{"$f":"IF(OFFSET(DE104_3!$H$35,ROWS($H$35:H54)-1,COLUMNS($H$35:H54)-1)<>\"\",OFFSET(DE104_3!$H$35,ROWS($H$35:H54)-1,COLUMNS($H$35:H54)-1),\"\")","v":""},{"$f":"IF(OFFSET(DE104_3!$I$35,ROWS($I$35:I54)-1,COLUMNS($I$35:I54)-1)<>\"\",OFFSET(DE104_3!$I$35,ROWS($I$35:I54)-1,COLUMNS($I$35:I54)-1),\"\")","v":""},{"$f":"IF(OFFSET(DE104_3!$J$35,ROWS($J$35:J54)-1,COLUMNS($J$35:J54)-1)<>\"\",OFFSET(DE104_3!$J$35,ROWS($J$35:J54)-1,COLUMNS($J$35:J54)-1),\"\")","v":""},{"$f":"IF(OFFSET(DE104_3!$K$35,ROWS($K$35:K54)-1,COLUMNS($K$35:K54)-1)<>\"\",OFFSET(DE104_3!$K$35,ROWS($K$35:K54)-1,COLUMNS($K$35:K54)-1),\"\")","v":""},{"$f":"IF(OFFSET(DE104_3!$L$35,ROWS($L$35:L54)-1,COLUMNS($L$35:L54)-1)<>\"\",OFFSET(DE104_3!$L$35,ROWS($L$35:L54)-1,COLUMNS($L$35:L54)-1),\"\")","v":""},{"$f":"IF(OFFSET(DE104_3!$M$35,ROWS($M$35:M54)-1,COLUMNS($M$35:M54)-1)<>\"\",OFFSET(DE104_3!$M$35,ROWS($M$35:M54)-1,COLUMNS($M$35:M54)-1),\"\")","v":""},{"$f":"IF(OFFSET(DE104_3!$N$35,ROWS($N$35:N54)-1,COLUMNS($N$35:N54)-1)<>\"\",OFFSET(DE104_3!$N$35,ROWS($N$35:N54)-1,COLUMNS($N$35:N54)-1),\"\")","v":""},{"$f":"IF(OFFSET(DE104_3!$O$35,ROWS($O$35:O54)-1,COLUMNS($O$35:O54)-1)<>\"\",OFFSET(DE104_3!$O$35,ROWS($O$35:O54)-1,COLUMNS($O$35:O54)-1),\"\")","v":""},{"$f":"IF(OFFSET(DE104_3!$P$35,ROWS($P$35:P54)-1,COLUMNS($P$35:P54)-1)<>\"\",OFFSET(DE104_3!$P$35,ROWS($P$35:P54)-1,COLUMNS($P$35:P54)-1),\"\")","v":""},{"$f":"IF(OFFSET(DE104_3!$Q$35,ROWS($Q$35:Q54)-1,COLUMNS($Q$35:Q54)-1)<>\"\",OFFSET(DE104_3!$Q$35,ROWS($Q$35:Q54)-1,COLUMNS($Q$35:Q54)-1),\"\")","v":""},{"$f":"IF(OFFSET(DE104_3!$R$35,ROWS($R$35:R54)-1,COLUMNS($R$35:R54)-1)<>\"\",OFFSET(DE104_3!$R$35,ROWS($R$35:R54)-1,COLUMNS($R$35:R54)-1),\"\")","v":""},{"$f":"IF(OFFSET(DE104_3!$S$35,ROWS($S$35:S54)-1,COLUMNS($S$35:S54)-1)<>\"\",OFFSET(DE104_3!$S$35,ROWS($S$35:S54)-1,COLUMNS($S$35:S54)-1),\"\")","v":""},{"$f":"IF(OFFSET(DE104_3!$T$35,ROWS($T$35:T54)-1,COLUMNS($T$35:T54)-1)<>\"\",OFFSET(DE104_3!$T$35,ROWS($T$35:T54)-1,COLUMNS($T$35:T54)-1),\"\")","v":""},{"$f":"IF(OFFSET(DE104_3!$U$35,ROWS($U$35:U54)-1,COLUMNS($U$35:U54)-1)<>\"\",OFFSET(DE104_3!$U$35,ROWS($U$35:U54)-1,COLUMNS($U$35:U54)-1),\"\")","v":""},{"$f":"IF(OFFSET(DE104_3!$V$35,ROWS($V$35:V54)-1,COLUMNS($V$35:V54)-1)<>\"\",OFFSET(DE104_3!$V$35,ROWS($V$35:V54)-1,COLUMNS($V$35:V54)-1),\"\")","v":""},{"$f":"IF(OFFSET(DE104_3!$W$35,ROWS($W$35:W54)-1,COLUMNS($W$35:W54)-1)<>\"\",OFFSET(DE104_3!$W$35,ROWS($W$35:W54)-1,COLUMNS($W$35:W54)-1),\"\")","v":""},{"$f":"IF(OFFSET(DE104_3!$X$35,ROWS($X$35:X54)-1,COLUMNS($X$35:X54)-1)<>\"\",OFFSET(DE104_3!$X$35,ROWS($X$35:X54)-1,COLUMNS($X$35:X54)-1),\"\")","v":""},{"$f":"IF(OFFSET(DE104_3!$Y$35,ROWS($Y$35:Y54)-1,COLUMNS($Y$35:Y54)-1)<>\"\",OFFSET(DE104_3!$Y$35,ROWS($Y$35:Y54)-1,COLUMNS($Y$35:Y54)-1),\"\")","v":""},{"$f":"IF(OFFSET(DE104_3!$Z$35,ROWS($Z$35:Z54)-1,COLUMNS($Z$35:Z54)-1)<>\"\",OFFSET(DE104_3!$Z$35,ROWS($Z$35:Z54)-1,COLUMNS($Z$35:Z54)-1),\"\")","v":""},{"$f":"IF(OFFSET(DE104_3!$AA$35,ROWS($AA$35:AA54)-1,COLUMNS($AA$35:AA54)-1)<>\"\",OFFSET(DE104_3!$AA$35,ROWS($AA$35:AA54)-1,COLUMNS($AA$35:AA54)-1),\"\")","v":""},{"$f":"IF(OFFSET(DE104_3!$AB$35,ROWS($AB$35:AB54)-1,COLUMNS($AB$35:AB54)-1)<>\"\",OFFSET(DE104_3!$AB$35,ROWS($AB$35:AB54)-1,COLUMNS($AB$35:AB54)-1),\"\")","v":""},{"$f":"IF(OFFSET(DE104_3!$AC$35,ROWS($AC$35:AC54)-1,COLUMNS($AC$35:AC54)-1)<>\"\",OFFSET(DE104_3!$AC$35,ROWS($AC$35:AC54)-1,COLUMNS($AC$35:AC54)-1),\"\")","v":""},{"$f":"IF(OFFSET(DE104_3!$AD$35,ROWS($AD$35:AD54)-1,COLUMNS($AD$35:AD54)-1)<>\"\",OFFSET(DE104_3!$AD$35,ROWS($AD$35:AD54)-1,COLUMNS($AD$35:AD54)-1),\"\")","v":""},{"$f":"IF(OFFSET(DE104_3!$AE$35,ROWS($AE$35:AE54)-1,COLUMNS($AE$35:AE54)-1)<>\"\",OFFSET(DE104_3!$AE$35,ROWS($AE$35:AE54)-1,COLUMNS($AE$35:AE54)-1),\"\")","v":""},{"$f":"IF(OFFSET(DE104_3!$AF$35,ROWS($AF$35:AF54)-1,COLUMNS($AF$35:AF54)-1)<>\"\",OFFSET(DE104_3!$AF$35,ROWS($AF$35:AF54)-1,COLUMNS($AF$35:AF54)-1),\"\")","v":""},{"$f":"IF(OFFSET(DE104_3!$AG$35,ROWS($AG$35:AG54)-1,COLUMNS($AG$35:AG54)-1)<>\"\",OFFSET(DE104_3!$AG$35,ROWS($AG$35:AG54)-1,COLUMNS($AG$35:AG54)-1),\"\")","v":""},{"$f":"IF(OFFSET(DE104_3!$AH$35,ROWS($AH$35:AH54)-1,COLUMNS($AH$35:AH54)-1)<>\"\",OFFSET(DE104_3!$AH$35,ROWS($AH$35:AH54)-1,COLUMNS($AH$35:AH54)-1),\"\")","v":""},{"$f":"IF(OFFSET(DE104_3!$AI$35,ROWS($AI$35:AI54)-1,COLUMNS($AI$35:AI54)-1)<>\"\",OFFSET(DE104_3!$AI$35,ROWS($AI$35:AI54)-1,COLUMNS($AI$35:AI54)-1),\"\")","v":""},{"$f":"IF(OFFSET(DE104_3!$AJ$35,ROWS($AJ$35:AJ54)-1,COLUMNS($AJ$35:AJ54)-1)<>\"\",OFFSET(DE104_3!$AJ$35,ROWS($AJ$35:AJ54)-1,COLUMNS($AJ$35:AJ54)-1),\"\")","v":""},{"$f":"IF(OFFSET(DE104_3!$AK$35,ROWS($AK$35:AK54)-1,COLUMNS($AK$35:AK54)-1)<>\"\",OFFSET(DE104_3!$AK$35,ROWS($AK$35:AK54)-1,COLUMNS($AK$35:AK54)-1),\"\")","v":""},{"$f":"IF(OFFSET(DE104_3!$AL$35,ROWS($AL$35:AL54)-1,COLUMNS($AL$35:AL54)-1)<>\"\",OFFSET(DE104_3!$AL$35,ROWS($AL$35:AL54)-1,COLUMNS($AL$35:AL54)-1),\"\")","v":""},{"$f":"IF(OFFSET(DE104_3!$AM$35,ROWS($AM$35:AM54)-1,COLUMNS($AM$35:AM54)-1)<>\"\",OFFSET(DE104_3!$AM$35,ROWS($AM$35:AM54)-1,COLUMNS($AM$35:AM54)-1),\"\")","v":""},{"$f":"IF(OFFSET(DE104_3!$AN$35,ROWS($AN$35:AN54)-1,COLUMNS($AN$35:AN54)-1)<>\"\",OFFSET(DE104_3!$AN$35,ROWS($AN$35:AN54)-1,COLUMNS($AN$35:AN54)-1),\"\")","v":""},{"$f":"IF(OFFSET(DE104_3!$AO$35,ROWS($AO$35:AO54)-1,COLUMNS($AO$35:AO54)-1)<>\"\",OFFSET(DE104_3!$AO$35,ROWS($AO$35:AO54)-1,COLUMNS($AO$35:AO54)-1),\"\")","v":""},{"$f":"IF(OFFSET(DE104_3!$AP$35,ROWS($AP$35:AP54)-1,COLUMNS($AP$35:AP54)-1)<>\"\",OFFSET(DE104_3!$AP$35,ROWS($AP$35:AP54)-1,COLUMNS($AP$35:AP54)-1),\"\")","v":""},{"$f":"IF(OFFSET(DE104_3!$AQ$35,ROWS($AQ$35:AQ54)-1,COLUMNS($AQ$35:AQ54)-1)<>\"\",OFFSET(DE104_3!$AQ$35,ROWS($AQ$35:AQ54)-1,COLUMNS($AQ$35:AQ54)-1),\"\")","v":""}]
[{"$f":"IF(OFFSET(DE104_3!$C$35,ROWS($C$35:C55)-1,COLUMNS($C$35:C55)-1)<>\"\",OFFSET(DE104_3!$C$35,ROWS($C$35:C55)-1,COLUMNS($C$35:C55)-1),\"\")","v":""},{"$f":"IF(OFFSET(DE104_3!$D$35,ROWS($D$35:D55)-1,COLUMNS($D$35:D55)-1)<>\"\",OFFSET(DE104_3!$D$35,ROWS($D$35:D55)-1,COLUMNS($D$35:D55)-1),\"\")","v":""},{"$f":"IF(OFFSET(DE104_3!$E$35,ROWS($E$35:E55)-1,COLUMNS($E$35:E55)-1)<>\"\",OFFSET(DE104_3!$E$35,ROWS($E$35:E55)-1,COLUMNS($E$35:E55)-1),\"\")","v":""},{"$f":"IF(OFFSET(DE104_3!$F$35,ROWS($F$35:F55)-1,COLUMNS($F$35:F55)-1)<>\"\",OFFSET(DE104_3!$F$35,ROWS($F$35:F55)-1,COLUMNS($F$35:F55)-1),\"\")","v":""},{"$f":"IF(OFFSET(DE104_3!$G$35,ROWS($G$35:G55)-1,COLUMNS($G$35:G55)-1)<>\"\",OFFSET(DE104_3!$G$35,ROWS($G$35:G55)-1,COLUMNS($G$35:G55)-1),\"\")","v":""},{"$f":"IF(OFFSET(DE104_3!$H$35,ROWS($H$35:H55)-1,COLUMNS($H$35:H55)-1)<>\"\",OFFSET(DE104_3!$H$35,ROWS($H$35:H55)-1,COLUMNS($H$35:H55)-1),\"\")","v":""},{"$f":"IF(OFFSET(DE104_3!$I$35,ROWS($I$35:I55)-1,COLUMNS($I$35:I55)-1)<>\"\",OFFSET(DE104_3!$I$35,ROWS($I$35:I55)-1,COLUMNS($I$35:I55)-1),\"\")","v":""},{"$f":"IF(OFFSET(DE104_3!$J$35,ROWS($J$35:J55)-1,COLUMNS($J$35:J55)-1)<>\"\",OFFSET(DE104_3!$J$35,ROWS($J$35:J55)-1,COLUMNS($J$35:J55)-1),\"\")","v":""},{"$f":"IF(OFFSET(DE104_3!$K$35,ROWS($K$35:K55)-1,COLUMNS($K$35:K55)-1)<>\"\",OFFSET(DE104_3!$K$35,ROWS($K$35:K55)-1,COLUMNS($K$35:K55)-1),\"\")","v":""},{"$f":"IF(OFFSET(DE104_3!$L$35,ROWS($L$35:L55)-1,COLUMNS($L$35:L55)-1)<>\"\",OFFSET(DE104_3!$L$35,ROWS($L$35:L55)-1,COLUMNS($L$35:L55)-1),\"\")","v":""},{"$f":"IF(OFFSET(DE104_3!$M$35,ROWS($M$35:M55)-1,COLUMNS($M$35:M55)-1)<>\"\",OFFSET(DE104_3!$M$35,ROWS($M$35:M55)-1,COLUMNS($M$35:M55)-1),\"\")","v":""},{"$f":"IF(OFFSET(DE104_3!$N$35,ROWS($N$35:N55)-1,COLUMNS($N$35:N55)-1)<>\"\",OFFSET(DE104_3!$N$35,ROWS($N$35:N55)-1,COLUMNS($N$35:N55)-1),\"\")","v":""},{"$f":"IF(OFFSET(DE104_3!$O$35,ROWS($O$35:O55)-1,COLUMNS($O$35:O55)-1)<>\"\",OFFSET(DE104_3!$O$35,ROWS($O$35:O55)-1,COLUMNS($O$35:O55)-1),\"\")","v":""},{"$f":"IF(OFFSET(DE104_3!$P$35,ROWS($P$35:P55)-1,COLUMNS($P$35:P55)-1)<>\"\",OFFSET(DE104_3!$P$35,ROWS($P$35:P55)-1,COLUMNS($P$35:P55)-1),\"\")","v":""},{"$f":"IF(OFFSET(DE104_3!$Q$35,ROWS($Q$35:Q55)-1,COLUMNS($Q$35:Q55)-1)<>\"\",OFFSET(DE104_3!$Q$35,ROWS($Q$35:Q55)-1,COLUMNS($Q$35:Q55)-1),\"\")","v":""},{"$f":"IF(OFFSET(DE104_3!$R$35,ROWS($R$35:R55)-1,COLUMNS($R$35:R55)-1)<>\"\",OFFSET(DE104_3!$R$35,ROWS($R$35:R55)-1,COLUMNS($R$35:R55)-1),\"\")","v":""},{"$f":"IF(OFFSET(DE104_3!$S$35,ROWS($S$35:S55)-1,COLUMNS($S$35:S55)-1)<>\"\",OFFSET(DE104_3!$S$35,ROWS($S$35:S55)-1,COLUMNS($S$35:S55)-1),\"\")","v":""},{"$f":"IF(OFFSET(DE104_3!$T$35,ROWS($T$35:T55)-1,COLUMNS($T$35:T55)-1)<>\"\",OFFSET(DE104_3!$T$35,ROWS($T$35:T55)-1,COLUMNS($T$35:T55)-1),\"\")","v":""},{"$f":"IF(OFFSET(DE104_3!$U$35,ROWS($U$35:U55)-1,COLUMNS($U$35:U55)-1)<>\"\",OFFSET(DE104_3!$U$35,ROWS($U$35:U55)-1,COLUMNS($U$35:U55)-1),\"\")","v":""},{"$f":"IF(OFFSET(DE104_3!$V$35,ROWS($V$35:V55)-1,COLUMNS($V$35:V55)-1)<>\"\",OFFSET(DE104_3!$V$35,ROWS($V$35:V55)-1,COLUMNS($V$35:V55)-1),\"\")","v":""},{"$f":"IF(OFFSET(DE104_3!$W$35,ROWS($W$35:W55)-1,COLUMNS($W$35:W55)-1)<>\"\",OFFSET(DE104_3!$W$35,ROWS($W$35:W55)-1,COLUMNS($W$35:W55)-1),\"\")","v":""},{"$f":"IF(OFFSET(DE104_3!$X$35,ROWS($X$35:X55)-1,COLUMNS($X$35:X55)-1)<>\"\",OFFSET(DE104_3!$X$35,ROWS($X$35:X55)-1,COLUMNS($X$35:X55)-1),\"\")","v":""},{"$f":"IF(OFFSET(DE104_3!$Y$35,ROWS($Y$35:Y55)-1,COLUMNS($Y$35:Y55)-1)<>\"\",OFFSET(DE104_3!$Y$35,ROWS($Y$35:Y55)-1,COLUMNS($Y$35:Y55)-1),\"\")","v":""},{"$f":"IF(OFFSET(DE104_3!$Z$35,ROWS($Z$35:Z55)-1,COLUMNS($Z$35:Z55)-1)<>\"\",OFFSET(DE104_3!$Z$35,ROWS($Z$35:Z55)-1,COLUMNS($Z$35:Z55)-1),\"\")","v":""},{"$f":"IF(OFFSET(DE104_3!$AA$35,ROWS($AA$35:AA55)-1,COLUMNS($AA$35:AA55)-1)<>\"\",OFFSET(DE104_3!$AA$35,ROWS($AA$35:AA55)-1,COLUMNS($AA$35:AA55)-1),\"\")","v":""},{"$f":"IF(OFFSET(DE104_3!$AB$35,ROWS($AB$35:AB55)-1,COLUMNS($AB$35:AB55)-1)<>\"\",OFFSET(DE104_3!$AB$35,ROWS($AB$35:AB55)-1,COLUMNS($AB$35:AB55)-1),\"\")","v":""},{"$f":"IF(OFFSET(DE104_3!$AC$35,ROWS($AC$35:AC55)-1,COLUMNS($AC$35:AC55)-1)<>\"\",OFFSET(DE104_3!$AC$35,ROWS($AC$35:AC55)-1,COLUMNS($AC$35:AC55)-1),\"\")","v":""},{"$f":"IF(OFFSET(DE104_3!$AD$35,ROWS($AD$35:AD55)-1,COLUMNS($AD$35:AD55)-1)<>\"\",OFFSET(DE104_3!$AD$35,ROWS($AD$35:AD55)-1,COLUMNS($AD$35:AD55)-1),\"\")","v":""},{"$f":"IF(OFFSET(DE104_3!$AE$35,ROWS($AE$35:AE55)-1,COLUMNS($AE$35:AE55)-1)<>\"\",OFFSET(DE104_3!$AE$35,ROWS($AE$35:AE55)-1,COLUMNS($AE$35:AE55)-1),\"\")","v":""},{"$f":"IF(OFFSET(DE104_3!$AF$35,ROWS($AF$35:AF55)-1,COLUMNS($AF$35:AF55)-1)<>\"\",OFFSET(DE104_3!$AF$35,ROWS($AF$35:AF55)-1,COLUMNS($AF$35:AF55)-1),\"\")","v":""},{"$f":"IF(OFFSET(DE104_3!$AG$35,ROWS($AG$35:AG55)-1,COLUMNS($AG$35:AG55)-1)<>\"\",OFFSET(DE104_3!$AG$35,ROWS($AG$35:AG55)-1,COLUMNS($AG$35:AG55)-1),\"\")","v":""},{"$f":"IF(OFFSET(DE104_3!$AH$35,ROWS($AH$35:AH55)-1,COLUMNS($AH$35:AH55)-1)<>\"\",OFFSET(DE104_3!$AH$35,ROWS($AH$35:AH55)-1,COLUMNS($AH$35:AH55)-1),\"\")","v":""},{"$f":"IF(OFFSET(DE104_3!$AI$35,ROWS($AI$35:AI55)-1,COLUMNS($AI$35:AI55)-1)<>\"\",OFFSET(DE104_3!$AI$35,ROWS($AI$35:AI55)-1,COLUMNS($AI$35:AI55)-1),\"\")","v":""},{"$f":"IF(OFFSET(DE104_3!$AJ$35,ROWS($AJ$35:AJ55)-1,COLUMNS($AJ$35:AJ55)-1)<>\"\",OFFSET(DE104_3!$AJ$35,ROWS($AJ$35:AJ55)-1,COLUMNS($AJ$35:AJ55)-1),\"\")","v":""},{"$f":"IF(OFFSET(DE104_3!$AK$35,ROWS($AK$35:AK55)-1,COLUMNS($AK$35:AK55)-1)<>\"\",OFFSET(DE104_3!$AK$35,ROWS($AK$35:AK55)-1,COLUMNS($AK$35:AK55)-1),\"\")","v":""},{"$f":"IF(OFFSET(DE104_3!$AL$35,ROWS($AL$35:AL55)-1,COLUMNS($AL$35:AL55)-1)<>\"\",OFFSET(DE104_3!$AL$35,ROWS($AL$35:AL55)-1,COLUMNS($AL$35:AL55)-1),\"\")","v":""},{"$f":"IF(OFFSET(DE104_3!$AM$35,ROWS($AM$35:AM55)-1,COLUMNS($AM$35:AM55)-1)<>\"\",OFFSET(DE104_3!$AM$35,ROWS($AM$35:AM55)-1,COLUMNS($AM$35:AM55)-1),\"\")","v":""},{"$f":"IF(OFFSET(DE104_3!$AN$35,ROWS($AN$35:AN55)-1,COLUMNS($AN$35:AN55)-1)<>\"\",OFFSET(DE104_3!$AN$35,ROWS($AN$35:AN55)-1,COLUMNS($AN$35:AN55)-1),\"\")","v":""},{"$f":"IF(OFFSET(DE104_3!$AO$35,ROWS($AO$35:AO55)-1,COLUMNS($AO$35:AO55)-1)<>\"\",OFFSET(DE104_3!$AO$35,ROWS($AO$35:AO55)-1,COLUMNS($AO$35:AO55)-1),\"\")","v":""},{"$f":"IF(OFFSET(DE104_3!$AP$35,ROWS($AP$35:AP55)-1,COLUMNS($AP$35:AP55)-1)<>\"\",OFFSET(DE104_3!$AP$35,ROWS($AP$35:AP55)-1,COLUMNS($AP$35:AP55)-1),\"\")","v":""},{"$f":"IF(OFFSET(DE104_3!$AQ$35,ROWS($AQ$35:AQ55)-1,COLUMNS($AQ$35:AQ55)-1)<>\"\",OFFSET(DE104_3!$AQ$35,ROWS($AQ$35:AQ55)-1,COLUMNS($AQ$35:AQ55)-1),\"\")","v":""}]
[{"$f":"IF(OFFSET(DE104_3!$C$35,ROWS($C$35:C56)-1,COLUMNS($C$35:C56)-1)<>\"\",OFFSET(DE104_3!$C$35,ROWS($C$35:C56)-1,COLUMNS($C$35:C56)-1),\"\")","v":""},{"$f":"IF(OFFSET(DE104_3!$D$35,ROWS($D$35:D56)-1,COLUMNS($D$35:D56)-1)<>\"\",OFFSET(DE104_3!$D$35,ROWS($D$35:D56)-1,COLUMNS($D$35:D56)-1),\"\")","v":""},{"$f":"IF(OFFSET(DE104_3!$E$35,ROWS($E$35:E56)-1,COLUMNS($E$35:E56)-1)<>\"\",OFFSET(DE104_3!$E$35,ROWS($E$35:E56)-1,COLUMNS($E$35:E56)-1),\"\")","v":""},{"$f":"IF(OFFSET(DE104_3!$F$35,ROWS($F$35:F56)-1,COLUMNS($F$35:F56)-1)<>\"\",OFFSET(DE104_3!$F$35,ROWS($F$35:F56)-1,COLUMNS($F$35:F56)-1),\"\")","v":""},{"$f":"IF(OFFSET(DE104_3!$G$35,ROWS($G$35:G56)-1,COLUMNS($G$35:G56)-1)<>\"\",OFFSET(DE104_3!$G$35,ROWS($G$35:G56)-1,COLUMNS($G$35:G56)-1),\"\")","v":""},{"$f":"IF(OFFSET(DE104_3!$H$35,ROWS($H$35:H56)-1,COLUMNS($H$35:H56)-1)<>\"\",OFFSET(DE104_3!$H$35,ROWS($H$35:H56)-1,COLUMNS($H$35:H56)-1),\"\")","v":""},{"$f":"IF(OFFSET(DE104_3!$I$35,ROWS($I$35:I56)-1,COLUMNS($I$35:I56)-1)<>\"\",OFFSET(DE104_3!$I$35,ROWS($I$35:I56)-1,COLUMNS($I$35:I56)-1),\"\")","v":""},{"$f":"IF(OFFSET(DE104_3!$J$35,ROWS($J$35:J56)-1,COLUMNS($J$35:J56)-1)<>\"\",OFFSET(DE104_3!$J$35,ROWS($J$35:J56)-1,COLUMNS($J$35:J56)-1),\"\")","v":""},{"$f":"IF(OFFSET(DE104_3!$K$35,ROWS($K$35:K56)-1,COLUMNS($K$35:K56)-1)<>\"\",OFFSET(DE104_3!$K$35,ROWS($K$35:K56)-1,COLUMNS($K$35:K56)-1),\"\")","v":""},{"$f":"IF(OFFSET(DE104_3!$L$35,ROWS($L$35:L56)-1,COLUMNS($L$35:L56)-1)<>\"\",OFFSET(DE104_3!$L$35,ROWS($L$35:L56)-1,COLUMNS($L$35:L56)-1),\"\")","v":""},{"$f":"IF(OFFSET(DE104_3!$M$35,ROWS($M$35:M56)-1,COLUMNS($M$35:M56)-1)<>\"\",OFFSET(DE104_3!$M$35,ROWS($M$35:M56)-1,COLUMNS($M$35:M56)-1),\"\")","v":""},{"$f":"IF(OFFSET(DE104_3!$N$35,ROWS($N$35:N56)-1,COLUMNS($N$35:N56)-1)<>\"\",OFFSET(DE104_3!$N$35,ROWS($N$35:N56)-1,COLUMNS($N$35:N56)-1),\"\")","v":""},{"$f":"IF(OFFSET(DE104_3!$O$35,ROWS($O$35:O56)-1,COLUMNS($O$35:O56)-1)<>\"\",OFFSET(DE104_3!$O$35,ROWS($O$35:O56)-1,COLUMNS($O$35:O56)-1),\"\")","v":""},{"$f":"IF(OFFSET(DE104_3!$P$35,ROWS($P$35:P56)-1,COLUMNS($P$35:P56)-1)<>\"\",OFFSET(DE104_3!$P$35,ROWS($P$35:P56)-1,COLUMNS($P$35:P56)-1),\"\")","v":""},{"$f":"IF(OFFSET(DE104_3!$Q$35,ROWS($Q$35:Q56)-1,COLUMNS($Q$35:Q56)-1)<>\"\",OFFSET(DE104_3!$Q$35,ROWS($Q$35:Q56)-1,COLUMNS($Q$35:Q56)-1),\"\")","v":""},{"$f":"IF(OFFSET(DE104_3!$R$35,ROWS($R$35:R56)-1,COLUMNS($R$35:R56)-1)<>\"\",OFFSET(DE104_3!$R$35,ROWS($R$35:R56)-1,COLUMNS($R$35:R56)-1),\"\")","v":""},{"$f":"IF(OFFSET(DE104_3!$S$35,ROWS($S$35:S56)-1,COLUMNS($S$35:S56)-1)<>\"\",OFFSET(DE104_3!$S$35,ROWS($S$35:S56)-1,COLUMNS($S$35:S56)-1),\"\")","v":""},{"$f":"IF(OFFSET(DE104_3!$T$35,ROWS($T$35:T56)-1,COLUMNS($T$35:T56)-1)<>\"\",OFFSET(DE104_3!$T$35,ROWS($T$35:T56)-1,COLUMNS($T$35:T56)-1),\"\")","v":""},{"$f":"IF(OFFSET(DE104_3!$U$35,ROWS($U$35:U56)-1,COLUMNS($U$35:U56)-1)<>\"\",OFFSET(DE104_3!$U$35,ROWS($U$35:U56)-1,COLUMNS($U$35:U56)-1),\"\")","v":""},{"$f":"IF(OFFSET(DE104_3!$V$35,ROWS($V$35:V56)-1,COLUMNS($V$35:V56)-1)<>\"\",OFFSET(DE104_3!$V$35,ROWS($V$35:V56)-1,COLUMNS($V$35:V56)-1),\"\")","v":""},{"$f":"IF(OFFSET(DE104_3!$W$35,ROWS($W$35:W56)-1,COLUMNS($W$35:W56)-1)<>\"\",OFFSET(DE104_3!$W$35,ROWS($W$35:W56)-1,COLUMNS($W$35:W56)-1),\"\")","v":""},{"$f":"IF(OFFSET(DE104_3!$X$35,ROWS($X$35:X56)-1,COLUMNS($X$35:X56)-1)<>\"\",OFFSET(DE104_3!$X$35,ROWS($X$35:X56)-1,COLUMNS($X$35:X56)-1),\"\")","v":""},{"$f":"IF(OFFSET(DE104_3!$Y$35,ROWS($Y$35:Y56)-1,COLUMNS($Y$35:Y56)-1)<>\"\",OFFSET(DE104_3!$Y$35,ROWS($Y$35:Y56)-1,COLUMNS($Y$35:Y56)-1),\"\")","v":""},{"$f":"IF(OFFSET(DE104_3!$Z$35,ROWS($Z$35:Z56)-1,COLUMNS($Z$35:Z56)-1)<>\"\",OFFSET(DE104_3!$Z$35,ROWS($Z$35:Z56)-1,COLUMNS($Z$35:Z56)-1),\"\")","v":""},{"$f":"IF(OFFSET(DE104_3!$AA$35,ROWS($AA$35:AA56)-1,COLUMNS($AA$35:AA56)-1)<>\"\",OFFSET(DE104_3!$AA$35,ROWS($AA$35:AA56)-1,COLUMNS($AA$35:AA56)-1),\"\")","v":""},{"$f":"IF(OFFSET(DE104_3!$AB$35,ROWS($AB$35:AB56)-1,COLUMNS($AB$35:AB56)-1)<>\"\",OFFSET(DE104_3!$AB$35,ROWS($AB$35:AB56)-1,COLUMNS($AB$35:AB56)-1),\"\")","v":""},{"$f":"IF(OFFSET(DE104_3!$AC$35,ROWS($AC$35:AC56)-1,COLUMNS($AC$35:AC56)-1)<>\"\",OFFSET(DE104_3!$AC$35,ROWS($AC$35:AC56)-1,COLUMNS($AC$35:AC56)-1),\"\")","v":""},{"$f":"IF(OFFSET(DE104_3!$AD$35,ROWS($AD$35:AD56)-1,COLUMNS($AD$35:AD56)-1)<>\"\",OFFSET(DE104_3!$AD$35,ROWS($AD$35:AD56)-1,COLUMNS($AD$35:AD56)-1),\"\")","v":""},{"$f":"IF(OFFSET(DE104_3!$AE$35,ROWS($AE$35:AE56)-1,COLUMNS($AE$35:AE56)-1)<>\"\",OFFSET(DE104_3!$AE$35,ROWS($AE$35:AE56)-1,COLUMNS($AE$35:AE56)-1),\"\")","v":""},{"$f":"IF(OFFSET(DE104_3!$AF$35,ROWS($AF$35:AF56)-1,COLUMNS($AF$35:AF56)-1)<>\"\",OFFSET(DE104_3!$AF$35,ROWS($AF$35:AF56)-1,COLUMNS($AF$35:AF56)-1),\"\")","v":""},{"$f":"IF(OFFSET(DE104_3!$AG$35,ROWS($AG$35:AG56)-1,COLUMNS($AG$35:AG56)-1)<>\"\",OFFSET(DE104_3!$AG$35,ROWS($AG$35:AG56)-1,COLUMNS($AG$35:AG56)-1),\"\")","v":""},{"$f":"IF(OFFSET(DE104_3!$AH$35,ROWS($AH$35:AH56)-1,COLUMNS($AH$35:AH56)-1)<>\"\",OFFSET(DE104_3!$AH$35,ROWS($AH$35:AH56)-1,COLUMNS($AH$35:AH56)-1),\"\")","v":""},{"$f":"IF(OFFSET(DE104_3!$AI$35,ROWS($AI$35:AI56)-1,COLUMNS($AI$35:AI56)-1)<>\"\",OFFSET(DE104_3!$AI$35,ROWS($AI$35:AI56)-1,COLUMNS($AI$35:AI56)-1),\"\")","v":""},{"$f":"IF(OFFSET(DE104_3!$AJ$35,ROWS($AJ$35:AJ56)-1,COLUMNS($AJ$35:AJ56)-1)<>\"\",OFFSET(DE104_3!$AJ$35,ROWS($AJ$35:AJ56)-1,COLUMNS($AJ$35:AJ56)-1),\"\")","v":""},{"$f":"IF(OFFSET(DE104_3!$AK$35,ROWS($AK$35:AK56)-1,COLUMNS($AK$35:AK56)-1)<>\"\",OFFSET(DE104_3!$AK$35,ROWS($AK$35:AK56)-1,COLUMNS($AK$35:AK56)-1),\"\")","v":""},{"$f":"IF(OFFSET(DE104_3!$AL$35,ROWS($AL$35:AL56)-1,COLUMNS($AL$35:AL56)-1)<>\"\",OFFSET(DE104_3!$AL$35,ROWS($AL$35:AL56)-1,COLUMNS($AL$35:AL56)-1),\"\")","v":""},{"$f":"IF(OFFSET(DE104_3!$AM$35,ROWS($AM$35:AM56)-1,COLUMNS($AM$35:AM56)-1)<>\"\",OFFSET(DE104_3!$AM$35,ROWS($AM$35:AM56)-1,COLUMNS($AM$35:AM56)-1),\"\")","v":""},{"$f":"IF(OFFSET(DE104_3!$AN$35,ROWS($AN$35:AN56)-1,COLUMNS($AN$35:AN56)-1)<>\"\",OFFSET(DE104_3!$AN$35,ROWS($AN$35:AN56)-1,COLUMNS($AN$35:AN56)-1),\"\")","v":""},{"$f":"IF(OFFSET(DE104_3!$AO$35,ROWS($AO$35:AO56)-1,COLUMNS($AO$35:AO56)-1)<>\"\",OFFSET(DE104_3!$AO$35,ROWS($AO$35:AO56)-1,COLUMNS($AO$35:AO56)-1),\"\")","v":""},{"$f":"IF(OFFSET(DE104_3!$AP$35,ROWS($AP$35:AP56)-1,COLUMNS($AP$35:AP56)-1)<>\"\",OFFSET(DE104_3!$AP$35,ROWS($AP$35:AP56)-1,COLUMNS($AP$35:AP56)-1),\"\")","v":""},{"$f":"IF(OFFSET(DE104_3!$AQ$35,ROWS($AQ$35:AQ56)-1,COLUMNS($AQ$35:AQ56)-1)<>\"\",OFFSET(DE104_3!$AQ$35,ROWS($AQ$35:AQ56)-1,COLUMNS($AQ$35:AQ56)-1),\"\")","v":""}]
[{"$f":"IF(OFFSET(DE104_3!$C$35,ROWS($C$35:C57)-1,COLUMNS($C$35:C57)-1)<>\"\",OFFSET(DE104_3!$C$35,ROWS($C$35:C57)-1,COLUMNS($C$35:C57)-1),\"\")","v":""},{"$f":"IF(OFFSET(DE104_3!$D$35,ROWS($D$35:D57)-1,COLUMNS($D$35:D57)-1)<>\"\",OFFSET(DE104_3!$D$35,ROWS($D$35:D57)-1,COLUMNS($D$35:D57)-1),\"\")","v":""},{"$f":"IF(OFFSET(DE104_3!$E$35,ROWS($E$35:E57)-1,COLUMNS($E$35:E57)-1)<>\"\",OFFSET(DE104_3!$E$35,ROWS($E$35:E57)-1,COLUMNS($E$35:E57)-1),\"\")","v":""},{"$f":"IF(OFFSET(DE104_3!$F$35,ROWS($F$35:F57)-1,COLUMNS($F$35:F57)-1)<>\"\",OFFSET(DE104_3!$F$35,ROWS($F$35:F57)-1,COLUMNS($F$35:F57)-1),\"\")","v":""},{"$f":"IF(OFFSET(DE104_3!$G$35,ROWS($G$35:G57)-1,COLUMNS($G$35:G57)-1)<>\"\",OFFSET(DE104_3!$G$35,ROWS($G$35:G57)-1,COLUMNS($G$35:G57)-1),\"\")","v":""},{"$f":"IF(OFFSET(DE104_3!$H$35,ROWS($H$35:H57)-1,COLUMNS($H$35:H57)-1)<>\"\",OFFSET(DE104_3!$H$35,ROWS($H$35:H57)-1,COLUMNS($H$35:H57)-1),\"\")","v":""},{"$f":"IF(OFFSET(DE104_3!$I$35,ROWS($I$35:I57)-1,COLUMNS($I$35:I57)-1)<>\"\",OFFSET(DE104_3!$I$35,ROWS($I$35:I57)-1,COLUMNS($I$35:I57)-1),\"\")","v":""},{"$f":"IF(OFFSET(DE104_3!$J$35,ROWS($J$35:J57)-1,COLUMNS($J$35:J57)-1)<>\"\",OFFSET(DE104_3!$J$35,ROWS($J$35:J57)-1,COLUMNS($J$35:J57)-1),\"\")","v":""},{"$f":"IF(OFFSET(DE104_3!$K$35,ROWS($K$35:K57)-1,COLUMNS($K$35:K57)-1)<>\"\",OFFSET(DE104_3!$K$35,ROWS($K$35:K57)-1,COLUMNS($K$35:K57)-1),\"\")","v":""},{"$f":"IF(OFFSET(DE104_3!$L$35,ROWS($L$35:L57)-1,COLUMNS($L$35:L57)-1)<>\"\",OFFSET(DE104_3!$L$35,ROWS($L$35:L57)-1,COLUMNS($L$35:L57)-1),\"\")","v":""},{"$f":"IF(OFFSET(DE104_3!$M$35,ROWS($M$35:M57)-1,COLUMNS($M$35:M57)-1)<>\"\",OFFSET(DE104_3!$M$35,ROWS($M$35:M57)-1,COLUMNS($M$35:M57)-1),\"\")","v":""},{"$f":"IF(OFFSET(DE104_3!$N$35,ROWS($N$35:N57)-1,COLUMNS($N$35:N57)-1)<>\"\",OFFSET(DE104_3!$N$35,ROWS($N$35:N57)-1,COLUMNS($N$35:N57)-1),\"\")","v":""},{"$f":"IF(OFFSET(DE104_3!$O$35,ROWS($O$35:O57)-1,COLUMNS($O$35:O57)-1)<>\"\",OFFSET(DE104_3!$O$35,ROWS($O$35:O57)-1,COLUMNS($O$35:O57)-1),\"\")","v":""},{"$f":"IF(OFFSET(DE104_3!$P$35,ROWS($P$35:P57)-1,COLUMNS($P$35:P57)-1)<>\"\",OFFSET(DE104_3!$P$35,ROWS($P$35:P57)-1,COLUMNS($P$35:P57)-1),\"\")","v":""},{"$f":"IF(OFFSET(DE104_3!$Q$35,ROWS($Q$35:Q57)-1,COLUMNS($Q$35:Q57)-1)<>\"\",OFFSET(DE104_3!$Q$35,ROWS($Q$35:Q57)-1,COLUMNS($Q$35:Q57)-1),\"\")","v":""},{"$f":"IF(OFFSET(DE104_3!$R$35,ROWS($R$35:R57)-1,COLUMNS($R$35:R57)-1)<>\"\",OFFSET(DE104_3!$R$35,ROWS($R$35:R57)-1,COLUMNS($R$35:R57)-1),\"\")","v":""},{"$f":"IF(OFFSET(DE104_3!$S$35,ROWS($S$35:S57)-1,COLUMNS($S$35:S57)-1)<>\"\",OFFSET(DE104_3!$S$35,ROWS($S$35:S57)-1,COLUMNS($S$35:S57)-1),\"\")","v":""},{"$f":"IF(OFFSET(DE104_3!$T$35,ROWS($T$35:T57)-1,COLUMNS($T$35:T57)-1)<>\"\",OFFSET(DE104_3!$T$35,ROWS($T$35:T57)-1,COLUMNS($T$35:T57)-1),\"\")","v":""},{"$f":"IF(OFFSET(DE104_3!$U$35,ROWS($U$35:U57)-1,COLUMNS($U$35:U57)-1)<>\"\",OFFSET(DE104_3!$U$35,ROWS($U$35:U57)-1,COLUMNS($U$35:U57)-1),\"\")","v":""},{"$f":"IF(OFFSET(DE104_3!$V$35,ROWS($V$35:V57)-1,COLUMNS($V$35:V57)-1)<>\"\",OFFSET(DE104_3!$V$35,ROWS($V$35:V57)-1,COLUMNS($V$35:V57)-1),\"\")","v":""},{"$f":"IF(OFFSET(DE104_3!$W$35,ROWS($W$35:W57)-1,COLUMNS($W$35:W57)-1)<>\"\",OFFSET(DE104_3!$W$35,ROWS($W$35:W57)-1,COLUMNS($W$35:W57)-1),\"\")","v":""},{"$f":"IF(OFFSET(DE104_3!$X$35,ROWS($X$35:X57)-1,COLUMNS($X$35:X57)-1)<>\"\",OFFSET(DE104_3!$X$35,ROWS($X$35:X57)-1,COLUMNS($X$35:X57)-1),\"\")","v":""},{"$f":"IF(OFFSET(DE104_3!$Y$35,ROWS($Y$35:Y57)-1,COLUMNS($Y$35:Y57)-1)<>\"\",OFFSET(DE104_3!$Y$35,ROWS($Y$35:Y57)-1,COLUMNS($Y$35:Y57)-1),\"\")","v":""},{"$f":"IF(OFFSET(DE104_3!$Z$35,ROWS($Z$35:Z57)-1,COLUMNS($Z$35:Z57)-1)<>\"\",OFFSET(DE104_3!$Z$35,ROWS($Z$35:Z57)-1,COLUMNS($Z$35:Z57)-1),\"\")","v":""},{"$f":"IF(OFFSET(DE104_3!$AA$35,ROWS($AA$35:AA57)-1,COLUMNS($AA$35:AA57)-1)<>\"\",OFFSET(DE104_3!$AA$35,ROWS($AA$35:AA57)-1,COLUMNS($AA$35:AA57)-1),\"\")","v":""},{"$f":"IF(OFFSET(DE104_3!$AB$35,ROWS($AB$35:AB57)-1,COLUMNS($AB$35:AB57)-1)<>\"\",OFFSET(DE104_3!$AB$35,ROWS($AB$35:AB57)-1,COLUMNS($AB$35:AB57)-1),\"\")","v":""},{"$f":"IF(OFFSET(DE104_3!$AC$35,ROWS($AC$35:AC57)-1,COLUMNS($AC$35:AC57)-1)<>\"\",OFFSET(DE104_3!$AC$35,ROWS($AC$35:AC57)-1,COLUMNS($AC$35:AC57)-1),\"\")","v":""},{"$f":"IF(OFFSET(DE104_3!$AD$35,ROWS($AD$35:AD57)-1,COLUMNS($AD$35:AD57)-1)<>\"\",OFFSET(DE104_3!$AD$35,ROWS($AD$35:AD57)-1,COLUMNS($AD$35:AD57)-1),\"\")","v":""},{"$f":"IF(OFFSET(DE104_3!$AE$35,ROWS($AE$35:AE57)-1,COLUMNS($AE$35:AE57)-1)<>\"\",OFFSET(DE104_3!$AE$35,ROWS($AE$35:AE57)-1,COLUMNS($AE$35:AE57)-1),\"\")","v":""},{"$f":"IF(OFFSET(DE104_3!$AF$35,ROWS($AF$35:AF57)-1,COLUMNS($AF$35:AF57)-1)<>\"\",OFFSET(DE104_3!$AF$35,ROWS($AF$35:AF57)-1,COLUMNS($AF$35:AF57)-1),\"\")","v":""},{"$f":"IF(OFFSET(DE104_3!$AG$35,ROWS($AG$35:AG57)-1,COLUMNS($AG$35:AG57)-1)<>\"\",OFFSET(DE104_3!$AG$35,ROWS($AG$35:AG57)-1,COLUMNS($AG$35:AG57)-1),\"\")","v":""},{"$f":"IF(OFFSET(DE104_3!$AH$35,ROWS($AH$35:AH57)-1,COLUMNS($AH$35:AH57)-1)<>\"\",OFFSET(DE104_3!$AH$35,ROWS($AH$35:AH57)-1,COLUMNS($AH$35:AH57)-1),\"\")","v":""},{"$f":"IF(OFFSET(DE104_3!$AI$35,ROWS($AI$35:AI57)-1,COLUMNS($AI$35:AI57)-1)<>\"\",OFFSET(DE104_3!$AI$35,ROWS($AI$35:AI57)-1,COLUMNS($AI$35:AI57)-1),\"\")","v":""},{"$f":"IF(OFFSET(DE104_3!$AJ$35,ROWS($AJ$35:AJ57)-1,COLUMNS($AJ$35:AJ57)-1)<>\"\",OFFSET(DE104_3!$AJ$35,ROWS($AJ$35:AJ57)-1,COLUMNS($AJ$35:AJ57)-1),\"\")","v":""},{"$f":"IF(OFFSET(DE104_3!$AK$35,ROWS($AK$35:AK57)-1,COLUMNS($AK$35:AK57)-1)<>\"\",OFFSET(DE104_3!$AK$35,ROWS($AK$35:AK57)-1,COLUMNS($AK$35:AK57)-1),\"\")","v":""},{"$f":"IF(OFFSET(DE104_3!$AL$35,ROWS($AL$35:AL57)-1,COLUMNS($AL$35:AL57)-1)<>\"\",OFFSET(DE104_3!$AL$35,ROWS($AL$35:AL57)-1,COLUMNS($AL$35:AL57)-1),\"\")","v":""},{"$f":"IF(OFFSET(DE104_3!$AM$35,ROWS($AM$35:AM57)-1,COLUMNS($AM$35:AM57)-1)<>\"\",OFFSET(DE104_3!$AM$35,ROWS($AM$35:AM57)-1,COLUMNS($AM$35:AM57)-1),\"\")","v":""},{"$f":"IF(OFFSET(DE104_3!$AN$35,ROWS($AN$35:AN57)-1,COLUMNS($AN$35:AN57)-1)<>\"\",OFFSET(DE104_3!$AN$35,ROWS($AN$35:AN57)-1,COLUMNS($AN$35:AN57)-1),\"\")","v":""},{"$f":"IF(OFFSET(DE104_3!$AO$35,ROWS($AO$35:AO57)-1,COLUMNS($AO$35:AO57)-1)<>\"\",OFFSET(DE104_3!$AO$35,ROWS($AO$35:AO57)-1,COLUMNS($AO$35:AO57)-1),\"\")","v":""},{"$f":"IF(OFFSET(DE104_3!$AP$35,ROWS($AP$35:AP57)-1,COLUMNS($AP$35:AP57)-1)<>\"\",OFFSET(DE104_3!$AP$35,ROWS($AP$35:AP57)-1,COLUMNS($AP$35:AP57)-1),\"\")","v":""},{"$f":"IF(OFFSET(DE104_3!$AQ$35,ROWS($AQ$35:AQ57)-1,COLUMNS($AQ$35:AQ57)-1)<>\"\",OFFSET(DE104_3!$AQ$35,ROWS($AQ$35:AQ57)-1,COLUMNS($AQ$35:AQ57)-1),\"\")","v":""}]
[{"$f":"IF(OFFSET(DE104_3!$C$35,ROWS($C$35:C58)-1,COLUMNS($C$35:C58)-1)<>\"\",OFFSET(DE104_3!$C$35,ROWS($C$35:C58)-1,COLUMNS($C$35:C58)-1),\"\")","v":""},{"$f":"IF(OFFSET(DE104_3!$D$35,ROWS($D$35:D58)-1,COLUMNS($D$35:D58)-1)<>\"\",OFFSET(DE104_3!$D$35,ROWS($D$35:D58)-1,COLUMNS($D$35:D58)-1),\"\")","v":""},{"$f":"IF(OFFSET(DE104_3!$E$35,ROWS($E$35:E58)-1,COLUMNS($E$35:E58)-1)<>\"\",OFFSET(DE104_3!$E$35,ROWS($E$35:E58)-1,COLUMNS($E$35:E58)-1),\"\")","v":""},{"$f":"IF(OFFSET(DE104_3!$F$35,ROWS($F$35:F58)-1,COLUMNS($F$35:F58)-1)<>\"\",OFFSET(DE104_3!$F$35,ROWS($F$35:F58)-1,COLUMNS($F$35:F58)-1),\"\")","v":""},{"$f":"IF(OFFSET(DE104_3!$G$35,ROWS($G$35:G58)-1,COLUMNS($G$35:G58)-1)<>\"\",OFFSET(DE104_3!$G$35,ROWS($G$35:G58)-1,COLUMNS($G$35:G58)-1),\"\")","v":""},{"$f":"IF(OFFSET(DE104_3!$H$35,ROWS($H$35:H58)-1,COLUMNS($H$35:H58)-1)<>\"\",OFFSET(DE104_3!$H$35,ROWS($H$35:H58)-1,COLUMNS($H$35:H58)-1),\"\")","v":""},{"$f":"IF(OFFSET(DE104_3!$I$35,ROWS($I$35:I58)-1,COLUMNS($I$35:I58)-1)<>\"\",OFFSET(DE104_3!$I$35,ROWS($I$35:I58)-1,COLUMNS($I$35:I58)-1),\"\")","v":""},{"$f":"IF(OFFSET(DE104_3!$J$35,ROWS($J$35:J58)-1,COLUMNS($J$35:J58)-1)<>\"\",OFFSET(DE104_3!$J$35,ROWS($J$35:J58)-1,COLUMNS($J$35:J58)-1),\"\")","v":""},{"$f":"IF(OFFSET(DE104_3!$K$35,ROWS($K$35:K58)-1,COLUMNS($K$35:K58)-1)<>\"\",OFFSET(DE104_3!$K$35,ROWS($K$35:K58)-1,COLUMNS($K$35:K58)-1),\"\")","v":""},{"$f":"IF(OFFSET(DE104_3!$L$35,ROWS($L$35:L58)-1,COLUMNS($L$35:L58)-1)<>\"\",OFFSET(DE104_3!$L$35,ROWS($L$35:L58)-1,COLUMNS($L$35:L58)-1),\"\")","v":""},{"$f":"IF(OFFSET(DE104_3!$M$35,ROWS($M$35:M58)-1,COLUMNS($M$35:M58)-1)<>\"\",OFFSET(DE104_3!$M$35,ROWS($M$35:M58)-1,COLUMNS($M$35:M58)-1),\"\")","v":""},{"$f":"IF(OFFSET(DE104_3!$N$35,ROWS($N$35:N58)-1,COLUMNS($N$35:N58)-1)<>\"\",OFFSET(DE104_3!$N$35,ROWS($N$35:N58)-1,COLUMNS($N$35:N58)-1),\"\")","v":""},{"$f":"IF(OFFSET(DE104_3!$O$35,ROWS($O$35:O58)-1,COLUMNS($O$35:O58)-1)<>\"\",OFFSET(DE104_3!$O$35,ROWS($O$35:O58)-1,COLUMNS($O$35:O58)-1),\"\")","v":""},{"$f":"IF(OFFSET(DE104_3!$P$35,ROWS($P$35:P58)-1,COLUMNS($P$35:P58)-1)<>\"\",OFFSET(DE104_3!$P$35,ROWS($P$35:P58)-1,COLUMNS($P$35:P58)-1),\"\")","v":""},{"$f":"IF(OFFSET(DE104_3!$Q$35,ROWS($Q$35:Q58)-1,COLUMNS($Q$35:Q58)-1)<>\"\",OFFSET(DE104_3!$Q$35,ROWS($Q$35:Q58)-1,COLUMNS($Q$35:Q58)-1),\"\")","v":""},{"$f":"IF(OFFSET(DE104_3!$R$35,ROWS($R$35:R58)-1,COLUMNS($R$35:R58)-1)<>\"\",OFFSET(DE104_3!$R$35,ROWS($R$35:R58)-1,COLUMNS($R$35:R58)-1),\"\")","v":""},{"$f":"IF(OFFSET(DE104_3!$S$35,ROWS($S$35:S58)-1,COLUMNS($S$35:S58)-1)<>\"\",OFFSET(DE104_3!$S$35,ROWS($S$35:S58)-1,COLUMNS($S$35:S58)-1),\"\")","v":""},{"$f":"IF(OFFSET(DE104_3!$T$35,ROWS($T$35:T58)-1,COLUMNS($T$35:T58)-1)<>\"\",OFFSET(DE104_3!$T$35,ROWS($T$35:T58)-1,COLUMNS($T$35:T58)-1),\"\")","v":""},{"$f":"IF(OFFSET(DE104_3!$U$35,ROWS($U$35:U58)-1,COLUMNS($U$35:U58)-1)<>\"\",OFFSET(DE104_3!$U$35,ROWS($U$35:U58)-1,COLUMNS($U$35:U58)-1),\"\")","v":""},{"$f":"IF(OFFSET(DE104_3!$V$35,ROWS($V$35:V58)-1,COLUMNS($V$35:V58)-1)<>\"\",OFFSET(DE104_3!$V$35,ROWS($V$35:V58)-1,COLUMNS($V$35:V58)-1),\"\")","v":""},{"$f":"IF(OFFSET(DE104_3!$W$35,ROWS($W$35:W58)-1,COLUMNS($W$35:W58)-1)<>\"\",OFFSET(DE104_3!$W$35,ROWS($W$35:W58)-1,COLUMNS($W$35:W58)-1),\"\")","v":""},{"$f":"IF(OFFSET(DE104_3!$X$35,ROWS($X$35:X58)-1,COLUMNS($X$35:X58)-1)<>\"\",OFFSET(DE104_3!$X$35,ROWS($X$35:X58)-1,COLUMNS($X$35:X58)-1),\"\")","v":""},{"$f":"IF(OFFSET(DE104_3!$Y$35,ROWS($Y$35:Y58)-1,COLUMNS($Y$35:Y58)-1)<>\"\",OFFSET(DE104_3!$Y$35,ROWS($Y$35:Y58)-1,COLUMNS($Y$35:Y58)-1),\"\")","v":""},{"$f":"IF(OFFSET(DE104_3!$Z$35,ROWS($Z$35:Z58)-1,COLUMNS($Z$35:Z58)-1)<>\"\",OFFSET(DE104_3!$Z$35,ROWS($Z$35:Z58)-1,COLUMNS($Z$35:Z58)-1),\"\")","v":""},{"$f":"IF(OFFSET(DE104_3!$AA$35,ROWS($AA$35:AA58)-1,COLUMNS($AA$35:AA58)-1)<>\"\",OFFSET(DE104_3!$AA$35,ROWS($AA$35:AA58)-1,COLUMNS($AA$35:AA58)-1),\"\")","v":""},{"$f":"IF(OFFSET(DE104_3!$AB$35,ROWS($AB$35:AB58)-1,COLUMNS($AB$35:AB58)-1)<>\"\",OFFSET(DE104_3!$AB$35,ROWS($AB$35:AB58)-1,COLUMNS($AB$35:AB58)-1),\"\")","v":""},{"$f":"IF(OFFSET(DE104_3!$AC$35,ROWS($AC$35:AC58)-1,COLUMNS($AC$35:AC58)-1)<>\"\",OFFSET(DE104_3!$AC$35,ROWS($AC$35:AC58)-1,COLUMNS($AC$35:AC58)-1),\"\")","v":""},{"$f":"IF(OFFSET(DE104_3!$AD$35,ROWS($AD$35:AD58)-1,COLUMNS($AD$35:AD58)-1)<>\"\",OFFSET(DE104_3!$AD$35,ROWS($AD$35:AD58)-1,COLUMNS($AD$35:AD58)-1),\"\")","v":""},{"$f":"IF(OFFSET(DE104_3!$AE$35,ROWS($AE$35:AE58)-1,COLUMNS($AE$35:AE58)-1)<>\"\",OFFSET(DE104_3!$AE$35,ROWS($AE$35:AE58)-1,COLUMNS($AE$35:AE58)-1),\"\")","v":""},{"$f":"IF(OFFSET(DE104_3!$AF$35,ROWS($AF$35:AF58)-1,COLUMNS($AF$35:AF58)-1)<>\"\",OFFSET(DE104_3!$AF$35,ROWS($AF$35:AF58)-1,COLUMNS($AF$35:AF58)-1),\"\")","v":""},{"$f":"IF(OFFSET(DE104_3!$AG$35,ROWS($AG$35:AG58)-1,COLUMNS($AG$35:AG58)-1)<>\"\",OFFSET(DE104_3!$AG$35,ROWS($AG$35:AG58)-1,COLUMNS($AG$35:AG58)-1),\"\")","v":""},{"$f":"IF(OFFSET(DE104_3!$AH$35,ROWS($AH$35:AH58)-1,COLUMNS($AH$35:AH58)-1)<>\"\",OFFSET(DE104_3!$AH$35,ROWS($AH$35:AH58)-1,COLUMNS($AH$35:AH58)-1),\"\")","v":""},{"$f":"IF(OFFSET(DE104_3!$AI$35,ROWS($AI$35:AI58)-1,COLUMNS($AI$35:AI58)-1)<>\"\",OFFSET(DE104_3!$AI$35,ROWS($AI$35:AI58)-1,COLUMNS($AI$35:AI58)-1),\"\")","v":""},{"$f":"IF(OFFSET(DE104_3!$AJ$35,ROWS($AJ$35:AJ58)-1,COLUMNS($AJ$35:AJ58)-1)<>\"\",OFFSET(DE104_3!$AJ$35,ROWS($AJ$35:AJ58)-1,COLUMNS($AJ$35:AJ58)-1),\"\")","v":""},{"$f":"IF(OFFSET(DE104_3!$AK$35,ROWS($AK$35:AK58)-1,COLUMNS($AK$35:AK58)-1)<>\"\",OFFSET(DE104_3!$AK$35,ROWS($AK$35:AK58)-1,COLUMNS($AK$35:AK58)-1),\"\")","v":""},{"$f":"IF(OFFSET(DE104_3!$AL$35,ROWS($AL$35:AL58)-1,COLUMNS($AL$35:AL58)-1)<>\"\",OFFSET(DE104_3!$AL$35,ROWS($AL$35:AL58)-1,COLUMNS($AL$35:AL58)-1),\"\")","v":""},{"$f":"IF(OFFSET(DE104_3!$AM$35,ROWS($AM$35:AM58)-1,COLUMNS($AM$35:AM58)-1)<>\"\",OFFSET(DE104_3!$AM$35,ROWS($AM$35:AM58)-1,COLUMNS($AM$35:AM58)-1),\"\")","v":""},{"$f":"IF(OFFSET(DE104_3!$AN$35,ROWS($AN$35:AN58)-1,COLUMNS($AN$35:AN58)-1)<>\"\",OFFSET(DE104_3!$AN$35,ROWS($AN$35:AN58)-1,COLUMNS($AN$35:AN58)-1),\"\")","v":""},{"$f":"IF(OFFSET(DE104_3!$AO$35,ROWS($AO$35:AO58)-1,COLUMNS($AO$35:AO58)-1)<>\"\",OFFSET(DE104_3!$AO$35,ROWS($AO$35:AO58)-1,COLUMNS($AO$35:AO58)-1),\"\")","v":""},{"$f":"IF(OFFSET(DE104_3!$AP$35,ROWS($AP$35:AP58)-1,COLUMNS($AP$35:AP58)-1)<>\"\",OFFSET(DE104_3!$AP$35,ROWS($AP$35:AP58)-1,COLUMNS($AP$35:AP58)-1),\"\")","v":""},{"$f":"IF(OFFSET(DE104_3!$AQ$35,ROWS($AQ$35:AQ58)-1,COLUMNS($AQ$35:AQ58)-1)<>\"\",OFFSET(DE104_3!$AQ$35,ROWS($AQ$35:AQ58)-1,COLUMNS($AQ$35:AQ58)-1),\"\")","v":""}]

{"sheet":"PrintSheetTemplate","index":4,"n_rows":95,"n_cols":179,"rows_kept":95,"cut":false,"hidden":true,"merged":[[93,171,93,178],[94,1,94,178],[93,101,93,106],[93,107,93,118],[93,119,93,148],[93,149,93,158],[93,159,93,164],[93,165,93,170],[93,1,93,7],[93,8,93,14],[93,15,93,21],[93,22,93,30],[93,31,93,64],[93,65,93,100]]}
[" "]
[]
[]
[]
[]
[]
[]
[]
[]
[]
[]
[]
[]
[]
[]
[]
[]
[]
[]
[]
[]
[]
[]
[]
[]
[]
[]
[]
[]
[]
[]
[]
[]
[]
[]
[]
[]
[]
[]
[]
[]
[]
[]
[]
[]
[]
[]
[]
[]
[]
[]
[]
[]
[]
[]
[]
[]
[]
[]
[]
[]
[]
[]
[]
[]
[]
[]
[]
[]
[]
[]
[]
[]
[]
[]
[]
[]
[]
[]
[]
[]
[]
[]
[]
[]
[]
[]
[]
[]
[]
[]
[]
[null,"","","","","","","","","","","","","","","","","","","","","","","","","","","","","","","","","","","","","","","","","","","","","","","","","","","","","","","","","","","","","","","","","","","","","","","","","","","","","","","","","","","","","","","","","","","","","","","","","","","","","","","","","","","","","","","","","","","","","","","","","","","","","","","","","","","","","","","","","","","","","","","","","","","","","","","",null,"","","","","","","","","","","","","","","","","","","","","","","","","",""]
[null,"FILE NO.",null,null,null,null,null,null,{"$f":"IF(ProjectInformation!$B$11<>\"\",ProjectInformation!$B$11,\"\")","v":""},null,null,null,null,null,null,{"$f":"UPPER(ProjectInformation!$B$8)","v":"ENGLISH"},null,null,null,null,null,null,"DESIGN TEAM",null,null,null,null,null,null,null,null,{"$f":"IF(AND(ProjectInformation!$B$3<>\"\",ProjectInformation!$B$4<>\"\",ProjectInformation!$B$5<>\"\"),ProjectInformation!$B$3&\"\\\"&ProjectInformation!$B$4&\"\\\"&ProjectInformation!$B$5,IF(AND(ProjectInformation!$B$3<>\"\",ProjectInformation!$B$4<>\"\"),ProjectInformation!$B$3&\"\\\"&ProjectInformation!$B$4,IF(ProjectInformation!$B$3<>\"\",ProjectInformation!$B$3,\"\")))","v":"Flattery\\Johnson"},null,null,null,null,null,null,null,null,null,null,null,null,null,null,null,null,null,null,null,null,null,null,null,null,null,null,null,null,null,null,null,null,null,{"$f":"IF(ProjectInformation!$B$6<>\"\",ProjectInformation!$B$6,\"\")","v":"TAMA"},null,null,null,null,null,null,null,null,null,null,null,null,null,null,null,null,null,null,null,null,null,null,null,null,null,null,null,null,null,null,null,null,null,null,null,"COUNTY",null,null,null,null,null,"PROJECT NUMBER",null,null,null,null,null,null,null,null,null,null,null,{"$f":"IF(ProjectInformation!$B$7<>\"\",ProjectInformation!$B$7,\"\")","v":"NHSX-030-6(189)--3H-86"},null,null,null,null,null,null,null,null,null,null,null,null,null,null,null,null,null,null,null,null,null,null,null,null,null,null,null,null,null,"SHEET NUMBER",null,null,null,null,null,null,null,null,null,null,null,null,null,null,null,{"$f":"IF(FP94<>\"\",\"REVISED\",\"\")","v":"REVISED"},null,null,null,null,null,{"$f":"IF(ProjectInformation!$B$9<>\"\",ProjectInformation!$B$9,\"\")","v":"2018-06-08"}]
[""]

{"sheet":"Note1","index":5,"n_rows":1,"n_cols":1,"rows_kept":1,"cut":false,"hidden":true,"merged":[[0,0,2,0]]}
["SEE V SHEETS FOR ADDITIONAL BID ITEMS AND QUANTITIES"]

{"sheet":"BridgeBlock","index":6,"n_rows":4,"n_cols":14,"rows_kept":4,"cut":false,"hidden":true,"merged":[[2,2,2,8],[3,2,3,7],[2,9,2,12],[3,8,3,12]]}
[2]
[null,"","","","","","","","","","","","",""]
[null,null,"Design No.",null,null,null,null,null,null,{"$f":"IF(#REF!<>\"\",#REF!,\"\")","v":{"$error":"#REF!"}}]
[null,null,"File No.",null,null,null,null,null,{"$f":"IF(#REF!<>\"\",#REF!,\"\")","v":{"$error":"#REF!"}}]

{"sheet":"Index","index":7,"n_rows":164,"n_cols":15,"rows_kept":164,"cut":false,"hidden":true,"merged":[]}
["100-0A","1997-10-28","4.5.6","ADAIR",null,"Live English File Path","W:\\Highway\\Design\\RoadDesignDetails\\ExcelTabs\\",null,"Brian R. Smith","bsmith2","Methods","ROADWAY DESIGN",null,"104_3(1)","='104_3'!$A$1:$AO$44"]
["100-1A","1997-07-15","10/01/15","ADAMS",null,"Live Metric File Path","W:\\Highway\\Design\\RoadDesignDetails\\ExcelTabs\\MetricTabs\\",null,"Khyle B. Clute","kclute","Methods","ROADWAY DESIGN"]
["100-1C","2012-04-17","CD","ALLAMAKEE",null,"Index File Path","W:\\Highway\\Design\\RoadDesignDetails\\PDFsandWebFiles\\Indexes\\",null,"Thomas M. Hamski","thamski","Methods","ROADWAY DESIGN"]
["100-1D","2005-10-18",null,"APPANOOSE",null,"Index File Name","TNT_EnglishIndexes.xlsx",null,"Wesley L. Mayberry","wmayber","Methods","ROADWAY DESIGN"]
["100-4A","2002-10-29",null,"AUDUBON",null,"Last Revision English File Path","W:\\Highway\\Design\\RoadDesignDetails\\Old_Details\\ExcelTabs\\",null,"John M. Narigon","jnarigo","Methods","ROADWAY DESIGN"]
["100-7","2012-10-16",null,"BENTON",null,"Last Revision Metric File Path","W:\\Highway\\Design\\RoadDesignDetails\\Old_Details\\ExcelTabs\\MetricTabs\\",null,"Christopher Poole","cpoole","Methods","ROADWAY DESIGN"]
["100-10","2011-10-18",null,"BLACK HAWK",null,"Seed Path","W:\\Highway\\Design\\CADD\\SpreadSheets\\ExcelTabulations.xltm",null,"Daniel J. Harness","dharnes","Methods","ROADWAY DESIGN"]
["100-11","2008-08-01",null,"BOONE",null,"VersionCheck Path","W:\\Highway\\Design\\CADD\\SpreadSheets\\ExcelTabulations.xlsm",null,"Jason M. Holst","jholst","Road1","ROADWAY DESIGN"]
["100-12","2008-08-01",null,"BREMER",null,"Standard Road Plan Path","W:\\Highway\\Design\\StandardRoadPlans\\PDFsAndWebFiles\\Indexes\\SRP_EnglishIndex.xls",null,"Jason R. Strum","jstrum","Road1","ROADWAY DESIGN"]
["100-12A","2008-08-01",null,"BUCHANAN",null,"Last Revision Standard Road Plan Path","W:\\Highway\\Design\\StandardRoadPlans\\PDFsAndWebFiles\\Old_Indexes\\SRP_EnglishIndex.xls",null,"Robert A. Schoenrock","rschoen","Road1","ROADWAY DESIGN"]
["100-13","2010-04-20",null,"BUENA VISTA",null,"AddIn Path","W:\\Highway\\Design\\CADD\\SpreadSheets\\ExcelTabulations.xlam",null,"Stacy M. Ryan","sryan","Road1","ROADWAY DESIGN"]
["100-14","2010-04-20",null,"BUTLER",null,"Old Files Path","W:\\Highway\\Design\\RoadDesignDetails\\Old_Details\\ExcelTabs\\",null,"Nathan A. Thede","nthede","Road1","ROADWAY DESIGN"]
["100-15","2010-04-20",null,"CALHOUN",null,null,null,null,"Yanxiao Jia","yjia","Road2","ROADWAY DESIGN"]
["100-16","2010-10-19",null,"CARROLL",null,null,null,null,"Ryan R. Miller","rmille3","Road2","ROADWAY DESIGN"]
["100-17","2010-04-20",null,"CASS",null,null,null,null,"Dustin T. Skogerboe","dskoge2","Road2","ROADWAY DESIGN"]
["100-18","2010-04-20",null,"CEDAR",null,null,null,null,"Dung T. Ta","dta","Road2","ROADWAY DESIGN"]
["100-19","2012-10-16",null,"CERRO GORDO",null,null,null,null,"Allison L. P. Smyth","asmyth","Road2","ROADWAY DESIGN"]
["100-20","2008-08-01",null,"CHEROKEE",null,null,null,null,"Paul W. Flattery","pflatte","Road3","ROADWAY DESIGN"]
["100-21","2008-08-01",null,"CHICKASAW",null,null,null,null,"Kelly C. Bell","kbell","Road3","ROADWAY DESIGN"]
["100-22","2008-08-01",null,"CLARKE",null,null,null,null,"Angela K. Johnson","ajohns1","Road3","ROADWAY DESIGN"]
["100-23","2010-10-19",null,"CLAY",null,null,null,null,"Elijah D. Gansen","egansen","Road3","ROADWAY DESIGN"]
["100-24","2013-04-16",null,"CLAYTON",null,null,null,null,"James R. Schoenrock","jschoen","Consultant","ROADWAY DESIGN"]
["100-26","2008-08-01",null,"CLINTON",null,null,null,null,"Randall E. Schlei","rschlie","Consultant","ROADWAY DESIGN"]
["100-27","2009-10-20",null,"CRAWFORD",null,null,null,null,"Mark D. Mastellar","mmastel","Roadside","ROADWAY DESIGN"]
["100-28","2010-10-19",null,"DALLAS",null,null,null,null,"Robert L. Stanley","rstanle","Soils","GEOTECHNICAL DESIGN"]
["101-4","2002-04-30",null,"DAVIS",null,null,null,null,"Stephen J. Megivern","smegive","Soils","GEOTECHNICAL DESIGN"]
["101-5","2002-04-30",null,"DECATUR",null,null,null,null,"Mark A. Dell","mdell","Soils","GEOTECHNICAL DESIGN"]
["101-6","2002-04-30",null,"DELAWARE",null,null,null,null,"David R. Claman","dclaman","Bridge","HYDRAULIC DESIGN"]
["101-7","2002-04-30",null,"DES MOINES",null,null,null,null,"Zachary K. Abrams","zabrams","TrafficAndSafety","ROADWAY DESIGN"]
["101-8","2013-04-16",null,"DICKINSON"]
["101-13","2004-04-20",null,"DUBUQUE"]
["101-16","2009-10-20",null,"EMMET"]
["101-17","2011-04-19",null,"FAYETTE"]
["101-18","2011-04-19",null,"FLOYD"]
["102-3","2013-04-16",null,"FRANKLIN"]
["102-4","2011-10-18",null,"FREMONT"]
["102-5","2012-10-16",null,"GREENE"]
["102-5A","2008-08-01",null,"GRUNDY"]
["102-6C","2011-10-18",null,"GUTHRIE"]
["102-10","2008-08-01",null,"HAMILTON"]
["102-11","2008-08-01",null,"HANCOCK"]
["102-12","2008-08-01",null,"HARDIN"]
["102-14","2012-04-17",null,"HARRISON"]
["102-15","2008-08-01",null,"HENRY"]
["103-1","2010-10-19",null,"HOWARD"]
["103-3","2012-10-16",null,"HUMBOLDT"]
["103-4","2011-04-19",null,"IDA"]
["103-5","2008-08-01",null,"IOWA"]
["103-6","2011-04-19",null,"JACKSON"]
["103-7","2008-08-01",null,"JASPER"]
["104-3","2012-10-16",null,"JEFFERSON"]
["104-4","2009-10-20",null,"JOHNSON"]
["104-5A","2011-10-18",null,"JONES"]
["104-5B","2011-10-18",null,"KEOKUK"]
["104-5C","2012-04-17",null,"KOSSUTH"]
["104-8","2008-08-01",null,"LEE"]
["104-8A","2010-04-20",null,"LINN"]
["104-9","2012-04-17",null,"LOUISA"]
["104-10","2008-08-01",null,"LUCAS"]
["104-11","2008-08-01",null,"LYON"]
["104-12","2012-10-16",null,"MADISON"]
["104-13","2013-04-16",null,"MAHASKA"]
["105-1","1994-09-27",null,"MARION"]
["105-3","2005-10-18",null,"MARSHALL"]
["105-4","2011-10-18",null,"MILLS"]
["106-1","2008-08-01",null,"MITCHELL"]
["106-2","2008-08-01",null,"MONONA"]
["106-3","2008-08-01",null,"MONROE"]
["106-4","2013-04-16",null,"MONTGOMERY"]
["106-5","2008-08-01",null,"MUSCATINE"]
["106-7","2008-08-01",null,"O'BRIEN"]
["106-8","2011-04-19",null,"OSCEOLA"]
["107-7","2008-08-01",null,"PAGE"]
["107-22","2013-04-16",null,"PALO ALTO"]
["107-23","2011-10-18",null,"PLYMOUTH"]
["107-24","2008-08-01",null,"POCAHONTAS"]
["107-25","2008-08-01",null,"POLK"]
["107-29","2012-04-17",null,"POTTAWATTAMIE"]
["107-30","2012-04-17",null,"POWESHIEK"]
["107-31","2011-04-19",null,"RINGGOLD"]
["108-1","2008-08-01",null,"SAC"]
["108-2","2008-08-01",null,"SCOTT"]
["108-2A","2008-08-01",null,"SHELBY"]
["108-8A","2010-10-19",null,"SIOUX"]
["108-8B","2011-10-18",null,"STORY"]
["108-8C","2011-10-18",null,"TAMA"]
["108-8D","2010-10-19",null,"TAYLOR"]
["108-9A","2010-04-20",null,"UNION"]
["108-11A","2008-08-01",null,"VAN BUREN"]
["108-12","2008-08-01",null,"WAPELLO"]
["108-13A","2008-08-01",null,"WARREN"]
["108-15","2008-08-01",null,"WASHINGTON"]
["108-16","2010-10-19",null,"WAYNE"]
["108-18","2011-10-18",null,"WEBSTER"]
["108-18B","2012-10-16",null,"WINNEBAGO"]
["108-22","2013-04-16",null,"WINNESHIEK"]
["108-23A","2008-08-01",null,"WOODBURY"]
["108-24","2011-04-19",null,"WORTH"]
["108-26A","2008-08-01",null,"WRIGHT"]
["108-27","2012-10-16"]
["108-28","2008-08-01",null,"SeriesList.xlsx"]
["108-29","2012-10-16"]
["108-30","2013-04-16"]
["108-33","2013-04-16"]
["108-34","2010-10-19"]
["108-35","2012-04-17"]
["110-1","2013-04-16"]
["110-2","2013-04-16"]
["110-3","2008-08-01"]
["110-4","2008-08-01"]
["110-5","2008-08-01"]
["110-6","2008-08-01"]
["110-7A","2012-04-17"]
["110-7B","2010-10-19"]
["110-8","2008-08-01"]
["110-9","2011-10-18"]
["110-10","2008-08-01"]
["110-11","2008-08-01"]
["110-12A","2013-04-16"]
["110-13","2010-04-20"]
["110-14","2013-04-16"]
["110-15","2013-04-16"]
["110-16","2013-04-16"]
["111-1","2012-04-17"]
["111-2","1989-02-28"]
["111-23","2002-10-29"]
["111-25","2011-10-18"]
["112-3","2013-04-16"]
["112-5","2008-08-01"]
["112-6","2013-04-16"]
["112-7","2010-10-19"]
["112-8","2012-10-16"]
["112-9","2012-04-17"]
["112-10","2011-04-19"]
["113-1","2013-04-16"]
["113-2","2013-04-16"]
["113-3","2011-10-18"]
["113-10","2012-10-16"]
["213-2","2011-10-18"]
["213-3","2011-10-18"]
["231-1","2011-10-18"]
["231-2","2012-10-16"]
["232-3A","2012-10-16"]
["232-3B","2012-10-16"]
["232-3C","2012-10-16"]
["232-3D","2012-10-16"]
["232-4","2011-10-18"]
["232-6","2011-10-18"]
["232-7","2012-10-16"]
["232-9","2011-10-18"]
["232-11","2012-10-16"]
["241-5","2011-10-18"]
["252-1","2012-10-16"]
["253-1","2011-10-18"]
["254-1","2001-10-02"]
["262-3","2012-10-16"]
["262-4","2013-04-16"]
["262-5","2005-10-18"]
["262-6","2005-10-18"]
["263-1","2011-10-18"]
["271-1","2011-10-18"]
["271-2","1985-08-20"]
["271-4","2011-10-18"]
["271-9","1994-09-27"]